Jump to content
Search In
  • More options...
Find results that contain...
Find results in...

1.7.10 forgegradle keeps failing builds


RubyEmerald
 Share

Recommended Posts

i am a 1.12.2 forge mod maker and when i try to build the mod it says build fail or somethin heres my code.

 

 

 

 

 

 

 

 

 

 

Last login: Sat Jul 10 21:13:27 on ttys000

cd desktop

cd codakid

cd ""^[[D/Users/iMac/.nvm/versions/io.js/v3.3.1/lib/node_modules/npm/bin/npm-cli.js:85

      let notifier = require('update-notifier')({pkg})

      ^^^

 

SyntaxError: Block-scoped declarations (let, const, function, class) not yet supported outside strict mode

    at exports.runInThisContext (vm.js:53:16)

    at Module._compile (module.js:413:25)

    at Object.Module._extensions..js (module.js:448:10)

    at Module.load (module.js:355:32)

    at Function.Module._load (module.js:310:12)

    at Function.Module.runMain (module.js:471:10)

    at startup (node.js:117:18)

    at node.js:951:3

nvm is not compatible with the npm config "prefix" option: currently set to ""

Run `npm config delete prefix` or `nvm use --delete-prefix iojs-v3.3.1 --silent` to unset it.

iMacs-iMac:~ iMac$ cd desktop

iMacs-iMac:desktop iMac$ cd codakid

iMacs-iMac:codakid iMac$ cd "COdakid mod creation 1"

iMacs-iMac:COdakid mod creation 1 iMac$ cd "emerald tools and combat"

-bash: cd: emerald tools and combat: No such file or directory

iMacs-iMac:COdakid mod creation 1 iMac$ cd project

-bash: cd: project: No such file or directory

iMacs-iMac:COdakid mod creation 1 iMac$ cd projects

iMacs-iMac:projects iMac$ cd "emerald tools and combat"

iMacs-iMac:emerald tools and combat iMac$ ./gradlew build

To honour the JVM settings for this build a new JVM will be forked. Please consider using the daemon: https://docs.gradle.org/2.14/userguide/gradle_daemon.html.

 

FAILURE: Build failed with an exception.

 

* Where:

Build file '/Users/iMac/Desktop/Codakid/Codakid Mod Creation 1/projects/Emerald Tools And combat/build.gradle' line: 25

 

* What went wrong:

A problem occurred evaluating root project 'Emerald Tools And combat'.

> Could not set unknown property 'runDir' for root project 'Emerald Tools And combat' of type org.gradle.api.Project.

 

* Try:

Run with --stacktrace option to get the stack trace. Run with --info or --debug option to get more log output.

 

BUILD FAILED

 

Total time: 5.268 secs

iMacs-iMac:emerald tools and combat iMac$ ./gradlew build

 

FAILURE: Build failed with an exception.

 

* Where:

Build file '/Users/iMac/Desktop/Codakid/Codakid Mod Creation 1/projects/Emerald Tools And combat/build.gradle' line: 25

 

* What went wrong:

A problem occurred evaluating root project 'Emerald Tools And combat'.

> Could not set unknown property 'runDir' for root project 'Emerald Tools And combat' of type org.gradle.api.Project.

 

* Try:

Run with --stacktrace option to get the stack trace. Run with --info or --debug option to get more log output.

 

BUILD FAILED

 

Total time: 4.973 secs

iMacs-iMac:emerald tools and combat iMac$ 

Link to comment
Share on other sites

The problem is here:

version = "1.7.10-10.13.0.1187"
    runDir = "run"
    
    // the mappings can be changed at any time, and must be in the following format.
    // snapshot_YYYYMMDD   snapshot are built nightly.
    // stable_#            stables are built at the discretion of the MCP team.
    // Use non-default mappings at your own risk. they may not always work.
    // simply re-run your setup task after changing the mappings to update your workspace.
    mappings = "snapshot_20171003"
    // makeObfSourceJar = false // an Srg named sources jar is made by default. uncomment this to disable.

This should be:

minecraft {
    version = "1.7.10-10.13.0.1187"
    runDir = "run"
    
    // the mappings can be changed at any time, and must be in the following format.
    // snapshot_YYYYMMDD   snapshot are built nightly.
    // stable_#            stables are built at the discretion of the MCP team.
    // Use non-default mappings at your own risk. they may not always work.
    // simply re-run your setup task after changing the mappings to update your workspace.
    mappings = "snapshot_20171003"
    // makeObfSourceJar = false // an Srg named sources jar is made by default. uncomment this to disable.
}

 

  • Like 1
Link to comment
Share on other sites

Guest
This topic is now closed to further replies.
 Share



  • Recently Browsing

    No registered users viewing this page.

  • Posts

    • Ran again after I got up, had a different error: PS C:\Users\user\Desktop\MinecraftForge> ./gradlew setup To honour the JVM settings for this build a single-use Daemon process will be forked. See https://docs.gradle.org/7.2/userguide/gradle_daemon.html#sec:disabling_the_daemon. Daemon will be stopped at the end of the build > Configure project : Version: 1.17.1-37.0.61 Java: 1.8.0_291 JVM: 25.291-b10(Oracle Corporation) Arch: amd64 > Configure project :clean WARNING: This project is configured to use the official obfuscation mappings provided by Mojang. These mapping fall under their associated license, you should be fully aware of this license. For the latest license text, refer below, or the reference copy here: https://github.com/MinecraftForge/MCPConfig/blob/master/Mojang.md, You can hide this warning by running the `hideOfficialWarningUntilChanged` task WARNING: (c) 2020 Microsoft Corporation. These mappings are provided "as-is" and you bear the risk of using them. You may copy and use the mappings for development purposes, but you may not redistribute the mappings complete and unmodified. Microsoft makes no warranties, express or implied, with respect to the mappings provided here. Use and modification of this document or the source code (in any form) of Minecraft: Java Edition is governed by the Minecraft End User License Agreement available at https://account.mojang.com/documents/minecraft_eula. FAILURE: Build failed with an exception. * Where: Build file 'C:\Users\user\Desktop\MinecraftForge\fmlcore\build.gradle' line: 7 * What went wrong: A problem occurred evaluating project ':fmlcore'. > java.lang.UnsupportedClassVersionError: org/javamodularity/moduleplugin/ModuleSystemPlugin has been compiled by a more recent version of the Java Runtime (class file version 55.0), this version of the Java Runtime only recognizes class file versions up to 52.0 * Try: Run with --stacktrace option to get the stack trace. Run with --info or --debug option to get more log output. Run with --scan to get full insights. * Get more help at https://help.gradle.org BUILD FAILED in 21s 2 actionable tasks: 2 up-to-date  
    • Here's a shot of where I'd expect to find it. There's one older forge version that appears at the bottom of the list, so I checked its entire length to be sure.  
    • Hi!, I'm trying to set up a workspace for a 1.17 mod. I want to port a 1.16.5 mod I already have, but first I wanted to try to set up a new empty mod, just to assure it works. The problem is when I run genEclipseRuns, it throws me FAILURE: Build failed with an exception. * What went wrong: Could not resolve all files for configuration ':runtimeClasspathCopy'. > Could not find net.minecraftforge:forge:1.17.1-37.0.61_mapped_official_1.17.1. Searched in the following locations: - file:/C:/Users/migue/.gradle/caches/forge_gradle/bundeled_repo/net/minecraftforge/forge/1.17.1-37.0.61_mapped_official_1.17.1/forge-1.17.1-37.0.61_mapped_official_1.17.1.pom - file:/C:/Users/migue/.gradle/caches/forge_gradle/bundeled_repo/net/minecraftforge/forge/1.17.1-37.0.61_mapped_official_1.17.1/forge-1.17.1-37.0.61_mapped_official_1.17.1.jar Required by: project : * Try: Run with --stacktrace option to get the stack trace. Run with --info or --debug option to get more log output. Run with --scan to get full insights. * Get more help at https://help.gradle.org Deprecated Gradle features were used in this build, making it incompatible with Gradle 8.0. You can use '--warning-mode all' to show the individual deprecation warnings and determine if they come from your own scripts or plugins. See https://docs.gradle.org/7.2/userguide/command_line_interface.html#sec:command_line_warnings BUILD FAILED in 24s I have OpenJDK16, and the Path and JAVA_HOME variables correctly set. I'm using the default mdk, so I didn't change anything from build.gradle Any help is appreciated, I've been stucked with this for hours
    • I'm new to Java and modding, so I went to the tutorial on https://mcforge.readthedocs.io/en/1.16.x/gettingstarted/ but I already am facing issues. I followed the guide up until step 6, at which point when I run "gradlew enIntellijRuns" I get an error which reads "Could not find net.minecraftforge:forge:1.16.5-36.2.0_mapped_official_1.16.5.". Do any knowledgable modders know what this means and how to fix it? Log: https://pastebin.com/vt9VgLPz Please let me know if I need to supply any additional information such as further logs or screenshots.
    • I will check out how chests work and see if I can figure a couple things from that, meanwhile ignore the fact I just table flipped on setBlock doing one thing, but not with blockpos.offset wow this change from 1.7 to 1.17 is making me feel dumb Lol Edit: yup nope lack of sleep derp for that Lol Oh well
  • Topics

  • Who's Online (See full list)

×
×
  • Create New...

Important Information

By using this site, you agree to our Privacy Policy.