Jump to content
Search In
  • More options...
Find results that contain...
Find results in...

Problems installing latest forge source


Recommended Posts

I have a similar problem except that the message I get is:

 

FAILURE: Could not determine which tasks to execute.

* What went wrong:

Task 'setupDevWorkspace' not found in root project 'ForgeGradle-Master'.

 

* Try:

Run gradlew tasks to get a list of available tasks.

 

BUILD FAILED

 

Total time: 2.755 secs

 

 

Link to post
Share on other sites

I have a similar problem except that the message I get is:

 

FAILURE: Could not determine which tasks to execute.

* What went wrong:

Task 'setupDevWorkspace' not found in root project 'ForgeGradle-Master'.

 

* Try:

Run gradlew tasks to get a list of available tasks.

 

BUILD FAILED

 

Total time: 2.755 secs

 

thats is a very different problem.. not similair at all...

anyways.. you are trying to do your commands in a folder where there is no build.gradle file. you must be in the same directory as the build.gradle file.

 

Link to post
Share on other sites

Join the conversation

You can post now and register later. If you have an account, sign in now to post with your account.

Guest
Reply to this topic...

×   Pasted as rich text.   Restore formatting

  Only 75 emoji are allowed.

×   Your link has been automatically embedded.   Display as a link instead

×   Your previous content has been restored.   Clear editor

×   You cannot paste images directly. Upload or insert images from URL.

×
×
  • Create New...

Important Information

By using this site, you agree to our Privacy Policy.