Jump to content
Search In
  • More options...
Find results that contain...
Find results in...

Cant reob 1.7


DCM_rox
 Share

Recommended Posts

I keep getting this message any help would be appreciated.

 

 

:compileJavawarning: [options] bootstrap class path not set in conjunction with -source 1.6

C:\Users\DCM\Desktop\MCP\1.7.2-BlocksOnly\build\sources\java\com\dcm\opalsplus\BlockBlackopal.java:8: error: package net.minecraftforge does not exist

import net.minecraftforge.*;

^

C:\Users\DCM\Desktop\MCP\1.7.2-BlocksOnly\build\sources\java\com\dcm\opalsplus\BlockBlackore.java:9: error: package net.minecraftforge does not exist

import net.minecraftforge.*;

^

C:\Users\DCM\Desktop\MCP\1.7.2-BlocksOnly\build\sources\java\com\dcm\opalsplus\opalsplus.java:12: error: package net.minecraftforge does not exist

import net.minecraftforge.*;

^

3 errors

1 warning

FAILED

 

FAILURE: Build failed with an exception.

 

* What went wrong:

Execution failed for task ':compileJava'.

> Compilation failed; see the compiler error output for details.

 

* Try:

Run with --stacktrace option to get the stack trace. Run with --info or --debug option to get more log output.

 

BUILD FAILED

 

Total time: 10.512 secs

 

 

Link to comment
Share on other sites

error: package net.minecraftforge does not exist

Don't PM me with questions. They will be ignored! Make a thread on the appropriate board for support.

 

1.12 -> 1.13 primer by williewillus.

 

1.7.10 and older versions of Minecraft are no longer supported due to it's age! Update to the latest version for support.

 

http://www.howoldisminecraft1710.today/

Link to comment
Share on other sites

WOW read 46 times and not 1 bit of help.  Well thanks guys looks like the death of another mod . Countless hours wasted prob over a small thing. I have no Idea why this is called modder support, Thanks again for all the help.

Link to comment
Share on other sites

Excuse me...  I have provided the whole log file and I "obviously " did nothing wrong.  I followed Lexs' tutorial.  I really need someone who knows what they are saying to give me some insight into this error.  I have searched the net about it and reinstalled java and set it up. Also tried the build on 2 other computers to no avail.

Link to comment
Share on other sites

Then if you did nothing wrong, this is working as expected.

Seriously.

 

> Compilation failed; see the compiler error output for details.

 

* Try:

Run with --stacktrace option to get the stack trace. Run with --info or --debug option to get more log output.

Details.

Link to comment
Share on other sites

This is it with the stacktrace option.  Thanks for taking the time and finally making sense.  This is the latest forge running and I dont think I'm importing all of forge it telling me to but I only imported what I needed.  When I was told to i added the import but it made no difference.

 

 

 

 

****************************

Powered By MCP:           

http://mcp.ocean-labs.de/ 

Searge, ProfMobius, Fesh0r,

R4wk, ZeuX, IngisKahn     

MCP Data version : unknown

****************************

C:\Users\DCM\Desktop\MCP\1.7.2-BlocksOnly\build\natives

:compileApiJava UP-TO-DATE

:processApiResources UP-TO-DATE

:apiClasses UP-TO-DATE

:sourceMainJava UP-TO-DATE

:compileJavawarning: [options] bootstrap class path not set in conjunction with -source 1.6

C:\Users\DCM\Desktop\MCP\1.7.2-BlocksOnly\build\sources\java\com\dcm\opalsplus\BlockBlackopal.java:8: error: package net.minecraftforge does not exist

import net.minecraftforge.*;

^

C:\Users\DCM\Desktop\MCP\1.7.2-BlocksOnly\build\sources\java\com\dcm\opalsplus\BlockBlackore.java:9: error: package net.minecraftforge does not exist

import net.minecraftforge.*;

^

2 errors

1 warning

FAILED

 

FAILURE: Build failed with an exception.

 

* What went wrong:

Execution failed for task ':compileJava'.

> Compilation failed; see the compiler error output for details.

 

* Try:

Run with --info or --debug option to get more log output.

 

* Exception is:

org.gradle.api.tasks.TaskExecutionException: Execution failed for task ':compileJava'.

at org.gradle.api.internal.tasks.execution.ExecuteActionsTaskExecuter.executeActions(ExecuteActionsTaskExecuter.java:69)

at org.gradle.api.internal.tasks.execution.ExecuteActionsTaskExecuter.execute(ExecuteActionsTaskExecuter.java:46)

at org.gradle.api.internal.tasks.execution.PostExecutionAnalysisTaskExecuter.execute(PostExecutionAnalysisTaskExecuter.java:35)

at org.gradle.api.internal.tasks.execution.SkipUpToDateTaskExecuter.execute(SkipUpToDateTaskExecuter.java:64)

at org.gradle.api.internal.tasks.execution.ValidatingTaskExecuter.execute(ValidatingTaskExecuter.java:58)

at org.gradle.api.internal.tasks.execution.SkipEmptySourceFilesTaskExecuter.execute(SkipEmptySourceFilesTaskExecuter.java:42)

at org.gradle.api.internal.tasks.execution.SkipTaskWithNoActionsExecuter.execute(SkipTaskWithNoActionsExecuter.java:52)

at org.gradle.api.internal.tasks.execution.SkipOnlyIfTaskExecuter.execute(SkipOnlyIfTaskExecuter.java:53)

at org.gradle.api.internal.tasks.execution.ExecuteAtMostOnceTaskExecuter.execute(ExecuteAtMostOnceTaskExecuter.java:43)

at org.gradle.api.internal.AbstractTask.executeWithoutThrowingTaskFailure(AbstractTask.java:289)

at org.gradle.execution.taskgraph.AbstractTaskPlanExecutor$TaskExecutorWorker.executeTask(AbstractTaskPlanExecutor.java:79)

at org.gradle.execution.taskgraph.AbstractTaskPlanExecutor$TaskExecutorWorker.processTask(AbstractTaskPlanExecutor.java:63)

at org.gradle.execution.taskgraph.AbstractTaskPlanExecutor$TaskExecutorWorker.run(AbstractTaskPlanExecutor.java:51)

at org.gradle.execution.taskgraph.DefaultTaskPlanExecutor$1.run(DefaultTaskPlanExecutor.java:33)

at org.gradle.internal.Factories$1.create(Factories.java:22)

at org.gradle.cache.internal.DefaultCacheAccess.longRunningOperation(DefaultCacheAccess.java:198)

at org.gradle.cache.internal.DefaultCacheAccess.longRunningOperation(DefaultCacheAccess.java:266)

at org.gradle.cache.internal.DefaultPersistentDirectoryStore.longRunningOperation(DefaultPersistentDirectoryStore.java:135)

at org.gradle.api.internal.changedetection.state.DefaultTaskArtifactStateCacheAccess.longRunningOperation(DefaultTaskArtifactStateCacheAccess.java:95)

at org.gradle.execution.taskgraph.DefaultTaskPlanExecutor.process(DefaultTaskPlanExecutor.java:31)

at org.gradle.execution.taskgraph.DefaultTaskGraphExecuter.execute(DefaultTaskGraphExecuter.java:86)

at org.gradle.execution.SelectedTaskExecutionAction.execute(SelectedTaskExecutionAction.java:29)

at org.gradle.execution.DefaultBuildExecuter.execute(DefaultBuildExecuter.java:61)

at org.gradle.execution.DefaultBuildExecuter.access$200(DefaultBuildExecuter.java:23)

at org.gradle.execution.DefaultBuildExecuter$2.proceed(DefaultBuildExecuter.java:67)

at org.gradle.execution.DryRunBuildExecutionAction.execute(DryRunBuildExecutionAction.java:32)

at org.gradle.execution.DefaultBuildExecuter.execute(DefaultBuildExecuter.java:61)

at org.gradle.execution.DefaultBuildExecuter.execute(DefaultBuildExecuter.java:54)

at org.gradle.initialization.DefaultGradleLauncher.doBuildStages(DefaultGradleLauncher.java:166)

at org.gradle.initialization.DefaultGradleLauncher.doBuild(DefaultGradleLauncher.java:113)

at org.gradle.initialization.DefaultGradleLauncher.run(DefaultGradleLauncher.java:81)

at org.gradle.launcher.exec.InProcessBuildActionExecuter$DefaultBuildController.run(InProcessBuildActionExecuter.java:64)

at org.gradle.launcher.cli.ExecuteBuildAction.run(ExecuteBuildAction.java:33)

at org.gradle.launcher.cli.ExecuteBuildAction.run(ExecuteBuildAction.java:24)

at org.gradle.launcher.exec.InProcessBuildActionExecuter.execute(InProcessBuildActionExecuter.java:35)

at org.gradle.launcher.exec.InProcessBuildActionExecuter.execute(InProcessBuildActionExecuter.java:26)

at org.gradle.launcher.cli.RunBuildAction.run(RunBuildAction.java:50)

at org.gradle.internal.Actions$RunnableActionAdapter.execute(Actions.java:171)

at org.gradle.launcher.cli.CommandLineActionFactory$ParseAndBuildAction.execute(CommandLineActionFactory.java:201)

at org.gradle.launcher.cli.CommandLineActionFactory$ParseAndBuildAction.execute(CommandLineActionFactory.java:174)

at org.gradle.launcher.cli.CommandLineActionFactory$WithLogging.execute(CommandLineActionFactory.java:170)

at org.gradle.launcher.cli.CommandLineActionFactory$WithLogging.execute(CommandLineActionFactory.java:139)

at org.gradle.launcher.cli.ExceptionReportingAction.execute(ExceptionReportingAction.java:33)

at org.gradle.launcher.cli.ExceptionReportingAction.execute(ExceptionReportingAction.java:22)

at org.gradle.launcher.Main.doAction(Main.java:46)

at org.gradle.launcher.bootstrap.EntryPoint.run(EntryPoint.java:45)

at org.gradle.launcher.Main.main(Main.java:37)

at org.gradle.launcher.bootstrap.ProcessBootstrap.runNoExit(ProcessBootstrap.java:50)

at org.gradle.launcher.bootstrap.ProcessBootstrap.run(ProcessBootstrap.java:32)

at org.gradle.launcher.GradleMain.main(GradleMain.java:23)

at org.gradle.wrapper.BootstrapMainStarter.start(BootstrapMainStarter.java:30)

at org.gradle.wrapper.WrapperExecutor.execute(WrapperExecutor.java:127)

at org.gradle.wrapper.GradleWrapperMain.main(GradleWrapperMain.java:58)

Caused by: org.gradle.api.internal.tasks.compile.CompilationFailedException: Compilation failed; see the compiler error output for details.

at org.gradle.api.internal.tasks.compile.jdk6.Jdk6JavaCompiler.execute(Jdk6JavaCompiler.java:47)

at org.gradle.api.internal.tasks.compile.jdk6.Jdk6JavaCompiler.execute(Jdk6JavaCompiler.java:38)

at org.gradle.api.internal.tasks.compile.NormalizingJavaCompiler.delegateAndHandleErrors(NormalizingJavaCompiler.java:96)

at org.gradle.api.internal.tasks.compile.NormalizingJavaCompiler.execute(NormalizingJavaCompiler.java:49)

at org.gradle.api.internal.tasks.compile.NormalizingJavaCompiler.execute(NormalizingJavaCompiler.java:35)

at org.gradle.api.internal.tasks.compile.DelegatingJavaCompiler.execute(DelegatingJavaCompiler.java:29)

at org.gradle.api.internal.tasks.compile.DelegatingJavaCompiler.execute(DelegatingJavaCompiler.java:20)

at org.gradle.api.internal.tasks.compile.IncrementalJavaCompilerSupport.execute(IncrementalJavaCompilerSupport.java:33)

at org.gradle.api.internal.tasks.compile.IncrementalJavaCompilerSupport.execute(IncrementalJavaCompilerSupport.java:24)

at org.gradle.api.tasks.compile.Compile.compile(Compile.java:67)

at org.gradle.internal.reflect.JavaMethod.invoke(JavaMethod.java:63)

at org.gradle.api.internal.project.taskfactory.AnnotationProcessingTaskFactory$StandardTaskAction.doExecute(AnnotationProcessingTaskFactory.java:219)

at org.gradle.api.internal.project.taskfactory.AnnotationProcessingTaskFactory$StandardTaskAction.execute(AnnotationProcessingTaskFactory.java:212)

at org.gradle.api.internal.project.taskfactory.AnnotationProcessingTaskFactory$StandardTaskAction.execute(AnnotationProcessingTaskFactory.java:201)

at org.gradle.api.internal.AbstractTask$TaskActionWrapper.execute(AbstractTask.java:533)

at org.gradle.api.internal.AbstractTask$TaskActionWrapper.execute(AbstractTask.java:516)

at org.gradle.api.internal.tasks.execution.ExecuteActionsTaskExecuter.executeAction(ExecuteActionsTaskExecuter.java:80)

at org.gradle.api.internal.tasks.execution.ExecuteActionsTaskExecuter.executeActions(ExecuteActionsTaskExecuter.java:61)

... 52 more

 

 

BUILD FAILED

 

Total time: 10.597 secs

 

 

Link to comment
Share on other sites

What I always do first when a build fails is run "gradlew --refresh-dependencies setupDevWorkspace" in my mod folder, then try again. It's worked for me almost every single time when I've had any kind of problem with my workspace.

 

If that doesn't work, has your mod ever recompiled successfully say on the Forge recommended build 1024? You might want to give that a try as well.

Link to comment
Share on other sites

Ok tried all the suggestions,  Thanks so much guys I'm still getting the same error so I'm going to start a complete rewrite of my mod and hope that fixes it.  The error seems to me like its a java problem though I downloaded installed and re setup the whole environment.  Thanks again for the help and if the rewrite doesnt work I'll post again.

Link to comment
Share on other sites

Rebuild is working but slower so I dont know what the problem was but can anyone explain this message for me I am not even using this library.

 

[09:54:47] [Client thread/ERROR] [FML]: FML has detected a mod that is using a package name based on 'net.minecraft.src' : net.minecraft.src.FMLRenderAccessLibrary. This is generally a severe programming error.  There should be no mod code in the minecraft namespace. MOVE YOUR MOD! If you're in eclipse, select your source code and 'refactor' it into a new package. Go on. DO IT NOW!

Link to comment
Share on other sites

Don't worry about it that's FML (Forge Mod Loader) yelling that hay there's a file here that should not be but the thing is FML puts it there to use but in dev it forgets that it put it there and think you the modded did a bit of mixed up coding in my opinion but its okay its normal in dev.

Link to comment
Share on other sites

Join the conversation

You can post now and register later. If you have an account, sign in now to post with your account.
Note: Your post will require moderator approval before it will be visible.

Guest
Reply to this topic...

×   Pasted as rich text.   Restore formatting

  Only 75 emoji are allowed.

×   Your link has been automatically embedded.   Display as a link instead

×   Your previous content has been restored.   Clear editor

×   You cannot paste images directly. Upload or insert images from URL.

 Share



×
×
  • Create New...

Important Information

By using this site, you agree to our Terms of Use.