Jump to content
Search In
  • More options...
Find results that contain...
Find results in...

when i try to build my mod i get this...


Soulas97
 Share

Recommended Posts

when i try to build my mod i get an error idk why :///

 

 

Failure Build Failed With exception

what went wrong;

A problem occured Configuring root project tutorial

for input string ..1101

 

2:53:01.009 [ERROR] [org.gradle.BuildExceptionReporter] 
22:53:01.015 [ERROR] [org.gradle.BuildExceptionReporter] FAILURE: Build failed with an exception.
22:53:01.022 [ERROR] [org.gradle.BuildExceptionReporter] 
22:53:01.027 [ERROR] [org.gradle.BuildExceptionReporter] * What went wrong:
22:53:01.032 [ERROR] [org.gradle.BuildExceptionReporter] A problem occurred configuring root project 'Tutorial'.
22:53:01.036 [ERROR] [org.gradle.BuildExceptionReporter] > For input string: ".1101"
22:53:01.135 [ERROR] [org.gradle.BuildExceptionReporter] 
22:53:01.140 [ERROR] [org.gradle.BuildExceptionReporter] * Exception is:
22:53:01.147 [ERROR] [org.gradle.BuildExceptionReporter] org.gradle.api.ProjectConfigurationException: A problem occurred configuring root project 'Tutorial'.
22:53:01.153 [ERROR] [org.gradle.BuildExceptionReporter] 	at org.gradle.configuration.project.LifecycleProjectEvaluator.addConfigurationFailure(LifecycleProjectEvaluator.java:79)
22:53:01.158 [ERROR] [org.gradle.BuildExceptionReporter] 	at org.gradle.configuration.project.LifecycleProjectEvaluator.notifyAfterEvaluate(LifecycleProjectEvaluator.java:74)
22:53:01.163 [ERROR] [org.gradle.BuildExceptionReporter] 	at org.gradle.configuration.project.LifecycleProjectEvaluator.evaluate(LifecycleProjectEvaluator.java:61)
22:53:01.177 [ERROR] [org.gradle.BuildExceptionReporter] 	at org.gradle.api.internal.project.AbstractProject.evaluate(AbstractProject.java:493)
22:53:01.181 [ERROR] [org.gradle.BuildExceptionReporter] 	at org.gradle.api.internal.project.AbstractProject.evaluate(AbstractProject.java:80)
22:53:01.186 [ERROR] [org.gradle.BuildExceptionReporter] 	at org.gradle.configuration.DefaultBuildConfigurer.configure(DefaultBuildConfigurer.java:31)
22:53:01.194 [ERROR] [org.gradle.BuildExceptionReporter] 	at org.gradle.initialization.DefaultGradleLauncher.doBuildStages(DefaultGradleLauncher.java:142)
22:53:01.199 [ERROR] [org.gradle.BuildExceptionReporter] 	at org.gradle.initialization.DefaultGradleLauncher.doBuild(DefaultGradleLauncher.java:113)
22:53:01.203 [ERROR] [org.gradle.BuildExceptionReporter] 	at org.gradle.initialization.DefaultGradleLauncher.run(DefaultGradleLauncher.java:81)
22:53:01.209 [ERROR] [org.gradle.BuildExceptionReporter] 	at org.gradle.launcher.exec.InProcessBuildActionExecuter$DefaultBuildController.run(InProcessBuildActionExecuter.java:64)
22:53:01.223 [ERROR] [org.gradle.BuildExceptionReporter] 	at org.gradle.launcher.cli.ExecuteBuildAction.run(ExecuteBuildAction.java:33)
22:53:01.228 [ERROR] [org.gradle.BuildExceptionReporter] 	at org.gradle.launcher.cli.ExecuteBuildAction.run(ExecuteBuildAction.java:24)
22:53:01.233 [ERROR] [org.gradle.BuildExceptionReporter] 	at org.gradle.launcher.exec.InProcessBuildActionExecuter.execute(InProcessBuildActionExecuter.java:35)
22:53:01.237 [ERROR] [org.gradle.BuildExceptionReporter] 	at org.gradle.launcher.exec.InProcessBuildActionExecuter.execute(InProcessBuildActionExecuter.java:26)
22:53:01.275 [ERROR] [org.gradle.BuildExceptionReporter] 	at org.gradle.launcher.cli.RunBuildAction.run(RunBuildAction.java:50)
22:53:01.284 [ERROR] [org.gradle.BuildExceptionReporter] 	at org.gradle.internal.Actions$RunnableActionAdapter.execute(Actions.java:171)
22:53:01.338 [ERROR] [org.gradle.BuildExceptionReporter] 	at org.gradle.launcher.cli.CommandLineActionFactory$ParseAndBuildAction.execute(CommandLineActionFactory.java:201)
22:53:01.343 [ERROR] [org.gradle.BuildExceptionReporter] 	at org.gradle.launcher.cli.CommandLineActionFactory$ParseAndBuildAction.execute(CommandLineActionFactory.java:174)
22:53:01.348 [ERROR] [org.gradle.BuildExceptionReporter] 	at org.gradle.launcher.cli.CommandLineActionFactory$WithLogging.execute(CommandLineActionFactory.java:170)
22:53:01.353 [ERROR] [org.gradle.BuildExceptionReporter] 	at org.gradle.launcher.cli.CommandLineActionFactory$WithLogging.execute(CommandLineActionFactory.java:139)
22:53:01.357 [ERROR] [org.gradle.BuildExceptionReporter] 	at org.gradle.launcher.cli.ExceptionReportingAction.execute(ExceptionReportingAction.java:33)
22:53:01.362 [ERROR] [org.gradle.BuildExceptionReporter] 	at org.gradle.launcher.cli.ExceptionReportingAction.execute(ExceptionReportingAction.java:22)
22:53:01.369 [ERROR] [org.gradle.BuildExceptionReporter] 	at org.gradle.launcher.Main.doAction(Main.java:46)
22:53:01.374 [ERROR] [org.gradle.BuildExceptionReporter] 	at org.gradle.launcher.bootstrap.EntryPoint.run(EntryPoint.java:45)
22:53:01.391 [ERROR] [org.gradle.BuildExceptionReporter] 	at org.gradle.launcher.Main.main(Main.java:37)
22:53:01.397 [ERROR] [org.gradle.BuildExceptionReporter] 	at org.gradle.launcher.bootstrap.ProcessBootstrap.runNoExit(ProcessBootstrap.java:50)
22:53:01.404 [ERROR] [org.gradle.BuildExceptionReporter] 	at org.gradle.launcher.bootstrap.ProcessBootstrap.run(ProcessBootstrap.java:32)
22:53:01.410 [ERROR] [org.gradle.BuildExceptionReporter] 	at org.gradle.launcher.GradleMain.main(GradleMain.java:23)
22:53:01.416 [ERROR] [org.gradle.BuildExceptionReporter] 	at org.gradle.wrapper.BootstrapMainStarter.start(BootstrapMainStarter.java:30)
22:53:01.423 [ERROR] [org.gradle.BuildExceptionReporter] 	at org.gradle.wrapper.WrapperExecutor.execute(WrapperExecutor.java:127)
22:53:01.428 [ERROR] [org.gradle.BuildExceptionReporter] 	at org.gradle.wrapper.GradleWrapperMain.main(GradleWrapperMain.java:55)
22:53:01.433 [ERROR] [org.gradle.BuildExceptionReporter] Caused by: java.lang.NumberFormatException: For input string: ".1101"
22:53:01.441 [ERROR] [org.gradle.BuildExceptionReporter] 	at net.minecraftforge.gradle.user.patch.UserPatchBasePlugin.doVersionChecks(UserPatchBasePlugin.java:181)
22:53:01.446 [ERROR] [org.gradle.BuildExceptionReporter] 	at net.minecraftforge.gradle.user.UserBasePlugin.afterEvaluate(UserBasePlugin.java:893)
22:53:01.451 [ERROR] [org.gradle.BuildExceptionReporter] 	at net.minecraftforge.gradle.common.BasePlugin$2.execute(BasePlugin.java:102)
22:53:01.457 [ERROR] [org.gradle.BuildExceptionReporter] 	at net.minecraftforge.gradle.common.BasePlugin$2.execute(BasePlugin.java:98)
22:53:01.462 [ERROR] [org.gradle.BuildExceptionReporter] 	at org.gradle.listener.BroadcastDispatch$ActionInvocationHandler.dispatch(BroadcastDispatch.java:109)
22:53:01.497 [ERROR] [org.gradle.BuildExceptionReporter] 	at org.gradle.listener.BroadcastDispatch$ActionInvocationHandler.dispatch(BroadcastDispatch.java:98)
22:53:01.502 [ERROR] [org.gradle.BuildExceptionReporter] 	at org.gradle.listener.BroadcastDispatch.dispatch(BroadcastDispatch.java:83)
22:53:01.507 [ERROR] [org.gradle.BuildExceptionReporter] 	at org.gradle.listener.BroadcastDispatch.dispatch(BroadcastDispatch.java:31)
22:53:01.512 [ERROR] [org.gradle.BuildExceptionReporter] 	at org.gradle.messaging.dispatch.ProxyDispatchAdapter$DispatchingInvocationHandler.invoke(ProxyDispatchAdapter.java:93)
22:53:01.516 [ERROR] [org.gradle.BuildExceptionReporter] 	at com.sun.proxy.$Proxy13.afterEvaluate(Unknown Source)
22:53:01.521 [ERROR] [org.gradle.BuildExceptionReporter] 	at org.gradle.configuration.project.LifecycleProjectEvaluator.notifyAfterEvaluate(LifecycleProjectEvaluator.java:67)
22:53:01.526 [ERROR] [org.gradle.BuildExceptionReporter] 	... 29 more
22:53:01.531 [ERROR] [org.gradle.BuildExceptionReporter] 
22:53:01.536 [LIFECYCLE] [org.gradle.BuildResultLogger] 
22:53:01.542 [LIFECYCLE] [org.gradle.BuildResultLogger] BUILD FAILED
22:53:01.547 [LIFECYCLE] [org.gradle.BuildResultLogger] 
22:53:01.552 [LIFECYCLE] [org.gradle.BuildResultLogger] Total time: 18.507 secs
22:53:01.559 [DEBUG] [org.gradle.api.internal.tasks.compile.daemon.CompilerDaemonManager] Stopping 0 compiler daemon(s).
22:53:01.565 [iNFO] [org.gradle.api.internal.tasks.compile.daemon.CompilerDaemonManager] Stopped 0 compiler daemon(s).
22:53:01.573 [DEBUG] [org.gradle.cache.internal.DefaultFileLockManager] Releasing lock on buildscript class cache for build file 'C:\Users\User\Desktop\Tutorial\build.gradle' (C:\Users\User\.gradle\caches\1.12\scripts\build_41abjlfml2qh1hbopvedt6s0t4\ProjectScript\buildscript).
22:53:01.579 [DEBUG] [org.gradle.cache.internal.DefaultFileLockManager] Releasing lock on no_buildscript class cache for build file 'C:\Users\User\Desktop\Tutorial\build.gradle' (C:\Users\User\.gradle\caches\1.12\scripts\build_41abjlfml2qh1hbopvedt6s0t4\ProjectScript\no_buildscript).
22:53:01.594 [DEBUG] [org.gradle.cache.internal.btree.BTreePersistentIndexedCache] Closing cache artifact-at-repository.bin (C:\Users\User\.gradle\caches\modules-2\metadata-2.6\artifact-at-repository.bin)
22:53:01.600 [DEBUG] [org.gradle.cache.internal.btree.BTreePersistentIndexedCache] Closing cache module-metadata.bin (C:\Users\User\.gradle\caches\modules-2\metadata-2.6\module-metadata.bin)
22:53:01.616 [DEBUG] [org.gradle.cache.internal.btree.BTreePersistentIndexedCache] Closing cache module-versions.bin (C:\Users\User\.gradle\caches\modules-2\metadata-2.6\module-versions.bin)
22:53:01.623 [DEBUG] [org.gradle.cache.internal.DefaultFileLockManager] Releasing lock on artifact cache (C:\Users\User\.gradle\caches\modules-2).
22:53:01.663 [DEBUG] [org.gradle.cache.internal.DefaultCacheAccess] Cache task history cache (C:\Users\User\Desktop\Tutorial\.gradle\1.12\taskArtifacts) was closed 0 times.
22:53:01.694 [DEBUG] [org.gradle.api.internal.artifacts.ivyservice.ivyresolve.memcache.InMemoryDependencyMetadataCache] In-memory dependency metadata cache closed. Repos cached: 3, cache instances: 3, modules served from cache: 12, artifacts: 0
22:53:01.701 [DEBUG] [org.gradle.api.internal.artifacts.ivyservice.resolveengine.store.CachedStoreFactory] Resolution result cache closed. Cache reads: 0, disk reads: 0 (avg: 0.0 secs, total: 0.0 secs)
22:53:01.710 [DEBUG] [org.gradle.api.internal.artifacts.ivyservice.resolveengine.store.CachedStoreFactory] Resolved configuration cache closed. Cache reads: 0, disk reads: 0 (avg: 0.0 secs, total: 0.0 secs)
22:53:01.716 [DEBUG] [org.gradle.api.internal.artifacts.ivyservice.resolveengine.store.ResolutionResultsStoreFactory] Deleted 2 resolution results binary files in 0.016 secs

 

 

Full Error Log

Proud mod developer of:

 

Mob Armor mod

Block monster mod

Clay Living Dolls mod

Much More Spiders mod

Elemental cows reborn

Mr gorilla mod

Link to comment
Share on other sites

i think thats a bug, because , before that i exported i was fine, but 1hour later i got this error, idk why,

Proud mod developer of:

 

Mob Armor mod

Block monster mod

Clay Living Dolls mod

Much More Spiders mod

Elemental cows reborn

Mr gorilla mod

Link to comment
Share on other sites

mhm, but idk for what lol, because when i just changed mod version to 1.3 and now its happening lol

Proud mod developer of:

 

Mob Armor mod

Block monster mod

Clay Living Dolls mod

Much More Spiders mod

Elemental cows reborn

Mr gorilla mod

Link to comment
Share on other sites

Join the conversation

You can post now and register later. If you have an account, sign in now to post with your account.
Note: Your post will require moderator approval before it will be visible.

Guest
Reply to this topic...

×   Pasted as rich text.   Restore formatting

  Only 75 emoji are allowed.

×   Your link has been automatically embedded.   Display as a link instead

×   Your previous content has been restored.   Clear editor

×   You cannot paste images directly. Upload or insert images from URL.

 Share



×
×
  • Create New...

Important Information

By using this site, you agree to our Privacy Policy.