Jump to content
Search In
  • More options...
Find results that contain...
Find results in...

[1.7.2][SOLVED]Build Failed while doing gradlew.bat setupDecompWorkspace


The_Fireplace
 Share

Recommended Posts

I deleted my %USERNAME%/.gradle folder before trying to set up the workspace, then ran gradlew.bat setupDecompWorkspace

Here is the gradle.log with --info:

 

 

****************************
Powered By MCP:            
http://mcp.ocean-labs.de/  
Searge, ProfMobius, Fesh0r,
R4wk, ZeuX, IngisKahn      
Resolving:  MCP Data version : {MCP_VERSION}
Resolved:   MCP Data version : unknown
MCP Data version : unknown
****************************

FAILURE: Build failed with an exception.

* What went wrong:
A problem occurred configuring root project 'Forge'.
> For input string: ".1133"

* Try:
Run with --stacktrace option to get the stack trace. Run with --debug option to get more log output.

BUILD FAILED

Total time: 5.135 secs
Stopped 0 compiler daemon(s).

 

 

And one with --debug in case it is needed:

 

 

14:25:10.824 [DEBUG] [org.gradle.configuration.project.BuildScriptProcessor] Timing: Running the build script took 9.93 secs
14:25:10.844 [LIFECYCLE] [org.gradle.api.Project] ****************************
14:25:10.850 [LIFECYCLE] [org.gradle.api.Project]  Powered By MCP:            
14:25:10.855 [LIFECYCLE] [org.gradle.api.Project]  http://mcp.ocean-labs.de/  
14:25:10.861 [LIFECYCLE] [org.gradle.api.Project]  Searge, ProfMobius, Fesh0r,
14:25:10.876 [LIFECYCLE] [org.gradle.api.Project]  R4wk, ZeuX, IngisKahn      
14:25:10.882 [iNFO] [org.gradle.api.Project] Resolving:  MCP Data version : {MCP_VERSION}
14:25:10.892 [iNFO] [org.gradle.api.Project] Resolved:   MCP Data version : unknown
14:25:10.898 [LIFECYCLE] [org.gradle.api.Project]  MCP Data version : unknown
14:25:10.905 [LIFECYCLE] [org.gradle.api.Project] ****************************
14:25:10.920 [ERROR] [org.gradle.BuildExceptionReporter] 
14:25:10.932 [ERROR] [org.gradle.BuildExceptionReporter] FAILURE: Build failed with an exception.
14:25:10.945 [ERROR] [org.gradle.BuildExceptionReporter] 
14:25:10.951 [ERROR] [org.gradle.BuildExceptionReporter] * What went wrong:
14:25:10.958 [ERROR] [org.gradle.BuildExceptionReporter] A problem occurred configuring root project 'Forge'.
14:25:10.965 [ERROR] [org.gradle.BuildExceptionReporter] > For input string: ".1133"
14:25:10.990 [ERROR] [org.gradle.BuildExceptionReporter] 
14:25:10.995 [ERROR] [org.gradle.BuildExceptionReporter] * Exception is:
14:25:11.009 [ERROR] [org.gradle.BuildExceptionReporter] org.gradle.api.ProjectConfigurationException: A problem occurred configuring root project 'Forge'.
14:25:11.015 [ERROR] [org.gradle.BuildExceptionReporter] 	at org.gradle.configuration.project.LifecycleProjectEvaluator.addConfigurationFailure(LifecycleProjectEvaluator.java:79)
14:25:11.021 [ERROR] [org.gradle.BuildExceptionReporter] 	at org.gradle.configuration.project.LifecycleProjectEvaluator.notifyAfterEvaluate(LifecycleProjectEvaluator.java:74)
14:25:11.026 [ERROR] [org.gradle.BuildExceptionReporter] 	at org.gradle.configuration.project.LifecycleProjectEvaluator.evaluate(LifecycleProjectEvaluator.java:61)
14:25:11.032 [ERROR] [org.gradle.BuildExceptionReporter] 	at org.gradle.api.internal.project.AbstractProject.evaluate(AbstractProject.java:493)
14:25:11.037 [ERROR] [org.gradle.BuildExceptionReporter] 	at org.gradle.api.internal.project.AbstractProject.evaluate(AbstractProject.java:80)
14:25:11.042 [ERROR] [org.gradle.BuildExceptionReporter] 	at org.gradle.configuration.DefaultBuildConfigurer.configure(DefaultBuildConfigurer.java:31)
14:25:11.048 [ERROR] [org.gradle.BuildExceptionReporter] 	at org.gradle.initialization.DefaultGradleLauncher.doBuildStages(DefaultGradleLauncher.java:142)
14:25:11.053 [ERROR] [org.gradle.BuildExceptionReporter] 	at org.gradle.initialization.DefaultGradleLauncher.doBuild(DefaultGradleLauncher.java:113)
14:25:11.058 [ERROR] [org.gradle.BuildExceptionReporter] 	at org.gradle.initialization.DefaultGradleLauncher.run(DefaultGradleLauncher.java:81)
14:25:11.063 [ERROR] [org.gradle.BuildExceptionReporter] 	at org.gradle.launcher.exec.InProcessBuildActionExecuter$DefaultBuildController.run(InProcessBuildActionExecuter.java:64)
14:25:11.069 [ERROR] [org.gradle.BuildExceptionReporter] 	at org.gradle.launcher.cli.ExecuteBuildAction.run(ExecuteBuildAction.java:33)
14:25:11.074 [ERROR] [org.gradle.BuildExceptionReporter] 	at org.gradle.launcher.cli.ExecuteBuildAction.run(ExecuteBuildAction.java:24)
14:25:11.079 [ERROR] [org.gradle.BuildExceptionReporter] 	at org.gradle.launcher.exec.InProcessBuildActionExecuter.execute(InProcessBuildActionExecuter.java:35)
14:25:11.085 [ERROR] [org.gradle.BuildExceptionReporter] 	at org.gradle.launcher.exec.InProcessBuildActionExecuter.execute(InProcessBuildActionExecuter.java:26)
14:25:11.090 [ERROR] [org.gradle.BuildExceptionReporter] 	at org.gradle.launcher.cli.RunBuildAction.run(RunBuildAction.java:50)
14:25:11.095 [ERROR] [org.gradle.BuildExceptionReporter] 	at org.gradle.internal.Actions$RunnableActionAdapter.execute(Actions.java:171)
14:25:11.101 [ERROR] [org.gradle.BuildExceptionReporter] 	at org.gradle.launcher.cli.CommandLineActionFactory$ParseAndBuildAction.execute(CommandLineActionFactory.java:201)
14:25:11.106 [ERROR] [org.gradle.BuildExceptionReporter] 	at org.gradle.launcher.cli.CommandLineActionFactory$ParseAndBuildAction.execute(CommandLineActionFactory.java:174)
14:25:11.111 [ERROR] [org.gradle.BuildExceptionReporter] 	at org.gradle.launcher.cli.CommandLineActionFactory$WithLogging.execute(CommandLineActionFactory.java:170)
14:25:11.118 [ERROR] [org.gradle.BuildExceptionReporter] 	at org.gradle.launcher.cli.CommandLineActionFactory$WithLogging.execute(CommandLineActionFactory.java:139)
14:25:11.123 [ERROR] [org.gradle.BuildExceptionReporter] 	at org.gradle.launcher.cli.ExceptionReportingAction.execute(ExceptionReportingAction.java:33)
14:25:11.129 [ERROR] [org.gradle.BuildExceptionReporter] 	at org.gradle.launcher.cli.ExceptionReportingAction.execute(ExceptionReportingAction.java:22)
14:25:11.134 [ERROR] [org.gradle.BuildExceptionReporter] 	at org.gradle.launcher.Main.doAction(Main.java:46)
14:25:11.141 [ERROR] [org.gradle.BuildExceptionReporter] 	at org.gradle.launcher.bootstrap.EntryPoint.run(EntryPoint.java:45)
14:25:11.146 [ERROR] [org.gradle.BuildExceptionReporter] 	at org.gradle.launcher.Main.main(Main.java:37)
14:25:11.152 [ERROR] [org.gradle.BuildExceptionReporter] 	at org.gradle.launcher.bootstrap.ProcessBootstrap.runNoExit(ProcessBootstrap.java:50)
14:25:11.159 [ERROR] [org.gradle.BuildExceptionReporter] 	at org.gradle.launcher.bootstrap.ProcessBootstrap.run(ProcessBootstrap.java:32)
14:25:11.168 [ERROR] [org.gradle.BuildExceptionReporter] 	at org.gradle.launcher.GradleMain.main(GradleMain.java:23)
14:25:11.174 [ERROR] [org.gradle.BuildExceptionReporter] 	at org.gradle.wrapper.BootstrapMainStarter.start(BootstrapMainStarter.java:30)
14:25:11.179 [ERROR] [org.gradle.BuildExceptionReporter] 	at org.gradle.wrapper.WrapperExecutor.execute(WrapperExecutor.java:127)
14:25:11.185 [ERROR] [org.gradle.BuildExceptionReporter] 	at org.gradle.wrapper.GradleWrapperMain.main(GradleWrapperMain.java:55)
14:25:11.190 [ERROR] [org.gradle.BuildExceptionReporter] Caused by: java.lang.NumberFormatException: For input string: ".1133"
14:25:11.195 [ERROR] [org.gradle.BuildExceptionReporter] 	at net.minecraftforge.gradle.user.patch.UserPatchBasePlugin.doVersionChecks(UserPatchBasePlugin.java:181)
14:25:11.201 [ERROR] [org.gradle.BuildExceptionReporter] 	at net.minecraftforge.gradle.user.UserBasePlugin.afterEvaluate(UserBasePlugin.java:893)
14:25:11.206 [ERROR] [org.gradle.BuildExceptionReporter] 	at net.minecraftforge.gradle.common.BasePlugin$2.execute(BasePlugin.java:102)
14:25:11.211 [ERROR] [org.gradle.BuildExceptionReporter] 	at net.minecraftforge.gradle.common.BasePlugin$2.execute(BasePlugin.java:98)
14:25:11.218 [ERROR] [org.gradle.BuildExceptionReporter] 	at org.gradle.listener.BroadcastDispatch$ActionInvocationHandler.dispatch(BroadcastDispatch.java:109)
14:25:11.224 [ERROR] [org.gradle.BuildExceptionReporter] 	at org.gradle.listener.BroadcastDispatch$ActionInvocationHandler.dispatch(BroadcastDispatch.java:98)
14:25:11.237 [ERROR] [org.gradle.BuildExceptionReporter] 	at org.gradle.listener.BroadcastDispatch.dispatch(BroadcastDispatch.java:83)
14:25:11.242 [ERROR] [org.gradle.BuildExceptionReporter] 	at org.gradle.listener.BroadcastDispatch.dispatch(BroadcastDispatch.java:31)
14:25:11.248 [ERROR] [org.gradle.BuildExceptionReporter] 	at org.gradle.messaging.dispatch.ProxyDispatchAdapter$DispatchingInvocationHandler.invoke(ProxyDispatchAdapter.java:93)
14:25:11.253 [ERROR] [org.gradle.BuildExceptionReporter] 	at com.sun.proxy.$Proxy13.afterEvaluate(Unknown Source)
14:25:11.258 [ERROR] [org.gradle.BuildExceptionReporter] 	at org.gradle.configuration.project.LifecycleProjectEvaluator.notifyAfterEvaluate(LifecycleProjectEvaluator.java:67)
14:25:11.264 [ERROR] [org.gradle.BuildExceptionReporter] 	... 29 more
14:25:11.269 [ERROR] [org.gradle.BuildExceptionReporter] 
14:25:11.274 [LIFECYCLE] [org.gradle.BuildResultLogger] 
14:25:11.280 [LIFECYCLE] [org.gradle.BuildResultLogger] BUILD FAILED
14:25:11.286 [LIFECYCLE] [org.gradle.BuildResultLogger] 
14:25:11.291 [LIFECYCLE] [org.gradle.BuildResultLogger] Total time: 13.046 secs
14:25:11.298 [DEBUG] [org.gradle.api.internal.tasks.compile.daemon.CompilerDaemonManager] Stopping 0 compiler daemon(s).
14:25:11.304 [iNFO] [org.gradle.api.internal.tasks.compile.daemon.CompilerDaemonManager] Stopped 0 compiler daemon(s).
14:25:11.316 [DEBUG] [org.gradle.cache.internal.DefaultFileLockManager] Releasing lock on buildscript class cache for build file 'B:\Libraries\Forge\build.gradle' (C:\Users\Lance\.gradle\caches\1.12\scripts\build_3kuvh6codjo1ceolrk6k5v0aua\ProjectScript\buildscript).
14:25:11.324 [DEBUG] [org.gradle.cache.internal.DefaultFileLockManager] Releasing lock on no_buildscript class cache for build file 'B:\Libraries\Forge\build.gradle' (C:\Users\Lance\.gradle\caches\1.12\scripts\build_3kuvh6codjo1ceolrk6k5v0aua\ProjectScript\no_buildscript).
14:25:11.335 [DEBUG] [org.gradle.cache.internal.btree.BTreePersistentIndexedCache] Closing cache module-versions.bin (C:\Users\Lance\.gradle\caches\modules-2\metadata-2.6\module-versions.bin)
14:25:11.343 [DEBUG] [org.gradle.cache.internal.btree.BTreePersistentIndexedCache] Closing cache module-metadata.bin (C:\Users\Lance\.gradle\caches\modules-2\metadata-2.6\module-metadata.bin)
14:25:11.349 [DEBUG] [org.gradle.cache.internal.btree.BTreePersistentIndexedCache] Closing cache artifact-at-repository.bin (C:\Users\Lance\.gradle\caches\modules-2\metadata-2.6\artifact-at-repository.bin)
14:25:11.356 [DEBUG] [org.gradle.cache.internal.DefaultFileLockManager] Releasing lock on artifact cache (C:\Users\Lance\.gradle\caches\modules-2).
14:25:11.371 [DEBUG] [org.gradle.cache.internal.DefaultCacheAccess] Cache task history cache (B:\Libraries\Forge\.gradle\1.12\taskArtifacts) was closed 0 times.
14:25:11.379 [DEBUG] [org.gradle.api.internal.artifacts.ivyservice.ivyresolve.memcache.InMemoryDependencyMetadataCache] In-memory dependency metadata cache closed. Repos cached: 3, cache instances: 3, modules served from cache: 12, artifacts: 0
14:25:11.387 [DEBUG] [org.gradle.api.internal.artifacts.ivyservice.resolveengine.store.CachedStoreFactory] Resolution result cache closed. Cache reads: 0, disk reads: 0 (avg: 0.0 secs, total: 0.0 secs)
14:25:11.394 [DEBUG] [org.gradle.api.internal.artifacts.ivyservice.resolveengine.store.CachedStoreFactory] Resolved configuration cache closed. Cache reads: 0, disk reads: 0 (avg: 0.0 secs, total: 0.0 secs)
14:25:11.409 [DEBUG] [org.gradle.api.internal.artifacts.ivyservice.resolveengine.store.ResolutionResultsStoreFactory] Deleted 2 resolution results binary files in 0.023 secs

 

 

If I helped please press the Thank You button.

 

Check out my mods at http://www.curse.com/users/The_Fireplace/projects

Link to comment
Share on other sites

The Minecraft Forum doesn't seem like the right place to have posted that to me, seeing as it appears to be a Forge issue.

I know, but that was posted before here. I linked it so you can follow progress from both places, in case one makes a discovery before the other. Also, it was to show you there was others with the same issue ;)

Link to comment
Share on other sites

Guest
This topic is now closed to further replies.
 Share



×
×
  • Create New...

Important Information

By using this site, you agree to our Privacy Policy.