Jump to content
Search In
  • More options...
Find results that contain...
Find results in...

Gradlew Build Error , Malformed :reobf


Raflex14
 Share

Recommended Posts

C:\Users\rafael\Documents\Mods>gradlew build --stacktrace
****************************
Powered By MCP:
http://modcoderpack.com/
Searge, ProfMobius, Fesh0r,
R4wk, ZeuX, IngisKahn, bspkrs
MCP Data version : snapshot_20141130
****************************
:compileApiJava UP-TO-DATE
:processApiResources UP-TO-DATE
:apiClasses UP-TO-DATE
:sourceMainJava
:compileJava
warning: [options] bootstrap class path not set in conjunction with -source 1.6
Note: Some input files use unchecked or unsafe operations.
Note: Recompile with -Xlint:unchecked for details.
1 warning
:processResources
:classes
:jar
:compileTestJava UP-TO-DATE
:processTestResources UP-TO-DATE
:testClasses UP-TO-DATE
:test UP-TO-DATE
:extractMcpData UP-TO-DATE
:getVersionJson
:extractUserDev UP-TO-DATE
:genSrgs SKIPPED
:reobf FAILED

FAILURE: Build failed with an exception.

* What went wrong:
Execution failed for task ':reobf'.
> MALFORMED

* Try:
Run with --info or --debug option to get more log output.

* Exception is:
org.gradle.api.tasks.TaskExecutionException: Execution failed for task ':reobf'.

        at org.gradle.api.internal.tasks.execution.ExecuteActionsTaskExecuter.ex
ecuteActions(ExecuteActionsTaskExecuter.java:69)
        at org.gradle.api.internal.tasks.execution.ExecuteActionsTaskExecuter.ex
ecute(ExecuteActionsTaskExecuter.java:46)
        at org.gradle.api.internal.tasks.execution.PostExecutionAnalysisTaskExec
uter.execute(PostExecutionAnalysisTaskExecuter.java:35)
        at org.gradle.api.internal.tasks.execution.SkipUpToDateTaskExecuter.exec
ute(SkipUpToDateTaskExecuter.java:64)
        at org.gradle.api.internal.tasks.execution.ValidatingTaskExecuter.execut
e(ValidatingTaskExecuter.java:58)
        at org.gradle.api.internal.tasks.execution.SkipEmptySourceFilesTaskExecu
ter.execute(SkipEmptySourceFilesTaskExecuter.java:42)
        at org.gradle.api.internal.tasks.execution.SkipTaskWithNoActionsExecuter
.execute(SkipTaskWithNoActionsExecuter.java:52)
        at org.gradle.api.internal.tasks.execution.SkipOnlyIfTaskExecuter.execut
e(SkipOnlyIfTaskExecuter.java:53)
        at org.gradle.api.internal.tasks.execution.ExecuteAtMostOnceTaskExecuter
.execute(ExecuteAtMostOnceTaskExecuter.java:43)
        at org.gradle.api.internal.AbstractTask.executeWithoutThrowingTaskFailur
e(AbstractTask.java:296)
        at org.gradle.execution.taskgraph.AbstractTaskPlanExecutor$TaskExecutorW
orker.executeTask(AbstractTaskPlanExecutor.java:79)
        at org.gradle.execution.taskgraph.AbstractTaskPlanExecutor$TaskExecutorW
orker.processTask(AbstractTaskPlanExecutor.java:63)
        at org.gradle.execution.taskgraph.AbstractTaskPlanExecutor$TaskExecutorW
orker.run(AbstractTaskPlanExecutor.java:51)
        at org.gradle.execution.taskgraph.DefaultTaskPlanExecutor.process(Defaul
tTaskPlanExecutor.java:23)
        at org.gradle.execution.taskgraph.DefaultTaskGraphExecuter.execute(Defau
ltTaskGraphExecuter.java:86)
        at org.gradle.execution.SelectedTaskExecutionAction.execute(SelectedTask
ExecutionAction.java:29)
        at org.gradle.execution.DefaultBuildExecuter.execute(DefaultBuildExecute
r.java:61)
        at org.gradle.execution.DefaultBuildExecuter.access$200(DefaultBuildExec
uter.java:23)
        at org.gradle.execution.DefaultBuildExecuter$2.proceed(DefaultBuildExecu
ter.java:67)
        at org.gradle.execution.DryRunBuildExecutionAction.execute(DryRunBuildEx
ecutionAction.java:32)
        at org.gradle.execution.DefaultBuildExecuter.execute(DefaultBuildExecute
r.java:61)
        at org.gradle.execution.DefaultBuildExecuter.execute(DefaultBuildExecute
r.java:54)
        at org.gradle.initialization.DefaultGradleLauncher.doBuildStages(Default
GradleLauncher.java:148)
        at org.gradle.initialization.DefaultGradleLauncher.doBuild(DefaultGradle
Launcher.java:105)
        at org.gradle.initialization.DefaultGradleLauncher.run(DefaultGradleLaun
cher.java:85)
        at org.gradle.launcher.exec.InProcessBuildActionExecuter$DefaultBuildCon
troller.run(InProcessBuildActionExecuter.java:81)
        at org.gradle.launcher.cli.ExecuteBuildAction.run(ExecuteBuildAction.jav
a:33)
        at org.gradle.launcher.cli.ExecuteBuildAction.run(ExecuteBuildAction.jav
a:24)
        at org.gradle.launcher.exec.InProcessBuildActionExecuter.execute(InProce
ssBuildActionExecuter.java:39)
        at org.gradle.launcher.exec.InProcessBuildActionExecuter.execute(InProce
ssBuildActionExecuter.java:29)
        at org.gradle.launcher.cli.RunBuildAction.run(RunBuildAction.java:50)
        at org.gradle.internal.Actions$RunnableActionAdapter.execute(Actions.jav
a:171)
        at org.gradle.launcher.cli.CommandLineActionFactory$ParseAndBuildAction.
execute(CommandLineActionFactory.java:237)
        at org.gradle.launcher.cli.CommandLineActionFactory$ParseAndBuildAction.
execute(CommandLineActionFactory.java:210)
        at org.gradle.launcher.cli.JavaRuntimeValidationAction.execute(JavaRunti
meValidationAction.java:35)
        at org.gradle.launcher.cli.JavaRuntimeValidationAction.execute(JavaRunti
meValidationAction.java:24)
        at org.gradle.launcher.cli.CommandLineActionFactory$WithLogging.execute(
CommandLineActionFactory.java:206)
        at org.gradle.launcher.cli.CommandLineActionFactory$WithLogging.execute(
CommandLineActionFactory.java:169)
        at org.gradle.launcher.cli.ExceptionReportingAction.execute(ExceptionRep
ortingAction.java:33)
        at org.gradle.launcher.cli.ExceptionReportingAction.execute(ExceptionRep
ortingAction.java:22)
        at org.gradle.launcher.Main.doAction(Main.java:33)
        at org.gradle.launcher.bootstrap.EntryPoint.run(EntryPoint.java:45)
        at org.gradle.launcher.bootstrap.ProcessBootstrap.runNoExit(ProcessBoots
trap.java:54)
        at org.gradle.launcher.bootstrap.ProcessBootstrap.run(ProcessBootstrap.j
ava:35)
        at org.gradle.launcher.GradleMain.main(GradleMain.java:23)
        at org.gradle.wrapper.BootstrapMainStarter.start(BootstrapMainStarter.ja
va:30)
        at org.gradle.wrapper.WrapperExecutor.execute(WrapperExecutor.java:127)
        at org.gradle.wrapper.GradleWrapperMain.main(GradleWrapperMain.java:56)
Caused by: java.lang.IllegalArgumentException: MALFORMED
        at net.md_5.specialsource.Jar.collectJarFiles(Jar.java:169)
        at net.md_5.specialsource.Jar.init(Jar.java:229)
        at net.md_5.specialsource.Jar.init(Jar.java:206)
        at net.minecraftforge.gradle.tasks.user.reobf.ObfArtifact.applySpecialSo
urce(ObfArtifact.java:387)
        at net.minecraftforge.gradle.tasks.user.reobf.ObfArtifact.generate(ObfAr
tifact.java:350)
        at net.minecraftforge.gradle.tasks.user.reobf.ReobfTask.doTask(ReobfTask
.java:317)
        at org.gradle.internal.reflect.JavaMethod.invoke(JavaMethod.java:63)
        at org.gradle.api.internal.project.taskfactory.AnnotationProcessingTaskF
actory$StandardTaskAction.doExecute(AnnotationProcessingTaskFactory.java:218)
        at org.gradle.api.internal.project.taskfactory.AnnotationProcessingTaskF
actory$StandardTaskAction.execute(AnnotationProcessingTaskFactory.java:211)
        at org.gradle.api.internal.project.taskfactory.AnnotationProcessingTaskF
actory$StandardTaskAction.execute(AnnotationProcessingTaskFactory.java:200)
        at org.gradle.api.internal.AbstractTask$TaskActionWrapper.execute(Abstra
ctTask.java:570)
        at org.gradle.api.internal.AbstractTask$TaskActionWrapper.execute(Abstra
ctTask.java:553)
        at org.gradle.api.internal.tasks.execution.ExecuteActionsTaskExecuter.ex
ecuteAction(ExecuteActionsTaskExecuter.java:80)
        at org.gradle.api.internal.tasks.execution.ExecuteActionsTaskExecuter.ex
ecuteActions(ExecuteActionsTaskExecuter.java:61)
        ... 47 more


BUILD FAILED

Total time: 24.404 secs

C:\Users\*****\Documents\Mods>

Link to comment
Share on other sites

Join the conversation

You can post now and register later. If you have an account, sign in now to post with your account.
Note: Your post will require moderator approval before it will be visible.

Guest
Reply to this topic...

×   Pasted as rich text.   Restore formatting

  Only 75 emoji are allowed.

×   Your link has been automatically embedded.   Display as a link instead

×   Your previous content has been restored.   Clear editor

×   You cannot paste images directly. Upload or insert images from URL.

 Share



  • Recently Browsing

    No registered users viewing this page.

  • Posts

    • JVM info: Oracle Corporation - 1.8.0_311 - 25.311-b11 java.net.preferIPv4Stack=true Found java version 1.8.0_311 Extracting json Considering minecraft client jar Downloading libraries Found 0 additional library directories Considering library cpw.mods:securejarhandler:0.9.54   File exists: Checksum validated. Considering library org.ow2.asm:asm:9.1   File exists: Checksum validated. Considering library org.ow2.asm:asm-commons:9.1   File exists: Checksum validated. Considering library org.ow2.asm:asm-tree:9.1   File exists: Checksum validated. Considering library org.ow2.asm:asm-util:9.1   File exists: Checksum validated. Considering library org.ow2.asm:asm-analysis:9.1   File exists: Checksum validated. Considering library net.minecraftforge:accesstransformers:8.0.4   File exists: Checksum validated. Considering library org.antlr:antlr4-runtime:4.9.1   File exists: Checksum validated. Considering library net.minecraftforge:eventbus:5.0.3   File exists: Checksum validated. Considering library net.minecraftforge:forgespi:4.0.10   File exists: Checksum validated. Considering library net.minecraftforge:coremods:5.0.1   File exists: Checksum validated. Considering library cpw.mods:modlauncher:9.0.7   File exists: Checksum validated. Considering library net.minecraftforge:unsafe:0.2.0   File exists: Checksum validated. Considering library com.electronwill.night-config:core:3.6.4   File exists: Checksum validated. Considering library com.electronwill.night-config:toml:3.6.4   File exists: Checksum validated. Considering library org.apache.maven:maven-artifact:3.6.3   File exists: Checksum validated. Considering library org.apache.commons:commons-lang3:3.12.0   File exists: Checksum validated. Considering library net.jodah:typetools:0.8.3   File exists: Checksum validated. Considering library org.apache.logging.log4j:log4j-api:2.14.1   File exists: Checksum validated. Considering library org.apache.logging.log4j:log4j-core:2.14.1   File exists: Checksum validated. Considering library net.minecrell:terminalconsoleappender:1.2.0   File exists: Checksum validated. Considering library org.jline:jline-reader:3.12.1   File exists: Checksum validated. Considering library org.jline:jline-terminal:3.12.1   File exists: Checksum validated. Considering library net.sf.jopt-simple:jopt-simple:5.0.4   File exists: Checksum validated. Considering library org.spongepowered:mixin:0.8.5   File exists: Checksum validated. Considering library org.openjdk.nashorn:nashorn-core:15.3   File exists: Checksum validated. Considering library com.google.guava:guava:31.0.1-jre   File exists: Checksum validated. Considering library com.google.code.gson:gson:2.8.8   File exists: Checksum validated. Considering library cpw.mods:bootstraplauncher:0.1.17   File exists: Checksum validated. Considering library net.minecraftforge:fmlloader:1.18-38.0.15   File exists: Checksum validated. Considering library com.github.jponge:lzma-java:1.3   File exists: Checksum validated. Considering library com.google.code.findbugs:jsr305:3.0.2   File exists: Checksum validated. Considering library com.google.code.gson:gson:2.8.7   File exists: Checksum validated. Considering library com.google.errorprone:error_prone_annotations:2.1.3   File exists: Checksum validated. Considering library com.google.guava:guava:20.0   File exists: Checksum validated. Considering library com.google.guava:guava:25.1-jre   File exists: Checksum validated. Considering library com.google.j2objc:j2objc-annotations:1.1   File exists: Checksum validated. Considering library com.nothome:javaxdelta:2.0.1   File exists: Checksum validated. Considering library com.opencsv:opencsv:4.4   File exists: Checksum validated. Considering library commons-beanutils:commons-beanutils:1.9.3   File exists: Checksum validated. Considering library commons-collections:commons-collections:3.2.2   File exists: Checksum validated. Considering library commons-io:commons-io:2.4   File exists: Checksum validated. Considering library commons-logging:commons-logging:1.2   File exists: Checksum validated. Considering library de.oceanlabs.mcp:mcp_config:1.18-20211130.085255@zip   File exists: Checksum validated. Considering library de.siegmar:fastcsv:2.0.0   File exists: Checksum validated. Considering library net.md-5:SpecialSource:1.10.0   File exists: Checksum validated. Considering library net.minecraftforge:ForgeAutoRenamingTool:0.1.17:all   File exists: Checksum validated. Considering library net.minecraftforge:binarypatcher:1.0.12   File exists: Checksum validated. Considering library net.minecraftforge:fmlcore:1.18-38.0.15   File exists: Checksum validated. Considering library net.minecraftforge:fmlloader:1.18-38.0.15   File exists: Checksum validated. Considering library net.minecraftforge:forge:1.18-38.0.15:universal   File exists: Checksum validated. Considering library net.minecraftforge:installertools:1.2.10   File exists: Checksum validated. Considering library net.minecraftforge:jarsplitter:1.1.4   File exists: Checksum validated. Considering library net.minecraftforge:javafmllanguage:1.18-38.0.15   File exists: Checksum validated. Considering library net.minecraftforge:mclanguage:1.18-38.0.15   File exists: Checksum validated. Considering library net.minecraftforge:srgutils:0.4.3   File exists: Checksum validated. Considering library net.minecraftforge:srgutils:0.4.7   File exists: Checksum validated. Considering library net.sf.jopt-simple:jopt-simple:5.0.4   File exists: Checksum validated. Considering library net.sf.jopt-simple:jopt-simple:6.0-alpha-3   File exists: Checksum validated. Considering library org.apache.commons:commons-collections4:4.2   File exists: Checksum validated. Considering library org.apache.commons:commons-lang3:3.8.1   File exists: Checksum validated. Considering library org.apache.commons:commons-text:1.3   File exists: Checksum validated. Considering library org.checkerframework:checker-qual:2.0.0   File exists: Checksum validated. Considering library org.codehaus.mojo:animal-sniffer-annotations:1.14   File exists: Checksum validated. Considering library org.ow2.asm:asm-analysis:9.1   File exists: Checksum validated. Considering library org.ow2.asm:asm-analysis:9.2   File exists: Checksum validated. Considering library org.ow2.asm:asm-commons:9.1   File exists: Checksum validated. Considering library org.ow2.asm:asm-commons:9.2   File exists: Checksum validated. Considering library org.ow2.asm:asm-tree:9.1   File exists: Checksum validated. Considering library org.ow2.asm:asm-tree:9.2   File exists: Checksum validated. Considering library org.ow2.asm:asm:9.1   File exists: Checksum validated. Considering library org.ow2.asm:asm:9.2   File exists: Checksum validated. Considering library trove:trove:1.0.2   File exists: Checksum validated. Created Temporary Directory: C:\Users\ACER\AppData\Local\Temp\forge_installer700304410901520145   Extracting: /data/client.lzma Building Processors ===============================================================================   MainClass: net.minecraftforge.installertools.ConsoleTool   Classpath:     C:\Users\ACER\AppData\Roaming\.minecraft\libraries\net\minecraftforge\installertools\1.2.10\installertools-1.2.10.jar     C:\Users\ACER\AppData\Roaming\.minecraft\libraries\net\md-5\SpecialSource\1.10.0\SpecialSource-1.10.0.jar     C:\Users\ACER\AppData\Roaming\.minecraft\libraries\net\sf\jopt-simple\jopt-simple\5.0.4\jopt-simple-5.0.4.jar     C:\Users\ACER\AppData\Roaming\.minecraft\libraries\com\google\code\gson\gson\2.8.7\gson-2.8.7.jar     C:\Users\ACER\AppData\Roaming\.minecraft\libraries\de\siegmar\fastcsv\2.0.0\fastcsv-2.0.0.jar     C:\Users\ACER\AppData\Roaming\.minecraft\libraries\net\minecraftforge\srgutils\0.4.3\srgutils-0.4.3.jar     C:\Users\ACER\AppData\Roaming\.minecraft\libraries\org\ow2\asm\asm-commons\9.1\asm-commons-9.1.jar     C:\Users\ACER\AppData\Roaming\.minecraft\libraries\com\google\guava\guava\20.0\guava-20.0.jar     C:\Users\ACER\AppData\Roaming\.minecraft\libraries\com\opencsv\opencsv\4.4\opencsv-4.4.jar     C:\Users\ACER\AppData\Roaming\.minecraft\libraries\org\ow2\asm\asm-analysis\9.1\asm-analysis-9.1.jar     C:\Users\ACER\AppData\Roaming\.minecraft\libraries\org\ow2\asm\asm-tree\9.1\asm-tree-9.1.jar     C:\Users\ACER\AppData\Roaming\.minecraft\libraries\org\ow2\asm\asm\9.1\asm-9.1.jar     C:\Users\ACER\AppData\Roaming\.minecraft\libraries\org\apache\commons\commons-text\1.3\commons-text-1.3.jar     C:\Users\ACER\AppData\Roaming\.minecraft\libraries\org\apache\commons\commons-lang3\3.8.1\commons-lang3-3.8.1.jar     C:\Users\ACER\AppData\Roaming\.minecraft\libraries\commons-beanutils\commons-beanutils\1.9.3\commons-beanutils-1.9.3.jar     C:\Users\ACER\AppData\Roaming\.minecraft\libraries\org\apache\commons\commons-collections4\4.2\commons-collections4-4.2.jar     C:\Users\ACER\AppData\Roaming\.minecraft\libraries\commons-logging\commons-logging\1.2\commons-logging-1.2.jar     C:\Users\ACER\AppData\Roaming\.minecraft\libraries\commons-collections\commons-collections\3.2.2\commons-collections-3.2.2.jar   Args: --task, MCP_DATA, --input, C:\Users\ACER\AppData\Roaming\.minecraft\libraries\de\oceanlabs\mcp\mcp_config\1.18-20211130.085255\mcp_config-1.18-20211130.085255.zip, --output, C:\Users\ACER\AppData\Roaming\.minecraft\libraries\de\oceanlabs\mcp\mcp_config\1.18-20211130.085255\mcp_config-1.18-20211130.085255-mappings.txt, --key, mappings Task: MCP_DATA Input:  C:\Users\ACER\AppData\Roaming\.minecraft\libraries\de\oceanlabs\mcp\mcp_config\1.18-20211130.085255\mcp_config-1.18-20211130.085255.zip Output: C:\Users\ACER\AppData\Roaming\.minecraft\libraries\de\oceanlabs\mcp\mcp_config\1.18-20211130.085255\mcp_config-1.18-20211130.085255-mappings.txt Key:    mappings Extracting: config/joined.tsrg ===============================================================================   MainClass: net.minecraftforge.installertools.ConsoleTool   Classpath:     C:\Users\ACER\AppData\Roaming\.minecraft\libraries\net\minecraftforge\installertools\1.2.10\installertools-1.2.10.jar     C:\Users\ACER\AppData\Roaming\.minecraft\libraries\net\md-5\SpecialSource\1.10.0\SpecialSource-1.10.0.jar     C:\Users\ACER\AppData\Roaming\.minecraft\libraries\net\sf\jopt-simple\jopt-simple\5.0.4\jopt-simple-5.0.4.jar     C:\Users\ACER\AppData\Roaming\.minecraft\libraries\com\google\code\gson\gson\2.8.7\gson-2.8.7.jar     C:\Users\ACER\AppData\Roaming\.minecraft\libraries\de\siegmar\fastcsv\2.0.0\fastcsv-2.0.0.jar     C:\Users\ACER\AppData\Roaming\.minecraft\libraries\net\minecraftforge\srgutils\0.4.3\srgutils-0.4.3.jar     C:\Users\ACER\AppData\Roaming\.minecraft\libraries\org\ow2\asm\asm-commons\9.1\asm-commons-9.1.jar     C:\Users\ACER\AppData\Roaming\.minecraft\libraries\com\google\guava\guava\20.0\guava-20.0.jar     C:\Users\ACER\AppData\Roaming\.minecraft\libraries\com\opencsv\opencsv\4.4\opencsv-4.4.jar     C:\Users\ACER\AppData\Roaming\.minecraft\libraries\org\ow2\asm\asm-analysis\9.1\asm-analysis-9.1.jar     C:\Users\ACER\AppData\Roaming\.minecraft\libraries\org\ow2\asm\asm-tree\9.1\asm-tree-9.1.jar     C:\Users\ACER\AppData\Roaming\.minecraft\libraries\org\ow2\asm\asm\9.1\asm-9.1.jar     C:\Users\ACER\AppData\Roaming\.minecraft\libraries\org\apache\commons\commons-text\1.3\commons-text-1.3.jar     C:\Users\ACER\AppData\Roaming\.minecraft\libraries\org\apache\commons\commons-lang3\3.8.1\commons-lang3-3.8.1.jar     C:\Users\ACER\AppData\Roaming\.minecraft\libraries\commons-beanutils\commons-beanutils\1.9.3\commons-beanutils-1.9.3.jar     C:\Users\ACER\AppData\Roaming\.minecraft\libraries\org\apache\commons\commons-collections4\4.2\commons-collections4-4.2.jar     C:\Users\ACER\AppData\Roaming\.minecraft\libraries\commons-logging\commons-logging\1.2\commons-logging-1.2.jar     C:\Users\ACER\AppData\Roaming\.minecraft\libraries\commons-collections\commons-collections\3.2.2\commons-collections-3.2.2.jar   Args: --task, DOWNLOAD_MOJMAPS, --version, 1.18, --side, client, --output, C:\Users\ACER\AppData\Roaming\.minecraft\libraries\net\minecraft\client\1.18-20211130.085255\client-1.18-20211130.085255-mappings.txt Task: DOWNLOAD_MOJMAPS MC Version: 1.18 Side:       client Output:     C:\Users\ACER\AppData\Roaming\.minecraft\libraries\net\minecraft\client\1.18-20211130.085255\client-1.18-20211130.085255-mappings.txt javax.net.ssl.SSLHandshakeException: sun.security.validator.ValidatorException: PKIX path building failed: sun.security.provider.certpath.SunCertPathBuilderException: unable to find valid certification path to requested target     at sun.security.ssl.Alert.createSSLException(Unknown Source)     at sun.security.ssl.TransportContext.fatal(Unknown Source)     at sun.security.ssl.TransportContext.fatal(Unknown Source)     at sun.security.ssl.TransportContext.fatal(Unknown Source)     at sun.security.ssl.CertificateMessage$T12CertificateConsumer.checkServerCerts(Unknown Source)     at sun.security.ssl.CertificateMessage$T12CertificateConsumer.onCertificate(Unknown Source)     at sun.security.ssl.CertificateMessage$T12CertificateConsumer.consume(Unknown Source)     at sun.security.ssl.SSLHandshake.consume(Unknown Source)     at sun.security.ssl.HandshakeContext.dispatch(Unknown Source)     at sun.security.ssl.HandshakeContext.dispatch(Unknown Source)     at sun.security.ssl.TransportContext.dispatch(Unknown Source)     at sun.security.ssl.SSLTransport.decode(Unknown Source)     at sun.security.ssl.SSLSocketImpl.decode(Unknown Source)     at sun.security.ssl.SSLSocketImpl.readHandshakeRecord(Unknown Source)     at sun.security.ssl.SSLSocketImpl.startHandshake(Unknown Source)     at sun.security.ssl.SSLSocketImpl.startHandshake(Unknown Source)     at sun.net.www.protocol.https.HttpsClient.afterConnect(Unknown Source)     at sun.net.www.protocol.https.AbstractDelegateHttpsURLConnection.connect(Unknown Source)     at sun.net.www.protocol.http.HttpURLConnection.getInputStream0(Unknown Source)     at sun.net.www.protocol.http.HttpURLConnection.getInputStream(Unknown Source)     at sun.net.www.protocol.https.HttpsURLConnectionImpl.getInputStream(Unknown Source)     at java.net.URL.openStream(Unknown Source)     at net.minecraftforge.installertools.DownloadMojmaps.process(DownloadMojmaps.java:65)     at net.minecraftforge.installertools.ConsoleTool.main(ConsoleTool.java:55)     at sun.reflect.NativeMethodAccessorImpl.invoke0(Native Method)     at sun.reflect.NativeMethodAccessorImpl.invoke(Unknown Source)     at sun.reflect.DelegatingMethodAccessorImpl.invoke(Unknown Source)     at java.lang.reflect.Method.invoke(Unknown Source)     at net.minecraftforge.installer.actions.PostProcessors.process(PostProcessors.java:226)     at net.minecraftforge.installer.actions.ClientInstall.run(ClientInstall.java:144)     at net.minecraftforge.installer.InstallerPanel.run(InstallerPanel.java:423)     at net.minecraftforge.installer.SimpleInstaller.launchGui(SimpleInstaller.java:175)     at net.minecraftforge.installer.SimpleInstaller.main(SimpleInstaller.java:147) Caused by: sun.security.validator.ValidatorException: PKIX path building failed: sun.security.provider.certpath.SunCertPathBuilderException: unable to find valid certification path to requested target     at sun.security.validator.PKIXValidator.doBuild(Unknown Source)     at sun.security.validator.PKIXValidator.engineValidate(Unknown Source)     at sun.security.validator.Validator.validate(Unknown Source)     at sun.security.ssl.X509TrustManagerImpl.validate(Unknown Source)     at sun.security.ssl.X509TrustManagerImpl.checkTrusted(Unknown Source)     at sun.security.ssl.X509TrustManagerImpl.checkServerTrusted(Unknown Source)     ... 29 more Caused by: sun.security.provider.certpath.SunCertPathBuilderException: unable to find valid certification path to requested target     at sun.security.provider.certpath.SunCertPathBuilder.build(Unknown Source)     at sun.security.provider.certpath.SunCertPathBuilder.engineBuild(Unknown Source)     at java.security.cert.CertPathBuilder.build(Unknown Source)     ... 35 more Failed to run processor: javax.net.ssl.SSLHandshakeException:sun.security.validator.ValidatorException: PKIX path building failed: sun.security.provider.certpath.SunCertPathBuilderException: unable to find valid certification path to requested target See log for more details.     see
    • Yes, the server doesn't have a keyboard or the Screen class (@OnlyIn on the class tells you so). Use Entity#isShiftKeyDown.
    • Cloned your repository. Badger and deer failed to summon because you have not registered their attribute, with a completely different error that you have shown. Your attributes are not registered, because EntityAttributeCreationEvent is a mod bus event, but you registered the class to the forge bus. Additionally the 2nd event handler in that class (onEntityConstructed) will also not run, because you register the class to the event bus, but the method is not static.
  • Topics

  • Who's Online (See full list)

×
×
  • Create New...

Important Information

By using this site, you agree to our Privacy Policy.