Jump to content
Search In
  • More options...
Find results that contain...
Find results in...

[1.10.2] Gradlew SetupDecompWorkspace fails


untamemadman
 Share

Recommended Posts

I am trying to setup a Minecraft Forge instance for 1.10.2 however crash on task ':decompileMc'

 

 

M:\untamemadman\Minecraft Mod\1.10\Test>gradlew setupDecompWorkspace
Etag download for http://files.minecraftforge.net/maven/net/minecraftforge/forge/json failed with code 400
Error occurred parsing version!
This mapping 'snapshot_20160518' was designed for MC 1.9.4! Use at your own peril.
#################################################
         ForgeGradle 2.2-SNAPSHOT-c438b06
  https://github.com/MinecraftForge/ForgeGradle
#################################################
               Powered by MCP unknown
             http://modcoderpack.com
         by: Searge, ProfMobius, Fesh0r,
         R4wk, ZeuX, IngisKahn, bspkrs
#################################################
:deobfCompileDummyTask
:deobfProvidedDummyTask
:getVersionJson
:extractUserdev
:extractDependencyATs SKIPPED
:extractMcpData SKIPPED
:extractMcpMappings SKIPPED
:genSrgs SKIPPED
:downloadClient SKIPPED
:downloadServer SKIPPED
:splitServerJar SKIPPED
:mergeJars SKIPPED
:deobfMcSRG SKIPPED
:decompileMc
[Fatal Error] jsr305-3.0.1.pom:2:1: Content is not allowed in prolog.
[Fatal Error] netty-1.6.pom:2:1: Content is not allowed in prolog.
[Fatal Error] authlib-1.5.22.pom:2:1: Content is not allowed in prolog.
[Fatal Error] fastutil-7.0.12_mojang.pom:2:1: Content is not allowed in prolog.
:decompileMc FAILED

FAILURE: Build failed with an exception.

* What went wrong:
Execution failed for task ':decompileMc'.
> Could not resolve all dependencies for configuration ':forgeGradleMcDeps'.
   > Could not resolve com.google.code.findbugs:jsr305:3.0.1.
     Required by:
         com.yourname.modid:Test:1.0
      > Could not resolve com.google.code.findbugs:jsr305:3.0.1.
         > Could not parse POM https://repo1.maven.org/maven2/com/google/code/findbugs/jsr305/3.0.1/jsr305-3.0.1.pom
            > Content is not allowed in prolog.
      > Could not resolve com.google.code.findbugs:jsr305:3.0.1.
         > Could not get resource 'https://libraries.minecraft.net/com/google/code/findbugs/jsr305/3.0.1/jsr305-3.0.1.pom'.
            > Could not HEAD 'https://libraries.minecraft.net/com/google/code/findbugs/jsr305/3.0.1/jsr305-3.0.1.pom'. Received status code 403 from server: Forbidden
   > Could not resolve com.mojang:netty:1.6.
     Required by:
         com.yourname.modid:Test:1.0
      > Could not resolve com.mojang:netty:1.6.
         > Could not parse POM https://libraries.minecraft.net/com/mojang/netty/1.6/netty-1.6.pom
            > Content is not allowed in prolog.
   > Could not resolve com.mojang:authlib:1.5.22.
     Required by:
         com.yourname.modid:Test:1.0
      > Could not resolve com.mojang:authlib:1.5.22.
         > Could not parse POM https://libraries.minecraft.net/com/mojang/authlib/1.5.22/authlib-1.5.22.pom
            > Content is not allowed in prolog.
   > Could not resolve it.unimi.dsi:fastutil:7.0.12_mojang.
     Required by:
         com.yourname.modid:Test:1.0
      > Could not resolve it.unimi.dsi:fastutil:7.0.12_mojang.
         > Could not parse POM https://libraries.minecraft.net/it/unimi/dsi/fastutil/7.0.12_mojang/fastutil-7.0.12_mojang.pom
            > Content is not allowed in prolog.
   > Could not resolve com.google.code.findbugs:jsr305:3.0.1.
     Required by:
         com.yourname.modid:Test:1.0
      > Could not resolve com.google.code.findbugs:jsr305:3.0.1.
         > Could not parse POM https://repo1.maven.org/maven2/com/google/code/findbugs/jsr305/3.0.1/jsr305-3.0.1.pom
            > Content is not allowed in prolog.
      > Could not resolve com.google.code.findbugs:jsr305:3.0.1.
         > Could not get resource 'https://libraries.minecraft.net/com/google/code/findbugs/jsr305/3.0.1/jsr305-3.0.1.pom'.
            > Could not HEAD 'https://libraries.minecraft.net/com/google/code/findbugs/jsr305/3.0.1/jsr305-3.0.1.pom'. Received status code 403 from server: Forbidden

* Try:
Run with --stacktrace option to get the stack trace. Run with --info or --debug option to get more log output.

BUILD FAILED

Total time: 26.391 secs

 

 

And with --stacktrace

 

 

M:\untamemadman\Minecraft Mod\1.10\Test>gradlew setupDecompWorkspace --stacktrace
Etag download for http://files.minecraftforge.net/maven/net/minecraftforge/forge/json failed with code 400
Error occurred parsing version!
This mapping 'snapshot_20160518' was designed for MC 1.9.4! Use at your own peril.
#################################################
         ForgeGradle 2.2-SNAPSHOT-c438b06
  https://github.com/MinecraftForge/ForgeGradle
#################################################
               Powered by MCP unknown
             http://modcoderpack.com
         by: Searge, ProfMobius, Fesh0r,
         R4wk, ZeuX, IngisKahn, bspkrs
#################################################
:deobfCompileDummyTask
:deobfProvidedDummyTask
:getVersionJson
:extractUserdev UP-TO-DATE
:extractDependencyATs SKIPPED
:extractMcpData SKIPPED
:extractMcpMappings SKIPPED
:genSrgs SKIPPED
:downloadClient SKIPPED
:downloadServer SKIPPED
:splitServerJar SKIPPED
:mergeJars SKIPPED
:deobfMcSRG SKIPPED
:decompileMc
[Fatal Error] jsr305-3.0.1.pom:2:1: Content is not allowed in prolog.
[Fatal Error] netty-1.6.pom:2:1: Content is not allowed in prolog.
[Fatal Error] authlib-1.5.22.pom:2:1: Content is not allowed in prolog.
[Fatal Error] fastutil-7.0.12_mojang.pom:2:1: Content is not allowed in prolog.
:decompileMc FAILED

FAILURE: Build failed with an exception.

* What went wrong:
Execution failed for task ':decompileMc'.
> Could not resolve all dependencies for configuration ':forgeGradleMcDeps'.
   > Could not resolve com.google.code.findbugs:jsr305:3.0.1.
     Required by:
         com.yourname.modid:Test:1.0
      > Could not resolve com.google.code.findbugs:jsr305:3.0.1.
         > Could not parse POM https://repo1.maven.org/maven2/com/google/code/findbugs/jsr305/3.0.1/jsr305-3.0.1.pom
            > Content is not allowed in prolog.
      > Could not resolve com.google.code.findbugs:jsr305:3.0.1.
         > Could not get resource 'https://libraries.minecraft.net/com/google/code/findbugs/jsr305/3.0.1/jsr305-3.0.1.pom'.
            > Could not HEAD 'https://libraries.minecraft.net/com/google/code/findbugs/jsr305/3.0.1/jsr305-3.0.1.pom'. Received status code 403 from server: Forbidden
   > Could not resolve com.mojang:netty:1.6.
     Required by:
         com.yourname.modid:Test:1.0
      > Could not resolve com.mojang:netty:1.6.
         > Could not parse POM https://libraries.minecraft.net/com/mojang/netty/1.6/netty-1.6.pom
            > Content is not allowed in prolog.
   > Could not resolve com.mojang:authlib:1.5.22.
     Required by:
         com.yourname.modid:Test:1.0
      > Could not resolve com.mojang:authlib:1.5.22.
         > Could not parse POM https://libraries.minecraft.net/com/mojang/authlib/1.5.22/authlib-1.5.22.pom
            > Content is not allowed in prolog.
   > Could not resolve it.unimi.dsi:fastutil:7.0.12_mojang.
     Required by:
         com.yourname.modid:Test:1.0
      > Could not resolve it.unimi.dsi:fastutil:7.0.12_mojang.
         > Could not parse POM https://libraries.minecraft.net/it/unimi/dsi/fastutil/7.0.12_mojang/fastutil-7.0.12_mojang.pom
            > Content is not allowed in prolog.
   > Could not resolve com.google.code.findbugs:jsr305:3.0.1.
     Required by:
         com.yourname.modid:Test:1.0
      > Could not resolve com.google.code.findbugs:jsr305:3.0.1.
         > Could not parse POM https://repo1.maven.org/maven2/com/google/code/findbugs/jsr305/3.0.1/jsr305-3.0.1.pom
            > Content is not allowed in prolog.
      > Could not resolve com.google.code.findbugs:jsr305:3.0.1.
         > Could not get resource 'https://libraries.minecraft.net/com/google/code/findbugs/jsr305/3.0.1/jsr305-3.0.1.pom'.
            > Could not HEAD 'https://libraries.minecraft.net/com/google/code/findbugs/jsr305/3.0.1/jsr305-3.0.1.pom'. Received status code 403 from server: Forbidden

* Try:
Run with --info or --debug option to get more log output.

* Exception is:
org.gradle.api.tasks.TaskExecutionException: Execution failed for task ':decompileMc'.
        at org.gradle.api.internal.tasks.execution.ExecuteActionsTaskExecuter.executeActions(ExecuteActionsTaskExecuter.java:69)
        at org.gradle.api.internal.tasks.execution.ExecuteActionsTaskExecuter.execute(ExecuteActionsTaskExecuter.java:46)
        at org.gradle.api.internal.tasks.execution.PostExecutionAnalysisTaskExecuter.execute(PostExecutionAnalysisTaskExecuter.java:35)
        at org.gradle.api.internal.tasks.execution.SkipUpToDateTaskExecuter.execute(SkipUpToDateTaskExecuter.java:66)
        at org.gradle.api.internal.tasks.execution.ValidatingTaskExecuter.execute(ValidatingTaskExecuter.java:58)
        at org.gradle.api.internal.tasks.execution.SkipEmptySourceFilesTaskExecuter.execute(SkipEmptySourceFilesTaskExecuter.java:52)
        at org.gradle.api.internal.tasks.execution.SkipTaskWithNoActionsExecuter.execute(SkipTaskWithNoActionsExecuter.java:52)
        at org.gradle.api.internal.tasks.execution.SkipOnlyIfTaskExecuter.execute(SkipOnlyIfTaskExecuter.java:53)
        at org.gradle.api.internal.tasks.execution.ExecuteAtMostOnceTaskExecuter.execute(ExecuteAtMostOnceTaskExecuter.java:43)
        at org.gradle.execution.taskgraph.DefaultTaskGraphExecuter$EventFiringTaskWorker.execute(DefaultTaskGraphExecuter.java:203)
        at org.gradle.execution.taskgraph.DefaultTaskGraphExecuter$EventFiringTaskWorker.execute(DefaultTaskGraphExecuter.java:185)
        at org.gradle.execution.taskgraph.AbstractTaskPlanExecutor$TaskExecutorWorker.processTask(AbstractTaskPlanExecutor.java:66)
        at org.gradle.execution.taskgraph.AbstractTaskPlanExecutor$TaskExecutorWorker.run(AbstractTaskPlanExecutor.java:50)
        at org.gradle.execution.taskgraph.DefaultTaskPlanExecutor.process(DefaultTaskPlanExecutor.java:25)
        at org.gradle.execution.taskgraph.DefaultTaskGraphExecuter.execute(DefaultTaskGraphExecuter.java:110)
        at org.gradle.execution.SelectedTaskExecutionAction.execute(SelectedTaskExecutionAction.java:37)
        at org.gradle.execution.DefaultBuildExecuter.execute(DefaultBuildExecuter.java:37)
        at org.gradle.execution.DefaultBuildExecuter.access$000(DefaultBuildExecuter.java:23)
        at org.gradle.execution.DefaultBuildExecuter$1.proceed(DefaultBuildExecuter.java:43)
        at org.gradle.execution.DryRunBuildExecutionAction.execute(DryRunBuildExecutionAction.java:32)
        at org.gradle.execution.DefaultBuildExecuter.execute(DefaultBuildExecuter.java:37)
        at org.gradle.execution.DefaultBuildExecuter.execute(DefaultBuildExecuter.java:30)
        at org.gradle.initialization.DefaultGradleLauncher$4.run(DefaultGradleLauncher.java:153)
        at org.gradle.internal.Factories$1.create(Factories.java:22)
        at org.gradle.internal.progress.DefaultBuildOperationExecutor.run(DefaultBuildOperationExecutor.java:91)
        at org.gradle.internal.progress.DefaultBuildOperationExecutor.run(DefaultBuildOperationExecutor.java:53)
        at org.gradle.initialization.DefaultGradleLauncher.doBuildStages(DefaultGradleLauncher.java:150)
        at org.gradle.initialization.DefaultGradleLauncher.access$200(DefaultGradleLauncher.java:32)
        at org.gradle.initialization.DefaultGradleLauncher$1.create(DefaultGradleLauncher.java:98)
        at org.gradle.initialization.DefaultGradleLauncher$1.create(DefaultGradleLauncher.java:92)
        at org.gradle.internal.progress.DefaultBuildOperationExecutor.run(DefaultBuildOperationExecutor.java:91)
        at org.gradle.internal.progress.DefaultBuildOperationExecutor.run(DefaultBuildOperationExecutor.java:63)
        at org.gradle.initialization.DefaultGradleLauncher.doBuild(DefaultGradleLauncher.java:92)
        at org.gradle.initialization.DefaultGradleLauncher.run(DefaultGradleLauncher.java:83)
        at org.gradle.launcher.exec.InProcessBuildActionExecuter$DefaultBuildController.run(InProcessBuildActionExecuter.java:99)
        at org.gradle.tooling.internal.provider.ExecuteBuildActionRunner.run(ExecuteBuildActionRunner.java:28)
        at org.gradle.launcher.exec.ChainingBuildActionRunner.run(ChainingBuildActionRunner.java:35)
        at org.gradle.launcher.exec.InProcessBuildActionExecuter.execute(InProcessBuildActionExecuter.java:48)
        at org.gradle.launcher.exec.InProcessBuildActionExecuter.execute(InProcessBuildActionExecuter.java:30)
        at org.gradle.launcher.exec.ContinuousBuildActionExecuter.execute(ContinuousBuildActionExecuter.java:81)
        at org.gradle.launcher.exec.ContinuousBuildActionExecuter.execute(ContinuousBuildActionExecuter.java:46)
        at org.gradle.launcher.exec.DaemonUsageSuggestingBuildActionExecuter.execute(DaemonUsageSuggestingBuildActionExecuter.java:51)
        at org.gradle.launcher.exec.DaemonUsageSuggestingBuildActionExecuter.execute(DaemonUsageSuggestingBuildActionExecuter.java:28)
        at org.gradle.launcher.cli.RunBuildAction.run(RunBuildAction.java:43)
        at org.gradle.internal.Actions$RunnableActionAdapter.execute(Actions.java:173)
        at org.gradle.launcher.cli.CommandLineActionFactory$ParseAndBuildAction.execute(CommandLineActionFactory.java:239)
        at org.gradle.launcher.cli.CommandLineActionFactory$ParseAndBuildAction.execute(CommandLineActionFactory.java:212)
        at org.gradle.launcher.cli.JavaRuntimeValidationAction.execute(JavaRuntimeValidationAction.java:35)
        at org.gradle.launcher.cli.JavaRuntimeValidationAction.execute(JavaRuntimeValidationAction.java:24)
        at org.gradle.launcher.cli.ExceptionReportingAction.execute(ExceptionReportingAction.java:33)
        at org.gradle.launcher.cli.ExceptionReportingAction.execute(ExceptionReportingAction.java:22)
        at org.gradle.launcher.cli.CommandLineActionFactory$WithLogging.execute(CommandLineActionFactory.java:205)
        at org.gradle.launcher.cli.CommandLineActionFactory$WithLogging.execute(CommandLineActionFactory.java:169)
        at org.gradle.launcher.Main.doAction(Main.java:33)
        at org.gradle.launcher.bootstrap.EntryPoint.run(EntryPoint.java:45)
        at org.gradle.launcher.bootstrap.ProcessBootstrap.runNoExit(ProcessBootstrap.java:55)
        at org.gradle.launcher.bootstrap.ProcessBootstrap.run(ProcessBootstrap.java:36)
        at org.gradle.launcher.GradleMain.main(GradleMain.java:23)
        at org.gradle.wrapper.BootstrapMainStarter.start(BootstrapMainStarter.java:30)
        at org.gradle.wrapper.WrapperExecutor.execute(WrapperExecutor.java:127)
        at org.gradle.wrapper.GradleWrapperMain.main(GradleWrapperMain.java:61)
Caused by: org.gradle.api.artifacts.ResolveException: Could not resolve all dependencies for configuration ':forgeGradleMcDeps'.
        at org.gradle.api.internal.artifacts.ivyservice.DefaultLenientConfiguration.rethrowFailure(DefaultLenientConfiguration.java:62)
        at org.gradle.api.internal.artifacts.ivyservice.DefaultResolvedConfiguration.rethrowFailure(DefaultResolvedConfiguration.java:36)
        at org.gradle.api.internal.artifacts.ivyservice.SelfResolvingDependencyConfigurationResolver$FilesAggregatingResolvedConfiguration.rethrowFailure(SelfResolvingDependencyConfigurationResolver.java:112)
        at org.gradle.api.internal.artifacts.ivyservice.ErrorHandlingConfigurationResolver$ErrorHandlingResolvedConfiguration.rethrowFailure(ErrorHandlingConfigurationResolver.java:189)
        at org.gradle.api.internal.artifacts.configurations.DefaultConfiguration$ConfigurationFileCollection.getFiles(DefaultConfiguration.java:669)
        at org.gradle.api.internal.artifacts.configurations.DefaultConfiguration.getFiles(DefaultConfiguration.java:293)
        at org.gradle.api.internal.artifacts.configurations.DefaultConfiguration_Decorated.getFiles(Unknown Source)
        at org.gradle.api.internal.file.AbstractFileCollection.iterator(AbstractFileCollection.java:65)
        at net.minecraftforge.gradle.tasks.ApplyFernFlowerTask.applyFernFlower(ApplyFernFlowerTask.java:97)
        at org.gradle.internal.reflect.JavaMethod.invoke(JavaMethod.java:75)
        at org.gradle.api.internal.project.taskfactory.AnnotationProcessingTaskFactory$StandardTaskAction.doExecute(AnnotationProcessingTaskFactory.java:228)
        at org.gradle.api.internal.project.taskfactory.AnnotationProcessingTaskFactory$StandardTaskAction.execute(AnnotationProcessingTaskFactory.java:221)
        at org.gradle.api.internal.project.taskfactory.AnnotationProcessingTaskFactory$StandardTaskAction.execute(AnnotationProcessingTaskFactory.java:210)
        at org.gradle.api.internal.AbstractTask$TaskActionWrapper.execute(AbstractTask.java:621)
        at org.gradle.api.internal.AbstractTask$TaskActionWrapper.execute(AbstractTask.java:604)
        at org.gradle.api.internal.tasks.execution.ExecuteActionsTaskExecuter.executeAction(ExecuteActionsTaskExecuter.java:80)
        at org.gradle.api.internal.tasks.execution.ExecuteActionsTaskExecuter.executeActions(ExecuteActionsTaskExecuter.java:61)
        ... 60 more
Caused by: org.gradle.internal.resolve.ModuleVersionResolveException: Could not resolve com.google.code.findbugs:jsr305:3.0.1.
Required by:
    com.yourname.modid:Test:1.0
        at org.gradle.api.internal.artifacts.ivyservice.ivyresolve.RepositoryChainComponentMetaDataResolver.resolveModule(RepositoryChainComponentMetaDataResolver.java:83)
        at org.gradle.api.internal.artifacts.ivyservice.ivyresolve.RepositoryChainComponentMetaDataResolver.resolve(RepositoryChainComponentMetaDataResolver.java:59)
        at org.gradle.api.internal.artifacts.ivyservice.resolveengine.ComponentResolversChain$ComponentMetaDataResolverChain.resolve(ComponentResolversChain.java:80)
        at org.gradle.api.internal.artifacts.ivyservice.clientmodule.ClientModuleResolver.resolve(ClientModuleResolver.java:44)
        at org.gradle.api.internal.artifacts.ivyservice.resolveengine.graph.DependencyGraphBuilder$ModuleVersionResolveState.resolve(DependencyGraphBuilder.java:564)
        at org.gradle.api.internal.artifacts.ivyservice.resolveengine.graph.DependencyGraphBuilder$ModuleVersionResolveState.getMetaData(DependencyGraphBuilder.java:574)
        at org.gradle.api.internal.artifacts.ivyservice.resolveengine.graph.DependencyGraphBuilder$DependencyEdge.calculateTargetConfigurations(DependencyGraphBuilder.java:260)
        at org.gradle.api.internal.artifacts.ivyservice.resolveengine.graph.DependencyGraphBuilder$DependencyEdge.attachToTargetConfigurations(DependencyGraphBuilder.java:234)
        at org.gradle.api.internal.artifacts.ivyservice.resolveengine.graph.DependencyGraphBuilder.traverseGraph(DependencyGraphBuilder.java:141)
        at org.gradle.api.internal.artifacts.ivyservice.resolveengine.graph.DependencyGraphBuilder.resolve(DependencyGraphBuilder.java:79)
        at org.gradle.api.internal.artifacts.ivyservice.resolveengine.DefaultArtifactDependencyResolver$1.execute(DefaultArtifactDependencyResolver.java:90)
        at org.gradle.api.internal.artifacts.ivyservice.resolveengine.DefaultArtifactDependencyResolver$1.execute(DefaultArtifactDependencyResolver.java:80)
        at org.gradle.internal.Transformers$4.transform(Transformers.java:169)
        at org.gradle.api.internal.artifacts.ivyservice.DefaultIvyContextManager.withIvy(DefaultIvyContextManager.java:61)
        at org.gradle.api.internal.artifacts.ivyservice.DefaultIvyContextManager.withIvy(DefaultIvyContextManager.java:39)
        at org.gradle.api.internal.artifacts.ivyservice.resolveengine.DefaultArtifactDependencyResolver.resolve(DefaultArtifactDependencyResolver.java:80)
        at org.gradle.api.internal.artifacts.ivyservice.CacheLockingArtifactDependencyResolver$1.run(CacheLockingArtifactDependencyResolver.java:41)
        at org.gradle.internal.Factories$1.create(Factories.java:22)
        at org.gradle.cache.internal.DefaultCacheAccess.useCache(DefaultCacheAccess.java:192)
        at org.gradle.cache.internal.DefaultCacheAccess.useCache(DefaultCacheAccess.java:175)
        at org.gradle.cache.internal.DefaultPersistentDirectoryStore.useCache(DefaultPersistentDirectoryStore.java:106)
        at org.gradle.cache.internal.DefaultCacheFactory$ReferenceTrackingCache.useCache(DefaultCacheFactory.java:187)
        at org.gradle.api.internal.artifacts.ivyservice.DefaultCacheLockingManager.useCache(DefaultCacheLockingManager.java:64)
        at org.gradle.api.internal.artifacts.ivyservice.CacheLockingArtifactDependencyResolver.resolve(CacheLockingArtifactDependencyResolver.java:39)
        at org.gradle.api.internal.artifacts.ivyservice.DefaultConfigurationResolver.resolve(DefaultConfigurationResolver.java:91)
        at org.gradle.api.internal.artifacts.ivyservice.SelfResolvingDependencyConfigurationResolver.resolve(SelfResolvingDependencyConfigurationResolver.java:40)
        at org.gradle.api.internal.artifacts.ivyservice.ShortCircuitEmptyConfigurationResolver.resolve(ShortCircuitEmptyConfigurationResolver.java:52)
        at org.gradle.api.internal.artifacts.ivyservice.ErrorHandlingConfigurationResolver.resolve(ErrorHandlingConfigurationResolver.java:43)
        at org.gradle.api.internal.artifacts.configurations.DefaultConfiguration.resolveGraphIfRequired(DefaultConfiguration.java:372)
        at org.gradle.api.internal.artifacts.configurations.DefaultConfiguration.resolveNow(DefaultConfiguration.java:347)
        at org.gradle.api.internal.artifacts.configurations.DefaultConfiguration.getResolvedConfiguration(DefaultConfiguration.java:340)
        at org.gradle.api.internal.artifacts.configurations.DefaultConfiguration_Decorated.getResolvedConfiguration(Unknown Source)
        at org.gradle.api.internal.artifacts.configurations.DefaultConfiguration$ConfigurationFileCollection.getFiles(DefaultConfiguration.java:667)
        ... 72 more
Caused by: org.gradle.internal.resolve.ModuleVersionResolveException: Could not resolve com.google.code.findbugs:jsr305:3.0.1.
        at org.gradle.api.internal.artifacts.ivyservice.ivyresolve.ErrorHandlingModuleComponentRepository$ErrorHandlingModuleComponentRepositoryAccess.resolveComponentMetaData(ErrorHandlingModuleComponentRepository.java:91)
        at org.gradle.api.internal.artifacts.ivyservice.ivyresolve.ComponentMetaDataResolveState.process(ComponentMetaDataResolveState.java:66)
        at org.gradle.api.internal.artifacts.ivyservice.ivyresolve.ComponentMetaDataResolveState.resolve(ComponentMetaDataResolveState.java:58)
        at org.gradle.api.internal.artifacts.ivyservice.ivyresolve.RepositoryChainComponentMetaDataResolver.findBestMatch(RepositoryChainComponentMetaDataResolver.java:116)
        at org.gradle.api.internal.artifacts.ivyservice.ivyresolve.RepositoryChainComponentMetaDataResolver.findBestMatch(RepositoryChainComponentMetaDataResolver.java:99)
        at org.gradle.api.internal.artifacts.ivyservice.ivyresolve.RepositoryChainComponentMetaDataResolver.resolveModule(RepositoryChainComponentMetaDataResolver.java:72)
        ... 104 more
Caused by: org.gradle.api.internal.artifacts.ivyservice.ivyresolve.parser.MetaDataParseException: Could not parse POM https://repo1.maven.org/maven2/com/google/code/findbugs/jsr305/3.0.1/jsr305-3.0.1.pom
        at org.gradle.api.internal.artifacts.ivyservice.ivyresolve.parser.PomReader$1.transform(PomReader.java:100)
        at org.gradle.api.internal.artifacts.ivyservice.ivyresolve.parser.PomReader$1.transform(PomReader.java:95)
        at org.gradle.internal.resource.AbstractExternalResource.withContent(AbstractExternalResource.java:96)
        at org.gradle.api.internal.artifacts.ivyservice.ivyresolve.parser.PomReader.<init>(PomReader.java:95)
        at org.gradle.api.internal.artifacts.ivyservice.ivyresolve.parser.GradlePomModuleDescriptorParser.doParseDescriptor(GradlePomModuleDescriptorParser.java:67)
        at org.gradle.api.internal.artifacts.ivyservice.ivyresolve.parser.GradlePomModuleDescriptorParser.doParseDescriptor(GradlePomModuleDescriptorParser.java:46)
        at org.gradle.api.internal.artifacts.ivyservice.ivyresolve.parser.AbstractModuleDescriptorParser.parseDescriptor(AbstractModuleDescriptorParser.java:44)
        at org.gradle.api.internal.artifacts.ivyservice.ivyresolve.parser.AbstractModuleDescriptorParser.parseMetaData(AbstractModuleDescriptorParser.java:39)
        at org.gradle.api.internal.artifacts.repositories.resolver.MavenResolver.parseMetaDataFromResource(MavenResolver.java:199)
        at org.gradle.api.internal.artifacts.repositories.resolver.ExternalResourceResolver.parseMetaDataFromArtifact(ExternalResourceResolver.java:170)
        at org.gradle.api.internal.artifacts.repositories.resolver.ExternalResourceResolver.resolveStaticDependency(ExternalResourceResolver.java:143)
        at org.gradle.api.internal.artifacts.repositories.resolver.MavenResolver.doResolveComponentMetaData(MavenResolver.java:93)
        at org.gradle.api.internal.artifacts.repositories.resolver.ExternalResourceResolver$RemoteRepositoryAccess.resolveComponentMetaData(ExternalResourceResolver.java:409)
        at org.gradle.api.internal.artifacts.ivyservice.ivyresolve.CacheLockReleasingModuleComponentsRepository$LockReleasingRepositoryAccess$2.run(CacheLockReleasingModuleComponentsRepository.java:71)
        at org.gradle.internal.Factories$1.create(Factories.java:22)
        at org.gradle.cache.internal.DefaultCacheAccess.longRunningOperation(DefaultCacheAccess.java:242)
        at org.gradle.cache.internal.DefaultCacheAccess.longRunningOperation(DefaultCacheAccess.java:313)
        at org.gradle.cache.internal.DefaultPersistentDirectoryStore.longRunningOperation(DefaultPersistentDirectoryStore.java:114)
        at org.gradle.cache.internal.DefaultCacheFactory$ReferenceTrackingCache.longRunningOperation(DefaultCacheFactory.java:179)
        at org.gradle.api.internal.artifacts.ivyservice.DefaultCacheLockingManager.longRunningOperation(DefaultCacheLockingManager.java:56)
        at org.gradle.api.internal.artifacts.ivyservice.ivyresolve.CacheLockReleasingModuleComponentsRepository$LockReleasingRepositoryAccess.resolveComponentMetaData(CacheLockReleasingModuleComponentsRepository.java:69)
        at org.gradle.api.internal.artifacts.ivyservice.ivyresolve.CachingModuleComponentRepository$ResolveAndCacheRepositoryAccess.resolveComponentMetaData(CachingModuleComponentRepository.java:297)
        at org.gradle.api.internal.artifacts.ivyservice.ivyresolve.BaseModuleComponentRepositoryAccess.resolveComponentMetaData(BaseModuleComponentRepositoryAccess.java:42)
        at org.gradle.api.internal.artifacts.ivyservice.ivyresolve.memcache.InMemoryCachedModuleComponentRepository$CachedAccess.resolveComponentMetaData(InMemoryCachedModuleComponentRepository.java:75)
        at org.gradle.api.internal.artifacts.ivyservice.ivyresolve.ErrorHandlingModuleComponentRepository$ErrorHandlingModuleComponentRepositoryAccess.resolveComponentMetaData(ErrorHandlingModuleComponentRepository.java:89)
        ... 109 more
Caused by: org.xml.sax.SAXParseException; systemId: file:/C:/Users/untamemadman/.gradle/caches/modules-2/files-2.1/com.google.code.findbugs/jsr305/3.0.1/d04690f71f3393e23f30998d9534365274fa5f9f/jsr305-3.0.1.pom; lineNumber: 2; columnNumber: 1; Content is not allowed in prolog.
        at org.apache.xerces.parsers.DOMParser.parse(Unknown Source)
        at org.apache.xerces.jaxp.DocumentBuilderImpl.parse(Unknown Source)
        at org.gradle.api.internal.artifacts.ivyservice.ivyresolve.parser.PomReader.parseToDom(PomReader.java:208)
        at org.gradle.api.internal.artifacts.ivyservice.ivyresolve.parser.PomReader$1.transform(PomReader.java:98)
        ... 133 more


BUILD FAILED

Total time: 28.85 secs

 

 

 

Could anyone tell me whats going wrong here and how to fix it.

 

Thanks

untamemadman

Link to comment
Share on other sites

Join the conversation

You can post now and register later. If you have an account, sign in now to post with your account.
Note: Your post will require moderator approval before it will be visible.

Guest
Reply to this topic...

×   Pasted as rich text.   Restore formatting

  Only 75 emoji are allowed.

×   Your link has been automatically embedded.   Display as a link instead

×   Your previous content has been restored.   Clear editor

×   You cannot paste images directly. Upload or insert images from URL.

 Share



  • Recently Browsing

    No registered users viewing this page.

  • Posts

    • For anyone looking here in the future, I never solved this problem, but I found a workaround by simply ungrabbing the mouse, preventing mouse movement.
    • [Info: 2022-01-23 01:24:44.6727079: NetQueue.cpp(157)] NetQueue: Setting up. [Info: 2022-01-23 01:24:44.6754351: mainWindows.cpp(80)] Running launcher bootstrap (version 1037) [Info: 2022-01-23 01:24:44.6753897: NetQueue.cpp(575)] NetQueue: worker thread started. [Error: 2022-01-23 01:24:44.8622618: localization.cpp(110)] No translation found for "Unable to download <game>. Please try again later." [Error: 2022-01-23 01:24:44.8624151: localization.cpp(110)] No translation found for "Unable to download the <game> Native Launcher." [Error: 2022-01-23 01:24:44.8625217: localization.cpp(110)] No translation found for "Unable to update the <game> Game Launcher." [Error: 2022-01-23 01:24:44.8626168: localization.cpp(110)] No translation found for "Unable to download the <game> Runtime Environment." [Error: 2022-01-23 01:24:44.8626822: localization.cpp(110)] No translation found for "Unable to update the <game> Game Launcher." [Error: 2022-01-23 01:24:44.8627756: localization.cpp(110)] No translation found for "Unable to update the <game> Runtime Environment." [Error: 2022-01-23 01:24:44.8629294: localization.cpp(110)] No translation found for "Unable to update the <game> Native Launcher." [Error: 2022-01-23 01:24:44.8630314: localization.cpp(110)] No translation found for "Unable to relaunch the Minecraft bootstrap." [Error: 2022-01-23 01:24:44.8630933: localization.cpp(110)] No translation found for "Unable to start the <game> Runtime Environment. This is most likely caused by a corruption. Please try to reinstall <game>." [Error: 2022-01-23 01:24:44.8632362: localization.cpp(110)] No translation found for "Unable to start <game>, if you are running from a dmg, please drag to Applications and try again." [Error: 2022-01-23 01:24:44.8633546: localization.cpp(110)] No translation found for "Unable to initialize the network library." [Error: 2022-01-23 01:24:44.8634209: localization.cpp(110)] No translation found for "<game> Launcher" [Info: 2022-01-23 01:24:44.8668528: mainWindows.cpp(167)] Triggering reopen event... [Info: 2022-01-23 01:24:44.8670715: mainWindows.cpp(170)] Success         [Info: 2022-01-23 01:24:44.6727079: NetQueue.cpp(157)] NetQueue: Setting up. [Info: 2022-01-23 01:24:44.6754351: mainWindows.cpp(80)] Running launcher bootstrap (version 1037) [Info: 2022-01-23 01:24:44.6753897: NetQueue.cpp(575)] NetQueue: worker thread started. [Error: 2022-01-23 01:24:44.8622618: localization.cpp(110)] No translation found for "Unable to download <game>. Please try again later." [Error: 2022-01-23 01:24:44.8624151: localization.cpp(110)] No translation found for "Unable to download the <game> Native Launcher." [Error: 2022-01-23 01:24:44.8625217: localization.cpp(110)] No translation found for "Unable to update the <game> Game Launcher." [Error: 2022-01-23 01:24:44.8626168: localization.cpp(110)] No translation found for "Unable to download the <game> Runtime Environment." [Error: 2022-01-23 01:24:44.8626822: localization.cpp(110)] No translation found for "Unable to update the <game> Game Launcher." [Error: 2022-01-23 01:24:44.8627756: localization.cpp(110)] No translation found for "Unable to update the <game> Runtime Environment." [Error: 2022-01-23 01:24:44.8629294: localization.cpp(110)] No translation found for "Unable to update the <game> Native Launcher." [Error: 2022-01-23 01:24:44.8630314: localization.cpp(110)] No translation found for "Unable to relaunch the Minecraft bootstrap." [Error: 2022-01-23 01:24:44.8630933: localization.cpp(110)] No translation found for "Unable to start the <game> Runtime Environment. This is most likely caused by a corruption. Please try to reinstall <game>." [Error: 2022-01-23 01:24:44.8632362: localization.cpp(110)] No translation found for "Unable to start <game>, if you are running from a dmg, please drag to Applications and try again." [Error: 2022-01-23 01:24:44.8633546: localization.cpp(110)] No translation found for "Unable to initialize the network library." [Error: 2022-01-23 01:24:44.8634209: localization.cpp(110)] No translation found for "<game> Launcher" [Info: 2022-01-23 01:24:44.8668528: mainWindows.cpp(167)] Triggering reopen event... [Info: 2022-01-23 01:24:44.8670715: mainWindows.cpp(170)] Success                 that is everything in my .minecraft launcher_log.txt          
    • Because it's more of an in-between and half completed version of latest (1.18)
    • Why... Also Luis_ST so it is new BlockItem(BlockInit.COMPRESSED_SOULS_BLOCK.get(), new Item.properties() instead?
  • Topics

  • Who's Online (See full list)

×
×
  • Create New...

Important Information

By using this site, you agree to our Privacy Policy.