Jump to content
Search In
  • More options...
Find results that contain...
Find results in...

[1.9.4] Gradlew Build fails for task compileJava


Legoboy0109
 Share

Recommended Posts

I'm trying to compile my mod for 1.9.4, but I keep getting this error. I tried deleting some buggy, unused code from my mod files and it still won't work. This is the error message.

 

Microsoft Windows [Version 10.0.10586]

© 2015 Microsoft Corporation. All rights reserved.

 

C:\Users\#######>cd "C:\Users\#######\Desktop\Forge 1.9.4"

 

C:\Users\#######\Desktop\Forge 1.9.4>gradlew build

#################################################

        ForgeGradle 2.2-SNAPSHOT-c438b06

  https://github.com/MinecraftForge/ForgeGradle

#################################################

              Powered by MCP unknown

            http://modcoderpack.com

        by: Searge, ProfMobius, Fesh0r,

        R4wk, ZeuX, IngisKahn, bspkrs

#################################################

:deobfCompileDummyTask

:getVersionJson

:extractUserdev UP-TO-DATE

:downloadClient SKIPPED

:downloadServer SKIPPED

:splitServerJar SKIPPED

:mergeJars SKIPPED

:applyBinaryPatches SKIPPED

:deobfProvidedDummyTask

:extractDependencyATs SKIPPED

:extractMcpData SKIPPED

:extractMcpMappings SKIPPED

:genSrgs SKIPPED

:deobfMcMCP SKIPPED

:sourceApiJava UP-TO-DATE

:compileApiJava UP-TO-DATE

:processApiResources UP-TO-DATE

:apiClasses UP-TO-DATE

:sourceMainJava

:compileJava

warning: [options] bootstrap class path not set in conjunction with -source 1.6

C:\Users\#######\Desktop\Forge 1.9.4\build\sources\main\java\com\Legoboy0109\CousinCore\containers\ContainerSteamEngine.java:4: error: package com.sun.istack.internal does not exist

import com.sun.istack.internal.Nullable;

                              ^

C:\Users\#######\Desktop\Forge 1.9.4\build\sources\main\java\com\Legoboy0109\CousinCore\containers\ContainerSteamEngine.java:66: error: cannot find symbol

        @Nullable

          ^

  symbol:  class Nullable

  location: class ContainerSteamEngine

Note: C:\Users\brandon\Desktop\Forge 1.9.4\build\sources\main\java\com\Legoboy0109\CousinCore\blocks\BlockSteamEngine.java uses or overrides a deprecated API.

Note: Recompile with -Xlint:deprecation for details.

Note: Some input files use unchecked or unsafe operations.

Note: Recompile with -Xlint:unchecked for details.

2 errors

1 warning

:compileJava FAILED

 

FAILURE: Build failed with an exception.

 

* What went wrong:

Execution failed for task ':compileJava'.

> Compilation failed; see the compiler error output for details.

 

* Try:

Run with --stacktrace option to get the stack trace. Run with --info or --debug option to get more log output.

 

BUILD FAILED

 

Total time: 20.344 secs

 

C:\Users\#######\Desktop\Forge 1.9.4>gradlew build --stacktrace

#################################################

        ForgeGradle 2.2-SNAPSHOT-c438b06

  https://github.com/MinecraftForge/ForgeGradle

#################################################

              Powered by MCP unknown

            http://modcoderpack.com

        by: Searge, ProfMobius, Fesh0r,

        R4wk, ZeuX, IngisKahn, bspkrs

#################################################

:deobfCompileDummyTask

:getVersionJson

:extractUserdev UP-TO-DATE

:downloadClient SKIPPED

:downloadServer SKIPPED

:splitServerJar SKIPPED

:mergeJars SKIPPED

:applyBinaryPatches SKIPPED

:deobfProvidedDummyTask

:extractDependencyATs SKIPPED

:extractMcpData SKIPPED

:extractMcpMappings SKIPPED

:genSrgs SKIPPED

:deobfMcMCP SKIPPED

:sourceApiJava UP-TO-DATE

:compileApiJava UP-TO-DATE

:processApiResources UP-TO-DATE

:apiClasses UP-TO-DATE

:sourceMainJava UP-TO-DATE

:compileJava

warning: [options] bootstrap class path not set in conjunction with -source 1.6

C:\Users\#######\Desktop\Forge 1.9.4\build\sources\main\java\com\Legoboy0109\CousinCore\containers\ContainerSteamEngine.java:4: error: package com.sun.istack.internal does not exist

import com.sun.istack.internal.Nullable;

                              ^

C:\Users\#######\Desktop\Forge 1.9.4\build\sources\main\java\com\Legoboy0109\CousinCore\containers\ContainerSteamEngine.java:66: error: cannot find symbol

        @Nullable

          ^

  symbol:  class Nullable

  location: class ContainerSteamEngine

Note: C:\Users\#######\Desktop\Forge 1.9.4\build\sources\main\java\com\Legoboy0109\CousinCore\blocks\BlockSteamEngine.java uses or overrides a deprecated API.

Note: Recompile with -Xlint:deprecation for details.

Note: Some input files use unchecked or unsafe operations.

Note: Recompile with -Xlint:unchecked for details.

2 errors

1 warning

:compileJava FAILED

 

FAILURE: Build failed with an exception.

 

* What went wrong:

Execution failed for task ':compileJava'.

> Compilation failed; see the compiler error output for details.

 

* Try:

Run with --info or --debug option to get more log output.

 

* Exception is:

org.gradle.api.tasks.TaskExecutionException: Execution failed for task ':compileJava'.

        at org.gradle.api.internal.tasks.execution.ExecuteActionsTaskExecuter.executeActions(ExecuteActionsTaskExecuter.java:69)

        at org.gradle.api.internal.tasks.execution.ExecuteActionsTaskExecuter.execute(ExecuteActionsTaskExecuter.java:46)

        at org.gradle.api.internal.tasks.execution.PostExecutionAnalysisTaskExecuter.execute(PostExecutionAnalysisTaskExecuter.java:35)

        at org.gradle.api.internal.tasks.execution.SkipUpToDateTaskExecuter.execute(SkipUpToDateTaskExecuter.java:64)

        at org.gradle.api.internal.tasks.execution.ValidatingTaskExecuter.execute(ValidatingTaskExecuter.java:58)

        at org.gradle.api.internal.tasks.execution.SkipEmptySourceFilesTaskExecuter.execute(SkipEmptySourceFilesTaskExecuter.java:52)

        at org.gradle.api.internal.tasks.execution.SkipTaskWithNoActionsExecuter.execute(SkipTaskWithNoActionsExecuter.java:52)

        at org.gradle.api.internal.tasks.execution.SkipOnlyIfTaskExecuter.execute(SkipOnlyIfTaskExecuter.java:53)

        at org.gradle.api.internal.tasks.execution.ExecuteAtMostOnceTaskExecuter.execute(ExecuteAtMostOnceTaskExecuter.java:43)

        at org.gradle.execution.taskgraph.DefaultTaskGraphExecuter$EventFiringTaskWorker.execute(DefaultTaskGraphExecuter.java:203)

        at org.gradle.execution.taskgraph.DefaultTaskGraphExecuter$EventFiringTaskWorker.execute(DefaultTaskGraphExecuter.java:185)

        at org.gradle.execution.taskgraph.AbstractTaskPlanExecutor$TaskExecutorWorker.processTask(AbstractTaskPlanExecutor.java:62)

        at org.gradle.execution.taskgraph.AbstractTaskPlanExecutor$TaskExecutorWorker.run(AbstractTaskPlanExecutor.java:50)

        at org.gradle.execution.taskgraph.DefaultTaskPlanExecutor.process(DefaultTaskPlanExecutor.java:25)

        at org.gradle.execution.taskgraph.DefaultTaskGraphExecuter.execute(DefaultTaskGraphExecuter.java:110)

        at org.gradle.execution.SelectedTaskExecutionAction.execute(SelectedTaskExecutionAction.java:37)

        at org.gradle.execution.DefaultBuildExecuter.execute(DefaultBuildExecuter.java:37)

        at org.gradle.execution.DefaultBuildExecuter.access$000(DefaultBuildExecuter.java:23)

        at org.gradle.execution.DefaultBuildExecuter$1.proceed(DefaultBuildExecuter.java:43)

        at org.gradle.execution.DryRunBuildExecutionAction.execute(DryRunBuildExecutionAction.java:32)

        at org.gradle.execution.DefaultBuildExecuter.execute(DefaultBuildExecuter.java:37)

        at org.gradle.execution.DefaultBuildExecuter.execute(DefaultBuildExecuter.java:30)

        at org.gradle.initialization.DefaultGradleLauncher$4.run(DefaultGradleLauncher.java:155)

        at org.gradle.internal.Factories$1.create(Factories.java:22)

        at org.gradle.internal.progress.DefaultBuildOperationExecutor.run(DefaultBuildOperationExecutor.java:90)

        at org.gradle.internal.progress.DefaultBuildOperationExecutor.run(DefaultBuildOperationExecutor.java:52)

        at org.gradle.initialization.DefaultGradleLauncher.doBuildStages(DefaultGradleLauncher.java:152)

        at org.gradle.initialization.DefaultGradleLauncher.access$200(DefaultGradleLauncher.java:33)

        at org.gradle.initialization.DefaultGradleLauncher$1.create(DefaultGradleLauncher.java:100)

        at org.gradle.initialization.DefaultGradleLauncher$1.create(DefaultGradleLauncher.java:94)

        at org.gradle.internal.progress.DefaultBuildOperationExecutor.run(DefaultBuildOperationExecutor.java:90)

        at org.gradle.internal.progress.DefaultBuildOperationExecutor.run(DefaultBuildOperationExecutor.java:62)

        at org.gradle.initialization.DefaultGradleLauncher.doBuild(DefaultGradleLauncher.java:94)

        at org.gradle.initialization.DefaultGradleLauncher.run(DefaultGradleLauncher.java:83)

        at org.gradle.launcher.exec.InProcessBuildActionExecuter$DefaultBuildController.run(InProcessBuildActionExecuter.java:94)

        at org.gradle.tooling.internal.provider.ExecuteBuildActionRunner.run(ExecuteBuildActionRunner.java:28)

        at org.gradle.launcher.exec.ChainingBuildActionRunner.run(ChainingBuildActionRunner.java:35)

        at org.gradle.launcher.exec.InProcessBuildActionExecuter.execute(InProcessBuildActionExecuter.java:43)

        at org.gradle.launcher.exec.InProcessBuildActionExecuter.execute(InProcessBuildActionExecuter.java:28)

        at org.gradle.launcher.exec.ContinuousBuildActionExecuter.execute(ContinuousBuildActionExecuter.java:77)

        at org.gradle.launcher.exec.ContinuousBuildActionExecuter.execute(ContinuousBuildActionExecuter.java:47)

        at org.gradle.launcher.exec.DaemonUsageSuggestingBuildActionExecuter.execute(DaemonUsageSuggestingBuildActionExecuter.java:51)

        at org.gradle.launcher.exec.DaemonUsageSuggestingBuildActionExecuter.execute(DaemonUsageSuggestingBuildActionExecuter.java:28)

        at org.gradle.launcher.cli.RunBuildAction.run(RunBuildAction.java:43)

        at org.gradle.internal.Actions$RunnableActionAdapter.execute(Actions.java:170)

        at org.gradle.launcher.cli.CommandLineActionFactory$ParseAndBuildAction.execute(CommandLineActionFactory.java:237)

        at org.gradle.launcher.cli.CommandLineActionFactory$ParseAndBuildAction.execute(CommandLineActionFactory.java:210)

        at org.gradle.launcher.cli.JavaRuntimeValidationAction.execute(JavaRuntimeValidationAction.java:35)

        at org.gradle.launcher.cli.JavaRuntimeValidationAction.execute(JavaRuntimeValidationAction.java:24)

        at org.gradle.launcher.cli.CommandLineActionFactory$WithLogging.execute(CommandLineActionFactory.java:206)

        at org.gradle.launcher.cli.CommandLineActionFactory$WithLogging.execute(CommandLineActionFactory.java:169)

        at org.gradle.launcher.cli.ExceptionReportingAction.execute(ExceptionReportingAction.java:33)

        at org.gradle.launcher.cli.ExceptionReportingAction.execute(ExceptionReportingAction.java:22)

        at org.gradle.launcher.Main.doAction(Main.java:33)

        at org.gradle.launcher.bootstrap.EntryPoint.run(EntryPoint.java:45)

        at org.gradle.launcher.bootstrap.ProcessBootstrap.runNoExit(ProcessBootstrap.java:54)

        at org.gradle.launcher.bootstrap.ProcessBootstrap.run(ProcessBootstrap.java:35)

        at org.gradle.launcher.GradleMain.main(GradleMain.java:23)

        at org.gradle.wrapper.BootstrapMainStarter.start(BootstrapMainStarter.java:30)

        at org.gradle.wrapper.WrapperExecutor.execute(WrapperExecutor.java:127)

        at org.gradle.wrapper.GradleWrapperMain.main(GradleWrapperMain.java:61)

Caused by: org.gradle.api.internal.tasks.compile.CompilationFailedException: Compilation failed; see the compiler error output for details.

        at org.gradle.api.internal.tasks.compile.JdkJavaCompiler.execute(JdkJavaCompiler.java:47)

        at org.gradle.api.internal.tasks.compile.JdkJavaCompiler.execute(JdkJavaCompiler.java:33)

        at org.gradle.api.internal.tasks.compile.NormalizingJavaCompiler.delegateAndHandleErrors(NormalizingJavaCompiler.java:101)

        at org.gradle.api.internal.tasks.compile.NormalizingJavaCompiler.execute(NormalizingJavaCompiler.java:50)

        at org.gradle.api.internal.tasks.compile.NormalizingJavaCompiler.execute(NormalizingJavaCompiler.java:36)

        at org.gradle.api.internal.tasks.compile.CleaningJavaCompilerSupport.execute(CleaningJavaCompilerSupport.java:34)

        at org.gradle.api.internal.tasks.compile.CleaningJavaCompilerSupport.execute(CleaningJavaCompilerSupport.java:25)

        at org.gradle.api.tasks.compile.JavaCompile.performCompilation(JavaCompile.java:157)

        at org.gradle.api.tasks.compile.JavaCompile.compile(JavaCompile.java:139)

        at org.gradle.api.tasks.compile.JavaCompile.compile(JavaCompile.java:93)

        at org.gradle.internal.reflect.JavaMethod.invoke(JavaMethod.java:75)

        at org.gradle.api.internal.project.taskfactory.AnnotationProcessingTaskFactory$IncrementalTaskAction.doExecute(AnnotationProcessingTaskFactory.java:243)

        at org.gradle.api.internal.project.taskfactory.AnnotationProcessingTaskFactory$StandardTaskAction.execute(AnnotationProcessingTaskFactory.java:219)

        at org.gradle.api.internal.project.taskfactory.AnnotationProcessingTaskFactory$IncrementalTaskAction.execute(AnnotationProcessingTaskFactory.java:230)

        at org.gradle.api.internal.project.taskfactory.AnnotationProcessingTaskFactory$StandardTaskAction.execute(AnnotationProcessingTaskFactory.java:208)

        at org.gradle.api.internal.tasks.execution.ExecuteActionsTaskExecuter.executeAction(ExecuteActionsTaskExecuter.java:80)

        at org.gradle.api.internal.tasks.execution.ExecuteActionsTaskExecuter.executeActions(ExecuteActionsTaskExecuter.java:61)

        ... 60 more

 

 

BUILD FAILED

 

Total time: 12.951 secs

 

Thanks if anyone can help me.

If you're going to be salty, just take a listen.

 

Link to comment
Share on other sites

Join the conversation

You can post now and register later. If you have an account, sign in now to post with your account.
Note: Your post will require moderator approval before it will be visible.

Guest
Reply to this topic...

×   Pasted as rich text.   Restore formatting

  Only 75 emoji are allowed.

×   Your link has been automatically embedded.   Display as a link instead

×   Your previous content has been restored.   Clear editor

×   You cannot paste images directly. Upload or insert images from URL.

 Share



  • Recently Browsing

    No registered users viewing this page.

  • Posts

    • I downloaded an older version of forge and it worked! I had tried downloading older versions before but they didnt work but finally 1.18.1-forge-39.0.48 worked! sorry for the post.
    • I just downloaded forge to get mods on minecraft but it crashes when launched. I have no mods downloaded. Vers. 1.18.1 of minecraft & vers. 1.18.1-forge-39.0.53 of forge. I believe this is my log file https://pastebin.com/SZ3YAu4K pls let me know if it's incorrect or if any other info is needed. thank you in advance.
    • Here i will list my full client log with the error. JVM info: Eclipse Foundation - 16.0.2 - 16.0.2+7 java.net.preferIPv4Stack=true Found java version 16.0.2 Extracting json Considering minecraft client jar Downloading libraries Found 0 additional library directories Considering library cpw.mods:securejarhandler:1.0.1   File exists: Checksum validated. Considering library org.ow2.asm:asm:9.2   File exists: Checksum validated. Considering library org.ow2.asm:asm-commons:9.2   File exists: Checksum validated. Considering library org.ow2.asm:asm-tree:9.2   File exists: Checksum validated. Considering library org.ow2.asm:asm-util:9.2   File exists: Checksum validated. Considering library org.ow2.asm:asm-analysis:9.2   File exists: Checksum validated. Considering library net.minecraftforge:accesstransformers:8.0.4   File exists: Checksum validated. Considering library org.antlr:antlr4-runtime:4.9.1   File exists: Checksum validated. Considering library net.minecraftforge:eventbus:5.0.3   File exists: Checksum validated. Considering library net.minecraftforge:forgespi:4.0.10   File exists: Checksum validated. Considering library net.minecraftforge:coremods:5.0.1   File exists: Checksum validated. Considering library cpw.mods:modlauncher:9.1.0   File exists: Checksum validated. Considering library net.minecraftforge:unsafe:0.2.0   File exists: Checksum validated. Considering library com.electronwill.night-config:core:3.6.4   File exists: Checksum validated. Considering library com.electronwill.night-config:toml:3.6.4   File exists: Checksum validated. Considering library org.apache.maven:maven-artifact:3.6.3   File exists: Checksum validated. Considering library org.apache.commons:commons-lang3:3.12.0   File exists: Checksum validated. Considering library net.jodah:typetools:0.8.3   File exists: Checksum validated. Considering library org.apache.logging.log4j:log4j-api:2.15.0   File exists: Checksum validated. Considering library org.apache.logging.log4j:log4j-core:2.15.0   File exists: Checksum validated. Considering library org.apache.logging.log4j:log4j-slf4j18-impl:2.15.0   File exists: Checksum validated. Considering library net.minecrell:terminalconsoleappender:1.2.0   File exists: Checksum validated. Considering library org.jline:jline-reader:3.12.1   File exists: Checksum validated. Considering library org.jline:jline-terminal:3.12.1   File exists: Checksum validated. Considering library net.sf.jopt-simple:jopt-simple:5.0.4   File exists: Checksum validated. Considering library org.spongepowered:mixin:0.8.5   File exists: Checksum validated. Considering library org.openjdk.nashorn:nashorn-core:15.3   File exists: Checksum validated. Considering library com.google.guava:guava:31.0.1-jre   File exists: Checksum validated. Considering library com.google.code.gson:gson:2.8.8   File exists: Checksum validated. Considering library cpw.mods:bootstraplauncher:1.0.0   File exists: Checksum validated. Considering library net.minecraftforge:fmlloader:1.18.1-39.0.51   File exists: Checksum validated. Considering library com.github.jponge:lzma-java:1.3   File exists: Checksum validated. Considering library com.google.code.findbugs:jsr305:3.0.2   File exists: Checksum validated. Considering library com.google.code.gson:gson:2.8.7   File exists: Checksum validated. Considering library com.google.errorprone:error_prone_annotations:2.1.3   File exists: Checksum validated. Considering library com.google.guava:guava:20.0   File exists: Checksum validated. Considering library com.google.guava:guava:25.1-jre   File exists: Checksum validated. Considering library com.google.j2objc:j2objc-annotations:1.1   File exists: Checksum validated. Considering library com.nothome:javaxdelta:2.0.1   File exists: Checksum validated. Considering library com.opencsv:opencsv:4.4   File exists: Checksum validated. Considering library commons-beanutils:commons-beanutils:1.9.3   File exists: Checksum validated. Considering library commons-collections:commons-collections:3.2.2   File exists: Checksum validated. Considering library commons-io:commons-io:2.4   File exists: Checksum validated. Considering library commons-logging:commons-logging:1.2   File exists: Checksum validated. Considering library de.oceanlabs.mcp:mcp_config:1.18.1-20211210.034407@zip   File exists: Checksum validated. Considering library de.siegmar:fastcsv:2.0.0   File exists: Checksum validated. Considering library net.md-5:SpecialSource:1.10.0   File exists: Checksum validated. Considering library net.minecraftforge:ForgeAutoRenamingTool:0.1.17:all   File exists: Checksum validated. Considering library net.minecraftforge:binarypatcher:1.0.12   File exists: Checksum validated. Considering library net.minecraftforge:fmlcore:1.18.1-39.0.51   File exists: Checksum validated. Considering library net.minecraftforge:fmlloader:1.18.1-39.0.51   File exists: Checksum validated. Considering library net.minecraftforge:forge:1.18.1-39.0.51:universal   File exists: Checksum validated. Considering library net.minecraftforge:installertools:1.2.10   File exists: Checksum validated. Considering library net.minecraftforge:jarsplitter:1.1.4   File exists: Checksum validated. Considering library net.minecraftforge:javafmllanguage:1.18.1-39.0.51   File exists: Checksum validated. Considering library net.minecraftforge:mclanguage:1.18.1-39.0.51   File exists: Checksum validated. Considering library net.minecraftforge:srgutils:0.4.3   File exists: Checksum validated. Considering library net.minecraftforge:srgutils:0.4.7   File exists: Checksum validated. Considering library net.sf.jopt-simple:jopt-simple:5.0.4   File exists: Checksum validated. Considering library net.sf.jopt-simple:jopt-simple:6.0-alpha-3   File exists: Checksum validated. Considering library org.apache.commons:commons-collections4:4.2   File exists: Checksum validated. Considering library org.apache.commons:commons-lang3:3.8.1   File exists: Checksum validated. Considering library org.apache.commons:commons-text:1.3   File exists: Checksum validated. Considering library org.checkerframework:checker-qual:2.0.0   File exists: Checksum validated. Considering library org.codehaus.mojo:animal-sniffer-annotations:1.14   File exists: Checksum validated. Considering library org.ow2.asm:asm-analysis:9.1   File exists: Checksum validated. Considering library org.ow2.asm:asm-analysis:9.2   File exists: Checksum validated. Considering library org.ow2.asm:asm-commons:9.1   File exists: Checksum validated. Considering library org.ow2.asm:asm-commons:9.2   File exists: Checksum validated. Considering library org.ow2.asm:asm-tree:9.1   File exists: Checksum validated. Considering library org.ow2.asm:asm-tree:9.2   File exists: Checksum validated. Considering library org.ow2.asm:asm:9.1   File exists: Checksum validated. Considering library org.ow2.asm:asm:9.2   File exists: Checksum validated. Considering library trove:trove:1.0.2   File exists: Checksum validated. Created Temporary Directory: C:\Users\Connor\AppData\Local\Temp\forge_installer17439075072338868733   Extracting: /data/client.lzma Building Processors ===============================================================================   MainClass: net.minecraftforge.installertools.ConsoleTool   Classpath:     C:\Users\Connor\AppData\Roaming\.minecraft\libraries\net\minecraftforge\installertools\1.2.10\installertools-1.2.10.jar     C:\Users\Connor\AppData\Roaming\.minecraft\libraries\net\md-5\SpecialSource\1.10.0\SpecialSource-1.10.0.jar     C:\Users\Connor\AppData\Roaming\.minecraft\libraries\net\sf\jopt-simple\jopt-simple\5.0.4\jopt-simple-5.0.4.jar     C:\Users\Connor\AppData\Roaming\.minecraft\libraries\com\google\code\gson\gson\2.8.7\gson-2.8.7.jar     C:\Users\Connor\AppData\Roaming\.minecraft\libraries\de\siegmar\fastcsv\2.0.0\fastcsv-2.0.0.jar     C:\Users\Connor\AppData\Roaming\.minecraft\libraries\net\minecraftforge\srgutils\0.4.3\srgutils-0.4.3.jar     C:\Users\Connor\AppData\Roaming\.minecraft\libraries\org\ow2\asm\asm-commons\9.1\asm-commons-9.1.jar     C:\Users\Connor\AppData\Roaming\.minecraft\libraries\com\google\guava\guava\20.0\guava-20.0.jar     C:\Users\Connor\AppData\Roaming\.minecraft\libraries\com\opencsv\opencsv\4.4\opencsv-4.4.jar     C:\Users\Connor\AppData\Roaming\.minecraft\libraries\org\ow2\asm\asm-analysis\9.1\asm-analysis-9.1.jar     C:\Users\Connor\AppData\Roaming\.minecraft\libraries\org\ow2\asm\asm-tree\9.1\asm-tree-9.1.jar     C:\Users\Connor\AppData\Roaming\.minecraft\libraries\org\ow2\asm\asm\9.1\asm-9.1.jar     C:\Users\Connor\AppData\Roaming\.minecraft\libraries\org\apache\commons\commons-text\1.3\commons-text-1.3.jar     C:\Users\Connor\AppData\Roaming\.minecraft\libraries\org\apache\commons\commons-lang3\3.8.1\commons-lang3-3.8.1.jar     C:\Users\Connor\AppData\Roaming\.minecraft\libraries\commons-beanutils\commons-beanutils\1.9.3\commons-beanutils-1.9.3.jar     C:\Users\Connor\AppData\Roaming\.minecraft\libraries\org\apache\commons\commons-collections4\4.2\commons-collections4-4.2.jar     C:\Users\Connor\AppData\Roaming\.minecraft\libraries\commons-logging\commons-logging\1.2\commons-logging-1.2.jar     C:\Users\Connor\AppData\Roaming\.minecraft\libraries\commons-collections\commons-collections\3.2.2\commons-collections-3.2.2.jar   Args: --task, MCP_DATA, --input, C:\Users\Connor\AppData\Roaming\.minecraft\libraries\de\oceanlabs\mcp\mcp_config\1.18.1-20211210.034407\mcp_config-1.18.1-20211210.034407.zip, --output, C:\Users\Connor\AppData\Roaming\.minecraft\libraries\de\oceanlabs\mcp\mcp_config\1.18.1-20211210.034407\mcp_config-1.18.1-20211210.034407-mappings.txt, --key, mappings Task: MCP_DATA Input:  C:\Users\Connor\AppData\Roaming\.minecraft\libraries\de\oceanlabs\mcp\mcp_config\1.18.1-20211210.034407\mcp_config-1.18.1-20211210.034407.zip Output: C:\Users\Connor\AppData\Roaming\.minecraft\libraries\de\oceanlabs\mcp\mcp_config\1.18.1-20211210.034407\mcp_config-1.18.1-20211210.034407-mappings.txt Key:    mappings Extracting: config/joined.tsrg ===============================================================================   MainClass: net.minecraftforge.installertools.ConsoleTool   Classpath:     C:\Users\Connor\AppData\Roaming\.minecraft\libraries\net\minecraftforge\installertools\1.2.10\installertools-1.2.10.jar     C:\Users\Connor\AppData\Roaming\.minecraft\libraries\net\md-5\SpecialSource\1.10.0\SpecialSource-1.10.0.jar     C:\Users\Connor\AppData\Roaming\.minecraft\libraries\net\sf\jopt-simple\jopt-simple\5.0.4\jopt-simple-5.0.4.jar     C:\Users\Connor\AppData\Roaming\.minecraft\libraries\com\google\code\gson\gson\2.8.7\gson-2.8.7.jar     C:\Users\Connor\AppData\Roaming\.minecraft\libraries\de\siegmar\fastcsv\2.0.0\fastcsv-2.0.0.jar     C:\Users\Connor\AppData\Roaming\.minecraft\libraries\net\minecraftforge\srgutils\0.4.3\srgutils-0.4.3.jar     C:\Users\Connor\AppData\Roaming\.minecraft\libraries\org\ow2\asm\asm-commons\9.1\asm-commons-9.1.jar     C:\Users\Connor\AppData\Roaming\.minecraft\libraries\com\google\guava\guava\20.0\guava-20.0.jar     C:\Users\Connor\AppData\Roaming\.minecraft\libraries\com\opencsv\opencsv\4.4\opencsv-4.4.jar     C:\Users\Connor\AppData\Roaming\.minecraft\libraries\org\ow2\asm\asm-analysis\9.1\asm-analysis-9.1.jar     C:\Users\Connor\AppData\Roaming\.minecraft\libraries\org\ow2\asm\asm-tree\9.1\asm-tree-9.1.jar     C:\Users\Connor\AppData\Roaming\.minecraft\libraries\org\ow2\asm\asm\9.1\asm-9.1.jar     C:\Users\Connor\AppData\Roaming\.minecraft\libraries\org\apache\commons\commons-text\1.3\commons-text-1.3.jar     C:\Users\Connor\AppData\Roaming\.minecraft\libraries\org\apache\commons\commons-lang3\3.8.1\commons-lang3-3.8.1.jar     C:\Users\Connor\AppData\Roaming\.minecraft\libraries\commons-beanutils\commons-beanutils\1.9.3\commons-beanutils-1.9.3.jar     C:\Users\Connor\AppData\Roaming\.minecraft\libraries\org\apache\commons\commons-collections4\4.2\commons-collections4-4.2.jar     C:\Users\Connor\AppData\Roaming\.minecraft\libraries\commons-logging\commons-logging\1.2\commons-logging-1.2.jar     C:\Users\Connor\AppData\Roaming\.minecraft\libraries\commons-collections\commons-collections\3.2.2\commons-collections-3.2.2.jar   Args: --task, DOWNLOAD_MOJMAPS, --version, 1.18.1, --side, client, --output, C:\Users\Connor\AppData\Roaming\.minecraft\libraries\net\minecraft\client\1.18.1-20211210.034407\client-1.18.1-20211210.034407-mappings.txt Task: DOWNLOAD_MOJMAPS MC Version: 1.18.1 Side:       client Output:     C:\Users\Connor\AppData\Roaming\.minecraft\libraries\net\minecraft\client\1.18.1-20211210.034407\client-1.18.1-20211210.034407-mappings.txt javax.net.ssl.SSLHandshakeException: PKIX path building failed: sun.security.provider.certpath.SunCertPathBuilderException: unable to find valid certification path to requested target     at java.base/sun.security.ssl.Alert.createSSLException(Alert.java:131)     at java.base/sun.security.ssl.TransportContext.fatal(TransportContext.java:369)     at java.base/sun.security.ssl.TransportContext.fatal(TransportContext.java:312)     at java.base/sun.security.ssl.TransportContext.fatal(TransportContext.java:307)     at java.base/sun.security.ssl.CertificateMessage$T12CertificateConsumer.checkServerCerts(CertificateMessage.java:654)     at java.base/sun.security.ssl.CertificateMessage$T12CertificateConsumer.onCertificate(CertificateMessage.java:473)     at java.base/sun.security.ssl.CertificateMessage$T12CertificateConsumer.consume(CertificateMessage.java:369)     at java.base/sun.security.ssl.SSLHandshake.consume(SSLHandshake.java:396)     at java.base/sun.security.ssl.HandshakeContext.dispatch(HandshakeContext.java:480)     at java.base/sun.security.ssl.HandshakeContext.dispatch(HandshakeContext.java:458)     at java.base/sun.security.ssl.TransportContext.dispatch(TransportContext.java:199)     at java.base/sun.security.ssl.SSLTransport.decode(SSLTransport.java:172)     at java.base/sun.security.ssl.SSLSocketImpl.decode(SSLSocketImpl.java:1506)     at java.base/sun.security.ssl.SSLSocketImpl.readHandshakeRecord(SSLSocketImpl.java:1416)     at java.base/sun.security.ssl.SSLSocketImpl.startHandshake(SSLSocketImpl.java:451)     at java.base/sun.security.ssl.SSLSocketImpl.startHandshake(SSLSocketImpl.java:422)     at java.base/sun.net.www.protocol.https.HttpsClient.afterConnect(HttpsClient.java:574)     at java.base/sun.net.www.protocol.https.AbstractDelegateHttpsURLConnection.connect(AbstractDelegateHttpsURLConnection.java:183)     at java.base/sun.net.www.protocol.http.HttpURLConnection.getInputStream0(HttpURLConnection.java:1653)     at java.base/sun.net.www.protocol.http.HttpURLConnection.getInputStream(HttpURLConnection.java:1577)     at java.base/sun.net.www.protocol.https.HttpsURLConnectionImpl.getInputStream(HttpsURLConnectionImpl.java:224)     at java.base/java.net.URL.openStream(URL.java:1192)     at net.minecraftforge.installertools.DownloadMojmaps.process(DownloadMojmaps.java:65)     at net.minecraftforge.installertools.ConsoleTool.main(ConsoleTool.java:55)     at java.base/jdk.internal.reflect.NativeMethodAccessorImpl.invoke0(Native Method)     at java.base/jdk.internal.reflect.NativeMethodAccessorImpl.invoke(NativeMethodAccessorImpl.java:78)     at java.base/jdk.internal.reflect.DelegatingMethodAccessorImpl.invoke(DelegatingMethodAccessorImpl.java:43)     at java.base/java.lang.reflect.Method.invoke(Method.java:567)     at net.minecraftforge.installer.actions.PostProcessors.process(PostProcessors.java:226)     at net.minecraftforge.installer.actions.ClientInstall.run(ClientInstall.java:144)     at net.minecraftforge.installer.InstallerPanel.run(InstallerPanel.java:423)     at net.minecraftforge.installer.SimpleInstaller.launchGui(SimpleInstaller.java:175)     at net.minecraftforge.installer.SimpleInstaller.main(SimpleInstaller.java:147) Caused by: sun.security.validator.ValidatorException: PKIX path building failed: sun.security.provider.certpath.SunCertPathBuilderException: unable to find valid certification path to requested target     at java.base/sun.security.validator.PKIXValidator.doBuild(PKIXValidator.java:439)     at java.base/sun.security.validator.PKIXValidator.engineValidate(PKIXValidator.java:306)     at java.base/sun.security.validator.Validator.validate(Validator.java:264)     at java.base/sun.security.ssl.X509TrustManagerImpl.checkTrusted(X509TrustManagerImpl.java:231)     at java.base/sun.security.ssl.X509TrustManagerImpl.checkServerTrusted(X509TrustManagerImpl.java:132)     at java.base/sun.security.ssl.CertificateMessage$T12CertificateConsumer.checkServerCerts(CertificateMessage.java:638)     ... 28 more Caused by: sun.security.provider.certpath.SunCertPathBuilderException: unable to find valid certification path to requested target     at java.base/sun.security.provider.certpath.SunCertPathBuilder.build(SunCertPathBuilder.java:141)     at java.base/sun.security.provider.certpath.SunCertPathBuilder.engineBuild(SunCertPathBuilder.java:126)     at java.base/java.security.cert.CertPathBuilder.build(CertPathBuilder.java:297)     at java.base/sun.security.validator.PKIXValidator.doBuild(PKIXValidator.java:434)     ... 33 more Failed to run processor: javax.net.ssl.SSLHandshakeException:PKIX path building failed: sun.security.provider.certpath.SunCertPathBuilderException: unable to find valid certification path to requested target See log for more details.  
    • but the dude made it and he didnt "connected" the NetworkPlayerInfo with the setPlayerSkin method or something
    • This happened to me too when Java updated itself to 1.8.0_321.  I reverted to 1.8.0_311 and everything is working again.  Looks like a conflict with the latest Java version.  
  • Topics

  • Who's Online (See full list)

×
×
  • Create New...

Important Information

By using this site, you agree to our Privacy Policy.