Jump to content
Search In
  • More options...
Find results that contain...
Find results in...

Minecraft Forge Server Crash


ViniiKuru
 Share

Recommended Posts

I've searched everywhere online for hours, and I still can't find a solution to this. I use a Mac, and have installed Forge into vanilla minecraft, yet it works completely fine until it suddenly crashes on startup.

 

Server log:

 

Last login: Sun Jan 13 23:54:28 on ttys000

V****'*-MacBook-Air:~ *******$ /Users/*******/Desktop/Forge Server/Server/Start.command ; exit;

2013-01-13 23:55:00 [iNFO] [ForgeModLoader] Forge Mod Loader version 4.7.10.524 for Minecraft 1.4.7 loading

2013-01-13 23:55:00 [iNFO] [ForgeModLoader] Found valid fingerprint for Minecraft Forge. Certificate fingerprint de4cf8a3f3bc15635810044c39240bf96804ea7d

2013-01-13 23:55:02 [iNFO] [sTDOUT] 210 recipes

2013-01-13 23:55:02 [iNFO] [sTDOUT] 27 achievements

2013-01-13 23:55:02 [iNFO] [Minecraft] Starting minecraft server version 1.4.7

2013-01-13 23:55:02 [iNFO] [ForgeModLoader] Attempting early MinecraftForge initialization

2013-01-13 23:55:02 [iNFO] [sTDOUT] MinecraftForge v6.6.0.499 Initialized

2013-01-13 23:55:02 [iNFO] [ForgeModLoader] MinecraftForge v6.6.0.499 Initialized

2013-01-13 23:55:02 [iNFO] [sTDOUT] Replaced 84 ore recipies

2013-01-13 23:55:02 [iNFO] [ForgeModLoader] Completed early MinecraftForge initialization

2013-01-13 23:55:03 [iNFO] [ForgeModLoader] Searching /Users/*******/Desktop/Forge Server/Server/mods for mods

2013-01-13 23:55:03 [iNFO] [ForgeModLoader] Attempting to reparse the mod container ColouredBedsMod v3.0.2 - 1.4.6.zip

2013-01-13 23:55:03 [iNFO] [ForgeModLoader] Mod Custom House is missing the required element 'name'. Substituting Custom House

2013-01-13 23:55:03 [WARNING] [ForgeModLoader] Mod Custom House is missing the required element 'version' and no fallback can be found. Substituting '1.0'.

2013-01-13 23:55:03 [iNFO] [ForgeModLoader] Attempting to reparse the mod container Touhou Items Mod v1.71.zip

2013-01-13 23:55:04 [iNFO] [ForgeModLoader] Forge Mod Loader has identified 21 mods to load

2013-01-13 23:55:04 [iNFO] [ForgeModLoader] FML has found a non-mod file Butter-Mod_4605775.zip in your mods directory. It will now be injected into your classpath. This could severe stability issues, it should be removed if possible.

2013-01-13 23:55:04 [iNFO] [ForgeModLoader] FML has found a non-mod file mFC 1.1.1 Universal.zip in your mods directory. It will now be injected into your classpath. This could severe stability issues, it should be removed if possible.

2013-01-13 23:55:04 [iNFO] [ForgeModLoader] FML has found a non-mod file minecraftforge-universal-1.4.7-6.6.0.497.zip in your mods directory. It will now be injected into your classpath. This could severe stability issues, it should be removed if possible.

2013-01-13 23:55:04 [iNFO] [sTDERR] java.lang.NoClassDefFoundError: aud

2013-01-13 23:55:04 [iNFO] [sTDERR] at java.lang.Class.getDeclaredMethods0(Native Method)

2013-01-13 23:55:04 [iNFO] [sTDERR] at java.lang.Class.privateGetDeclaredMethods(Class.java:2427)

2013-01-13 23:55:04 [iNFO] [sTDERR] at java.lang.Class.getDeclaredMethods(Class.java:1791)

2013-01-13 23:55:04 [iNFO] [sTDERR] at cpw.mods.fml.common.FMLModContainer.gatherAnnotations(FMLModContainer.java:310)

2013-01-13 23:55:04 [iNFO] [sTDERR] at cpw.mods.fml.common.FMLModContainer.constructMod(FMLModContainer.java:455)

2013-01-13 23:55:04 [iNFO] [sTDERR] at sun.reflect.NativeMethodAccessorImpl.invoke0(Native Method)

2013-01-13 23:55:04 [iNFO] [sTDERR] at sun.reflect.NativeMethodAccessorImpl.invoke(NativeMethodAccessorImpl.java:39)

2013-01-13 23:55:04 [iNFO] [sTDERR] at sun.reflect.DelegatingMethodAccessorImpl.invoke(DelegatingMethodAccessorImpl.java:25)

2013-01-13 23:55:04 [iNFO] [sTDERR] at java.lang.reflect.Method.invoke(Method.java:597)

2013-01-13 23:55:04 [iNFO] [sTDERR] at com.google.common.eventbus.EventHandler.handleEvent(EventHandler.java:69)

2013-01-13 23:55:04 [iNFO] [sTDERR] at com.google.common.eventbus.SynchronizedEventHandler.handleEvent(SynchronizedEventHandler.java:45)

2013-01-13 23:55:04 [iNFO] [sTDERR] at com.google.common.eventbus.EventBus.dispatch(EventBus.java:317)

2013-01-13 23:55:04 [iNFO] [sTDERR] at com.google.common.eventbus.EventBus.dispatchQueuedEvents(EventBus.java:300)

2013-01-13 23:55:04 [iNFO] [sTDERR] at com.google.common.eventbus.EventBus.post(EventBus.java:268)

2013-01-13 23:55:04 [iNFO] [sTDERR] at cpw.mods.fml.common.LoadController.propogateStateMessage(LoadController.java:140)

2013-01-13 23:55:04 [iNFO] [sTDERR] at sun.reflect.NativeMethodAccessorImpl.invoke0(Native Method)

2013-01-13 23:55:04 [iNFO] [sTDERR] at sun.reflect.NativeMethodAccessorImpl.invoke(NativeMethodAccessorImpl.java:39)

2013-01-13 23:55:04 [iNFO] [sTDERR] at sun.reflect.DelegatingMethodAccessorImpl.invoke(DelegatingMethodAccessorImpl.java:25)

2013-01-13 23:55:04 [iNFO] [sTDERR] at java.lang.reflect.Method.invoke(Method.java:597)

2013-01-13 23:55:04 [iNFO] [sTDERR] at com.google.common.eventbus.EventHandler.handleEvent(EventHandler.java:69)

2013-01-13 23:55:04 [iNFO] [sTDERR] at com.google.common.eventbus.SynchronizedEventHandler.handleEvent(SynchronizedEventHandler.java:45)

2013-01-13 23:55:04 [iNFO] [sTDERR] at com.google.common.eventbus.EventBus.dispatch(EventBus.java:317)

2013-01-13 23:55:04 [iNFO] [sTDERR] at com.google.common.eventbus.EventBus.dispatchQueuedEvents(EventBus.java:300)

2013-01-13 23:55:04 [iNFO] [sTDERR] at com.google.common.eventbus.EventBus.post(EventBus.java:268)

2013-01-13 23:55:04 [iNFO] [sTDERR] at cpw.mods.fml.common.LoadController.distributeStateMessage(LoadController.java:83)

2013-01-13 23:55:04 [iNFO] [sTDERR] at cpw.mods.fml.common.Loader.loadMods(Loader.java:479)

2013-01-13 23:55:04 [iNFO] [sTDERR] at cpw.mods.fml.server.FMLServerHandler.beginServerLoading(FMLServerHandler.java:86)

2013-01-13 23:55:04 [iNFO] [sTDERR] at cpw.mods.fml.common.FMLCommonHandler.onServerStart(FMLCommonHandler.java:345)

2013-01-13 23:55:04 [iNFO] [sTDERR] at ho.c(DedicatedServer.java:64)

2013-01-13 23:55:04 [iNFO] [sTDERR] at net.minecraft.server.MinecraftServer.run(MinecraftServer.java:458)

2013-01-13 23:55:04 [iNFO] [sTDERR] at fy.run(SourceFile:849)

2013-01-13 23:55:04 [iNFO] [sTDERR] Caused by: java.lang.ClassNotFoundException: aud

2013-01-13 23:55:04 [iNFO] [sTDERR] at cpw.mods.fml.relauncher.RelaunchClassLoader.findClass(RelaunchClassLoader.java:185)

2013-01-13 23:55:04 [iNFO] [sTDERR] at java.lang.ClassLoader.loadClass(ClassLoader.java:306)

2013-01-13 23:55:04 [iNFO] [sTDERR] at java.lang.ClassLoader.loadClass(ClassLoader.java:247)

2013-01-13 23:55:04 [iNFO] [sTDERR] ... 31 more

2013-01-13 23:55:04 [iNFO] [sTDERR] Caused by: java.lang.NullPointerException

2013-01-13 23:55:04 [iNFO] [sTDERR] at cpw.mods.fml.relauncher.RelaunchClassLoader.findClass(RelaunchClassLoader.java:174)

2013-01-13 23:55:04 [iNFO] [sTDERR] ... 33 more

2013-01-13 23:55:04 [sEVERE] [Minecraft] Encountered an unexpected exception NoClassDefFoundError

java.lang.NoClassDefFoundError: aud

at java.lang.Class.getDeclaredMethods0(Native Method)

at java.lang.Class.privateGetDeclaredMethods(Class.java:2427)

at java.lang.Class.getDeclaredMethods(Class.java:1791)

at cpw.mods.fml.common.FMLModContainer.gatherAnnotations(FMLModContainer.java:310)

at cpw.mods.fml.common.FMLModContainer.constructMod(FMLModContainer.java:455)

at sun.reflect.NativeMethodAccessorImpl.invoke0(Native Method)

at sun.reflect.NativeMethodAccessorImpl.invoke(NativeMethodAccessorImpl.java:39)

at sun.reflect.DelegatingMethodAccessorImpl.invoke(DelegatingMethodAccessorImpl.java:25)

at java.lang.reflect.Method.invoke(Method.java:597)

at com.google.common.eventbus.EventHandler.handleEvent(EventHandler.java:69)

at com.google.common.eventbus.SynchronizedEventHandler.handleEvent(SynchronizedEventHandler.java:45)

at com.google.common.eventbus.EventBus.dispatch(EventBus.java:317)

at com.google.common.eventbus.EventBus.dispatchQueuedEvents(EventBus.java:300)

at com.google.common.eventbus.EventBus.post(EventBus.java:268)

at cpw.mods.fml.common.LoadController.propogateStateMessage(LoadController.java:140)

at sun.reflect.NativeMethodAccessorImpl.invoke0(Native Method)

at sun.reflect.NativeMethodAccessorImpl.invoke(NativeMethodAccessorImpl.java:39)

at sun.reflect.DelegatingMethodAccessorImpl.invoke(DelegatingMethodAccessorImpl.java:25)

at java.lang.reflect.Method.invoke(Method.java:597)

at com.google.common.eventbus.EventHandler.handleEvent(EventHandler.java:69)

at com.google.common.eventbus.SynchronizedEventHandler.handleEvent(SynchronizedEventHandler.java:45)

at com.google.common.eventbus.EventBus.dispatch(EventBus.java:317)

at com.google.common.eventbus.EventBus.dispatchQueuedEvents(EventBus.java:300)

at com.google.common.eventbus.EventBus.post(EventBus.java:268)

at cpw.mods.fml.common.LoadController.distributeStateMessage(LoadController.java:83)

at cpw.mods.fml.common.Loader.loadMods(Loader.java:479)

at cpw.mods.fml.server.FMLServerHandler.beginServerLoading(FMLServerHandler.java:86)

at cpw.mods.fml.common.FMLCommonHandler.onServerStart(FMLCommonHandler.java:345)

at ho.c(DedicatedServer.java:64)

at net.minecraft.server.MinecraftServer.run(MinecraftServer.java:458)

at fy.run(SourceFile:849)

Caused by: java.lang.ClassNotFoundException: aud

at cpw.mods.fml.relauncher.RelaunchClassLoader.findClass(RelaunchClassLoader.java:185)

at java.lang.ClassLoader.loadClass(ClassLoader.java:306)

at java.lang.ClassLoader.loadClass(ClassLoader.java:247)

... 31 more

Caused by: java.lang.NullPointerException

at cpw.mods.fml.relauncher.RelaunchClassLoader.findClass(RelaunchClassLoader.java:174)

... 33 more

2013-01-13 23:55:04 [sEVERE] [Minecraft] This crash report has been saved to: /Users/********/Desktop/Forge Server/Server/./crash-reports/crash-2013-01-13_23.55.04-server.txt

 

(I've blocked out personal information for reasons.)

 

 

 

And this is the crash report:

 

---- Minecraft Crash Report ----

// Daisy, daisy...

 

Time: 1/13/13 11:55 PM

Description: Exception in server tick loop

 

java.lang.NoClassDefFoundError: aud

at java.lang.Class.getDeclaredMethods0(Native Method)

at java.lang.Class.privateGetDeclaredMethods(Class.java:2427)

at java.lang.Class.getDeclaredMethods(Class.java:1791)

at cpw.mods.fml.common.FMLModContainer.gatherAnnotations(FMLModContainer.java:310)

at cpw.mods.fml.common.FMLModContainer.constructMod(FMLModContainer.java:455)

at sun.reflect.NativeMethodAccessorImpl.invoke0(Native Method)

at sun.reflect.NativeMethodAccessorImpl.invoke(NativeMethodAccessorImpl.java:39)

at sun.reflect.DelegatingMethodAccessorImpl.invoke(DelegatingMethodAccessorImpl.java:25)

at java.lang.reflect.Method.invoke(Method.java:597)

at com.google.common.eventbus.EventHandler.handleEvent(EventHandler.java:69)

at com.google.common.eventbus.SynchronizedEventHandler.handleEvent(SynchronizedEventHandler.java:45)

at com.google.common.eventbus.EventBus.dispatch(EventBus.java:317)

at com.google.common.eventbus.EventBus.dispatchQueuedEvents(EventBus.java:300)

at com.google.common.eventbus.EventBus.post(EventBus.java:268)

at cpw.mods.fml.common.LoadController.propogateStateMessage(LoadController.java:140)

at sun.reflect.NativeMethodAccessorImpl.invoke0(Native Method)

at sun.reflect.NativeMethodAccessorImpl.invoke(NativeMethodAccessorImpl.java:39)

at sun.reflect.DelegatingMethodAccessorImpl.invoke(DelegatingMethodAccessorImpl.java:25)

at java.lang.reflect.Method.invoke(Method.java:597)

at com.google.common.eventbus.EventHandler.handleEvent(EventHandler.java:69)

at com.google.common.eventbus.SynchronizedEventHandler.handleEvent(SynchronizedEventHandler.java:45)

at com.google.common.eventbus.EventBus.dispatch(EventBus.java:317)

at com.google.common.eventbus.EventBus.dispatchQueuedEvents(EventBus.java:300)

at com.google.common.eventbus.EventBus.post(EventBus.java:268)

at cpw.mods.fml.common.LoadController.distributeStateMessage(LoadController.java:83)

at cpw.mods.fml.common.Loader.loadMods(Loader.java:479)

at cpw.mods.fml.server.FMLServerHandler.beginServerLoading(FMLServerHandler.java:86)

at cpw.mods.fml.common.FMLCommonHandler.onServerStart(FMLCommonHandler.java:345)

at ho.c(DedicatedServer.java:64)

at net.minecraft.server.MinecraftServer.run(MinecraftServer.java:458)

at fy.run(SourceFile:849)

Caused by: java.lang.ClassNotFoundException: aud

at cpw.mods.fml.relauncher.RelaunchClassLoader.findClass(RelaunchClassLoader.java:185)

at java.lang.ClassLoader.loadClass(ClassLoader.java:306)

at java.lang.ClassLoader.loadClass(ClassLoader.java:247)

... 31 more

Caused by: java.lang.NullPointerException

at cpw.mods.fml.relauncher.RelaunchClassLoader.findClass(RelaunchClassLoader.java:174)

... 33 more

 

 

A detailed walkthrough of the error, its code path and all known details is as follows:

---------------------------------------------------------------------------------------

 

-- System Details --

Details:

Minecraft Version: 1.4.7

Operating System: Mac OS X (x86_64) version 10.7.5

Java Version: 1.6.0_37, Apple Inc.

Java VM Version: Java HotSpot 64-Bit Server VM (mixed mode), Apple Inc.

Memory: 994505048 bytes (948 MB) / 1065025536 bytes (1015 MB) up to 1065025536 bytes (1015 MB)

JVM Flags: 2 total; -Xmx1G -Xms1G

AABB Pool Size: 0 (0 bytes; 0 MB) allocated, 0 (0 bytes; 0 MB) used

Suspicious classes: FML and Forge are installed

IntCache: cache: 0, tcache: 0, allocated: 0, tallocated: 0

FML: MCP v7.26 FML v4.7.10.524 Minecraft Forge 6.6.0.499 21 mods loaded, 21 mods active

mcp [Minecraft Coder Pack] (minecraft.jar) Unloaded->Constructed

FML [Forge Mod Loader] (coremods) Unloaded->Constructed

Forge [Minecraft Forge] (coremods) Unloaded->Constructed

GuiAPI [GuiAPI] (GuiAPI-0.15.2-1.4.6.jar) Unloaded

jammyfurniture [Jammy Furniture Mod] (1.4.6_Jammy_Furniture_Mod_V4.0.zip) Unloaded

MinecraftWero [bacon Mod] (Bacon Modv2.3.zip) Unloaded

CameraCraft [CameraCraft] (CameraCraft2.3.zip) Unloaded

JSOne_Studios.CampfireMod [Campfire Mod] (CampfireMod_2.4_for_1.4.7.zip) Unloaded

CBM [Coloured Beds Mod] (ColouredBedsMod v3.0.2 - 1.4.6.zip) Unloaded

UpdateManager_TheWhiteWolves [Mod Update Manager] (ColouredBedsMod v3.0.2 - 1.4.6.zip) Unloaded

CustomSpawner [DrZhark's CustomSpawner] (CustomMobSpawner 1.10.zip) Unloaded

MoCreatures [DrZhark's Mo'Creatures Mod] (DrZharks MoCreatures Mod v4.4.0.zip) Unloaded

Custom House [Custom House] (Insta House v 3.3.zip) Unloaded

IH [insta House] (Insta House v 3.3.zip) Unloaded

MoFoliage [Mo' Foliage Forge Edition] (Mo Foliage 1.5.zip) Unloaded

SecretRoomsMod [The SecretRoomsMod] (SecretRoomsMod-universal-4.4.1.158.zip) Unloaded

stillhungry [still Hungry] (StillHungry-v1.0.1.zip) Unloaded

mod_Timber [mod_Timber] (Timber! (1.4.6).zip) Unloaded

mod_thKaguya [?????MOD+] (Touhou Items Mod v1.71.zip) Unloaded

BetterFurnaces [better Furnaces] ([1.4.6]BetterFurnacesV2.1.zip) Unloaded

Backpack [backpack] (backpack.zip) Unloaded

Profiler Position: N/A (disabled)

Is Modded: Definitely; Server brand changed to 'fml'

Type: Dedicated Server (map_server.txt)

 

 

I've replaced the lib files with new ones, which doesn't make much of a difference either. Can someone please help me on this?

Link to comment
Share on other sites

You say it doesn't work after removing it from mods folder. Do you have a new log after that?

Precisely my point. Logs or I'm locking the thread.

Read the EAQ before posting! OR ELSE!

 

This isn't building better software, its trying to grab a place in the commit list of a highly visible github project.

 

www.forgeessentials.com

 

Don't PM me, I don't check this account unless I have to.

Link to comment
Share on other sites

Alright then.

 

Server log:

 

Last login: Mon Jan 14 04:06:47 on ttys000

****-MacBook-Air:~ ****$ /Users/****/Desktop/****/Server/Start.command ; exit;

2013-01-14 05:17:42 [iNFO] [ForgeModLoader] Forge Mod Loader version 4.7.4.520 for Minecraft 1.4.7 loading

2013-01-14 05:17:42 [iNFO] [ForgeModLoader] Found valid fingerprint for Minecraft Forge. Certificate fingerprint de4cf8a3f3bc15635810044c39240bf96804ea7d

2013-01-14 05:17:44 [iNFO] [sTDOUT] 210 recipes

2013-01-14 05:17:44 [iNFO] [sTDOUT] 27 achievements

2013-01-14 05:17:44 [iNFO] [Minecraft] Starting minecraft server version 1.4.7

2013-01-14 05:17:44 [iNFO] [ForgeModLoader] Attempting early MinecraftForge initialization

2013-01-14 05:17:44 [iNFO] [sTDOUT] MinecraftForge v6.6.0.497 Initialized

2013-01-14 05:17:44 [iNFO] [ForgeModLoader] MinecraftForge v6.6.0.497 Initialized

2013-01-14 05:17:45 [iNFO] [sTDOUT] Replaced 84 ore recipies

2013-01-14 05:17:45 [iNFO] [ForgeModLoader] Completed early MinecraftForge initialization

2013-01-14 05:17:45 [iNFO] [ForgeModLoader] Searching /Users/chibipeoplezs/Desktop/Asher/Server/mods for mods

2013-01-14 05:17:45 [iNFO] [ForgeModLoader] Attempting to reparse the mod container ColouredBedsMod v3.0.2 - 1.4.6.zip

2013-01-14 05:17:45 [iNFO] [ForgeModLoader] Mod Custom House is missing the required element 'name'. Substituting Custom House

2013-01-14 05:17:45 [WARNING] [ForgeModLoader] Mod Custom House is missing the required element 'version' and no fallback can be found. Substituting '1.0'.

2013-01-14 05:17:46 [iNFO] [ForgeModLoader] Attempting to reparse the mod container Touhou Items Mod v1.71.zip

2013-01-14 05:17:46 [iNFO] [ForgeModLoader] Forge Mod Loader has identified 20 mods to load

2013-01-14 05:17:46 [iNFO] [ForgeModLoader] FML has found a non-mod file Butter-Mod_4605775.zip in your mods directory. It will now be injected into your classpath. This could severe stability issues, it should be removed if possible.

2013-01-14 05:17:46 [iNFO] [ForgeModLoader] FML has found a non-mod file mFC 1.1.1 Universal.zip in your mods directory. It will now be injected into your classpath. This could severe stability issues, it should be removed if possible.

2013-01-14 05:17:47 [iNFO] [ForgeModLoader] Configured a dormant chunk cache size of 0

2013-01-14 05:17:47 [iNFO] [CameraCraft] Version 2.3 preInitializing... © 2012 by Take Weiland (diesieben07)

2013-01-14 05:17:47 [iNFO] [sTDOUT] Initializing MoCreatures Server Config File at /Users/chibipeoplezs/Desktop/Asher/Server/config/MoCreatures.cfg

2013-01-14 05:17:47 [iNFO] [sTDOUT] Loading Language de_DE from /Users/chibipeoplezs/Desktop/Asher/Server/config/lang/BetterFurnaces/de_DE.txt

2013-01-14 05:17:47 [iNFO] [sTDOUT] Loading Language en_US from /Users/chibipeoplezs/Desktop/Asher/Server/config/lang/BetterFurnaces/en_US.txt

2013-01-14 05:17:47 [iNFO] [Minecraft] Loading properties

2013-01-14 05:17:47 [iNFO] [Minecraft] Default game type: SURVIVAL

2013-01-14 05:17:47 [iNFO] [Minecraft] Generating keypair

2013-01-14 05:17:48 [iNFO] [Minecraft] Starting Minecraft server on *:25565

2013-01-14 05:17:48 [WARNING] [ForgeModLoader] The mod jammyfurniture tried to register the entity class class net.minecraft.jammy780.furniture.util.EntityMountableBlock which was already registered - if you wish to override default naming for FML mod entities, register it here first

2013-01-14 05:17:48 [iNFO] [CameraCraft] initializing...

2013-01-14 05:17:49 [sEVERE] [ForgeModLoader] The entity ID 530 for mod mod_thKaguya is not an unsigned byte and may not work

2013-01-14 05:17:49 [sEVERE] [ForgeModLoader] The mod mod_thKaguya has attempted to register an entity ID 530 which is already reserved. This could cause severe problems

2013-01-14 05:17:49 [sEVERE] [ForgeModLoader] The entity ID 531 for mod mod_thKaguya is not an unsigned byte and may not work

2013-01-14 05:17:49 [sEVERE] [ForgeModLoader] The mod mod_thKaguya has attempted to register an entity ID 531 which is already reserved. This could cause severe problems

2013-01-14 05:17:49 [sEVERE] [ForgeModLoader] The entity ID 532 for mod mod_thKaguya is not an unsigned byte and may not work

2013-01-14 05:17:49 [sEVERE] [ForgeModLoader] The mod mod_thKaguya has attempted to register an entity ID 532 which is already reserved. This could cause severe problems

2013-01-14 05:17:49 [sEVERE] [ForgeModLoader] The entity ID 533 for mod mod_thKaguya is not an unsigned byte and may not work

2013-01-14 05:17:49 [sEVERE] [ForgeModLoader] The mod mod_thKaguya has attempted to register an entity ID 533 which is already reserved. This could cause severe problems

2013-01-14 05:17:49 [sEVERE] [ForgeModLoader] The entity ID 535 for mod mod_thKaguya is not an unsigned byte and may not work

2013-01-14 05:17:49 [sEVERE] [ForgeModLoader] The mod mod_thKaguya has attempted to register an entity ID 535 which is already reserved. This could cause severe problems

2013-01-14 05:17:49 [sEVERE] [ForgeModLoader] The entity ID 534 for mod mod_thKaguya is not an unsigned byte and may not work

2013-01-14 05:17:49 [sEVERE] [ForgeModLoader] The mod mod_thKaguya has attempted to register an entity ID 534 which is already reserved. This could cause severe problems

2013-01-14 05:17:49 [sEVERE] [ForgeModLoader] The entity ID 536 for mod mod_thKaguya is not an unsigned byte and may not work

2013-01-14 05:17:49 [sEVERE] [ForgeModLoader] The mod mod_thKaguya has attempted to register an entity ID 536 which is already reserved. This could cause severe problems

2013-01-14 05:17:49 [sEVERE] [ForgeModLoader] The entity ID 537 for mod mod_thKaguya is not an unsigned byte and may not work

2013-01-14 05:17:49 [sEVERE] [ForgeModLoader] The mod mod_thKaguya has attempted to register an entity ID 537 which is already reserved. This could cause severe problems

2013-01-14 05:17:49 [sEVERE] [ForgeModLoader] The entity ID 538 for mod mod_thKaguya is not an unsigned byte and may not work

2013-01-14 05:17:49 [sEVERE] [ForgeModLoader] The mod mod_thKaguya has attempted to register an entity ID 538 which is already reserved. This could cause severe problems

2013-01-14 05:17:49 [sEVERE] [ForgeModLoader] The entity ID 539 for mod mod_thKaguya is not an unsigned byte and may not work

2013-01-14 05:17:49 [sEVERE] [ForgeModLoader] The mod mod_thKaguya has attempted to register an entity ID 539 which is already reserved. This could cause severe problems

2013-01-14 05:17:49 [sEVERE] [ForgeModLoader] The entity ID 540 for mod mod_thKaguya is not an unsigned byte and may not work

2013-01-14 05:17:49 [sEVERE] [ForgeModLoader] The mod mod_thKaguya has attempted to register an entity ID 540 which is already reserved. This could cause severe problems

2013-01-14 05:17:49 [sEVERE] [ForgeModLoader] The entity ID 541 for mod mod_thKaguya is not an unsigned byte and may not work

2013-01-14 05:17:49 [sEVERE] [ForgeModLoader] The mod mod_thKaguya has attempted to register an entity ID 541 which is already reserved. This could cause severe problems

2013-01-14 05:17:49 [sEVERE] [ForgeModLoader] The entity ID 542 for mod mod_thKaguya is not an unsigned byte and may not work

2013-01-14 05:17:49 [sEVERE] [ForgeModLoader] The mod mod_thKaguya has attempted to register an entity ID 542 which is already reserved. This could cause severe problems

2013-01-14 05:17:49 [sEVERE] [ForgeModLoader] The entity ID 543 for mod mod_thKaguya is not an unsigned byte and may not work

2013-01-14 05:17:49 [sEVERE] [ForgeModLoader] The mod mod_thKaguya has attempted to register an entity ID 543 which is already reserved. This could cause severe problems

2013-01-14 05:17:49 [sEVERE] [ForgeModLoader] The entity ID 544 for mod mod_thKaguya is not an unsigned byte and may not work

2013-01-14 05:17:49 [sEVERE] [ForgeModLoader] The mod mod_thKaguya has attempted to register an entity ID 544 which is already reserved. This could cause severe problems

2013-01-14 05:17:49 [sEVERE] [ForgeModLoader] The entity ID 545 for mod mod_thKaguya is not an unsigned byte and may not work

2013-01-14 05:17:49 [sEVERE] [ForgeModLoader] The mod mod_thKaguya has attempted to register an entity ID 545 which is already reserved. This could cause severe problems

2013-01-14 05:17:49 [sEVERE] [ForgeModLoader] The entity ID 546 for mod mod_thKaguya is not an unsigned byte and may not work

2013-01-14 05:17:49 [sEVERE] [ForgeModLoader] The mod mod_thKaguya has attempted to register an entity ID 546 which is already reserved. This could cause severe problems

2013-01-14 05:17:49 [sEVERE] [ForgeModLoader] The entity ID 547 for mod mod_thKaguya is not an unsigned byte and may not work

2013-01-14 05:17:49 [sEVERE] [ForgeModLoader] The mod mod_thKaguya has attempted to register an entity ID 547 which is already reserved. This could cause severe problems

2013-01-14 05:17:49 [sEVERE] [ForgeModLoader] The entity ID 548 for mod mod_thKaguya is not an unsigned byte and may not work

2013-01-14 05:17:49 [sEVERE] [ForgeModLoader] The mod mod_thKaguya has attempted to register an entity ID 548 which is already reserved. This could cause severe problems

2013-01-14 05:17:49 [sEVERE] [ForgeModLoader] The entity ID 549 for mod mod_thKaguya is not an unsigned byte and may not work

2013-01-14 05:17:49 [sEVERE] [ForgeModLoader] The mod mod_thKaguya has attempted to register an entity ID 549 which is already reserved. This could cause severe problems

2013-01-14 05:17:49 [sEVERE] [ForgeModLoader] The entity ID 550 for mod mod_thKaguya is not an unsigned byte and may not work

2013-01-14 05:17:49 [sEVERE] [ForgeModLoader] The mod mod_thKaguya has attempted to register an entity ID 550 which is already reserved. This could cause severe problems

2013-01-14 05:17:49 [sEVERE] [ForgeModLoader] Fatal errors were detected during the transition from INITIALIZATION to POSTINITIALIZATION. Loading cannot continue

2013-01-14 05:17:49 [sEVERE] [ForgeModLoader]

mcp [Minecraft Coder Pack] (minecraft.jar) Unloaded->Constructed->Pre-initialized->Initialized

FML [Forge Mod Loader] (coremods) Unloaded->Constructed->Pre-initialized->Initialized

Forge [Minecraft Forge] (coremods) Unloaded->Constructed->Pre-initialized->Initialized

jammyfurniture [Jammy Furniture Mod] (1.4.6_Jammy_Furniture_Mod_V4.0.zip) Unloaded->Constructed->Pre-initialized->Initialized

MinecraftWero [bacon Mod] (Bacon Modv2.3.zip) Unloaded->Constructed->Pre-initialized->Initialized

CameraCraft [CameraCraft] (CameraCraft2.3.zip) Unloaded->Constructed->Pre-initialized->Initialized

JSOne_Studios.CampfireMod [Campfire Mod] (CampfireMod_2.4_for_1.4.7.zip) Unloaded->Constructed->Pre-initialized->Initialized

CBM [Coloured Beds Mod] (ColouredBedsMod v3.0.2 - 1.4.6.zip) Unloaded->Constructed->Pre-initialized->Initialized

UpdateManager_TheWhiteWolves [Mod Update Manager] (ColouredBedsMod v3.0.2 - 1.4.6.zip) Unloaded->Constructed->Pre-initialized->Initialized

CustomSpawner [DrZhark's CustomSpawner] (CustomMobSpawner 1.10.zip) Unloaded->Constructed->Pre-initialized->Initialized

MoCreatures [DrZhark's Mo'Creatures Mod] (DrZharks MoCreatures Mod v4.4.0.zip) Unloaded->Constructed->Pre-initialized->Initialized

Custom House [Custom House] (Insta House v 3.3.zip) Unloaded->Constructed->Pre-initialized->Initialized

IH [insta House] (Insta House v 3.3.zip) Unloaded->Constructed->Pre-initialized->Errored

MoFoliage [Mo' Foliage Forge Edition] (Mo Foliage 1.5.zip) Unloaded->Constructed->Pre-initialized->Initialized

SecretRoomsMod [The SecretRoomsMod] (SecretRoomsMod-universal-4.4.1.158.zip) Unloaded->Constructed->Pre-initialized->Initialized

stillhungry [still Hungry] (StillHungry-v1.0.1.zip) Unloaded->Constructed->Pre-initialized->Initialized

mod_Timber [Timber!] (Timber! (1.4.6).zip) Unloaded->Constructed->Pre-initialized->Initialized

mod_thKaguya [?????MOD+] (Touhou Items Mod v1.71.zip) Unloaded->Constructed->Pre-initialized->Initialized

BetterFurnaces [better Furnaces] ([1.4.6]BetterFurnacesV2.1.zip) Unloaded->Constructed->Pre-initialized->Initialized

Backpack [backpack] (backpack.zip) Unloaded->Constructed->Pre-initialized->Initialized

2013-01-14 05:17:49 [sEVERE] [ForgeModLoader] The following problems were captured during this phase

2013-01-14 05:17:49 [sEVERE] [ForgeModLoader] Caught exception from IH

java.lang.NoClassDefFoundError: ayp

at net.minecraftforge.client.MinecraftForgeClient.preloadTexture(MinecraftForgeClient.java:41)

at net.instahouse.InstaHouse.preloadTextures(InstaHouse.java:151)

at net.instahouse.InstaHouse.load(InstaHouse.java:83)

at sun.reflect.NativeMethodAccessorImpl.invoke0(Native Method)

at sun.reflect.NativeMethodAccessorImpl.invoke(NativeMethodAccessorImpl.java:39)

at sun.reflect.DelegatingMethodAccessorImpl.invoke(DelegatingMethodAccessorImpl.java:25)

at java.lang.reflect.Method.invoke(Method.java:597)

at cpw.mods.fml.common.FMLModContainer.handleModStateEvent(FMLModContainer.java:485)

at sun.reflect.GeneratedMethodAccessor3.invoke(Unknown Source)

at sun.reflect.DelegatingMethodAccessorImpl.invoke(DelegatingMethodAccessorImpl.java:25)

at java.lang.reflect.Method.invoke(Method.java:597)

at com.google.common.eventbus.EventHandler.handleEvent(EventHandler.java:69)

at com.google.common.eventbus.SynchronizedEventHandler.handleEvent(SynchronizedEventHandler.java:45)

at com.google.common.eventbus.EventBus.dispatch(EventBus.java:317)

at com.google.common.eventbus.EventBus.dispatchQueuedEvents(EventBus.java:300)

at com.google.common.eventbus.EventBus.post(EventBus.java:268)

at cpw.mods.fml.common.LoadController.propogateStateMessage(LoadController.java:140)

at sun.reflect.NativeMethodAccessorImpl.invoke0(Native Method)

at sun.reflect.NativeMethodAccessorImpl.invoke(NativeMethodAccessorImpl.java:39)

at sun.reflect.DelegatingMethodAccessorImpl.invoke(DelegatingMethodAccessorImpl.java:25)

at java.lang.reflect.Method.invoke(Method.java:597)

at com.google.common.eventbus.EventHandler.handleEvent(EventHandler.java:69)

at com.google.common.eventbus.SynchronizedEventHandler.handleEvent(SynchronizedEventHandler.java:45)

at com.google.common.eventbus.EventBus.dispatch(EventBus.java:317)

at com.google.common.eventbus.EventBus.dispatchQueuedEvents(EventBus.java:300)

at com.google.common.eventbus.EventBus.post(EventBus.java:268)

at cpw.mods.fml.common.LoadController.distributeStateMessage(LoadController.java:83)

at cpw.mods.fml.common.Loader.initializeMods(Loader.java:657)

at cpw.mods.fml.server.FMLServerHandler.finishServerLoading(FMLServerHandler.java:94)

at cpw.mods.fml.common.FMLCommonHandler.onServerStarted(FMLCommonHandler.java:350)

at ho.c(DedicatedServer.java:135)

at net.minecraft.server.MinecraftServer.run(MinecraftServer.java:458)

at fy.run(SourceFile:849)

Caused by: java.lang.ClassNotFoundException: ayp

at cpw.mods.fml.relauncher.RelaunchClassLoader.findClass(RelaunchClassLoader.java:185)

at java.lang.ClassLoader.loadClass(ClassLoader.java:306)

at java.lang.ClassLoader.loadClass(ClassLoader.java:247)

... 33 more

Caused by: java.lang.RuntimeException: Attempted to load class ayp for invalid side SERVER

at cpw.mods.fml.common.asm.transformers.SideTransformer.transform(SideTransformer.java:38)

at cpw.mods.fml.relauncher.RelaunchClassLoader.runTransformers(RelaunchClassLoader.java:228)

at cpw.mods.fml.relauncher.RelaunchClassLoader.findClass(RelaunchClassLoader.java:173)

... 35 more

2013-01-14 05:17:49 [iNFO] [sTDERR] cpw.mods.fml.common.LoaderException: java.lang.NoClassDefFoundError: ayp

2013-01-14 05:17:49 [iNFO] [sTDERR] at cpw.mods.fml.common.LoadController.transition(LoadController.java:117)

2013-01-14 05:17:49 [iNFO] [sTDERR] at cpw.mods.fml.common.Loader.initializeMods(Loader.java:658)

2013-01-14 05:17:49 [iNFO] [sTDERR] at cpw.mods.fml.server.FMLServerHandler.finishServerLoading(FMLServerHandler.java:94)

2013-01-14 05:17:49 [iNFO] [sTDERR] at cpw.mods.fml.common.FMLCommonHandler.onServerStarted(FMLCommonHandler.java:350)

2013-01-14 05:17:49 [iNFO] [sTDERR] at ho.c(DedicatedServer.java:135)

2013-01-14 05:17:49 [iNFO] [sTDERR] at net.minecraft.server.MinecraftServer.run(MinecraftServer.java:458)

2013-01-14 05:17:49 [iNFO] [sTDERR] at fy.run(SourceFile:849)

2013-01-14 05:17:49 [iNFO] [sTDERR] Caused by: java.lang.NoClassDefFoundError: ayp

2013-01-14 05:17:49 [iNFO] [sTDERR] at net.minecraftforge.client.MinecraftForgeClient.preloadTexture(MinecraftForgeClient.java:41)

2013-01-14 05:17:49 [iNFO] [sTDERR] at net.instahouse.InstaHouse.preloadTextures(InstaHouse.java:151)

2013-01-14 05:17:49 [iNFO] [sTDERR] at net.instahouse.InstaHouse.load(InstaHouse.java:83)

2013-01-14 05:17:49 [iNFO] [sTDERR] at sun.reflect.NativeMethodAccessorImpl.invoke0(Native Method)

2013-01-14 05:17:49 [iNFO] [sTDERR] at sun.reflect.NativeMethodAccessorImpl.invoke(NativeMethodAccessorImpl.java:39)

2013-01-14 05:17:49 [iNFO] [sTDERR] at sun.reflect.DelegatingMethodAccessorImpl.invoke(DelegatingMethodAccessorImpl.java:25)

2013-01-14 05:17:49 [iNFO] [sTDERR] at java.lang.reflect.Method.invoke(Method.java:597)

2013-01-14 05:17:49 [iNFO] [sTDERR] at cpw.mods.fml.common.FMLModContainer.handleModStateEvent(FMLModContainer.java:485)

2013-01-14 05:17:49 [iNFO] [sTDERR] at sun.reflect.GeneratedMethodAccessor3.invoke(Unknown Source)

2013-01-14 05:17:49 [iNFO] [sTDERR] at sun.reflect.DelegatingMethodAccessorImpl.invoke(DelegatingMethodAccessorImpl.java:25)

2013-01-14 05:17:49 [iNFO] [sTDERR] at java.lang.reflect.Method.invoke(Method.java:597)

2013-01-14 05:17:49 [iNFO] [sTDERR] at com.google.common.eventbus.EventHandler.handleEvent(EventHandler.java:69)

2013-01-14 05:17:49 [iNFO] [sTDERR] at com.google.common.eventbus.SynchronizedEventHandler.handleEvent(SynchronizedEventHandler.java:45)

2013-01-14 05:17:49 [iNFO] [sTDERR] at com.google.common.eventbus.EventBus.dispatch(EventBus.java:317)

2013-01-14 05:17:49 [iNFO] [sTDERR] at com.google.common.eventbus.EventBus.dispatchQueuedEvents(EventBus.java:300)

2013-01-14 05:17:49 [iNFO] [sTDERR] at com.google.common.eventbus.EventBus.post(EventBus.java:268)

2013-01-14 05:17:49 [iNFO] [sTDERR] at cpw.mods.fml.common.LoadController.propogateStateMessage(LoadController.java:140)

2013-01-14 05:17:49 [iNFO] [sTDERR] at sun.reflect.NativeMethodAccessorImpl.invoke0(Native Method)

2013-01-14 05:17:49 [iNFO] [sTDERR] at sun.reflect.NativeMethodAccessorImpl.invoke(NativeMethodAccessorImpl.java:39)

2013-01-14 05:17:49 [iNFO] [sTDERR] at sun.reflect.DelegatingMethodAccessorImpl.invoke(DelegatingMethodAccessorImpl.java:25)

2013-01-14 05:17:49 [iNFO] [sTDERR] at java.lang.reflect.Method.invoke(Method.java:597)

2013-01-14 05:17:49 [iNFO] [sTDERR] at com.google.common.eventbus.EventHandler.handleEvent(EventHandler.java:69)

2013-01-14 05:17:49 [iNFO] [sTDERR] at com.google.common.eventbus.SynchronizedEventHandler.handleEvent(SynchronizedEventHandler.java:45)

2013-01-14 05:17:49 [iNFO] [sTDERR] at com.google.common.eventbus.EventBus.dispatch(EventBus.java:317)

2013-01-14 05:17:49 [iNFO] [sTDERR] at com.google.common.eventbus.EventBus.dispatchQueuedEvents(EventBus.java:300)

2013-01-14 05:17:49 [iNFO] [sTDERR] at com.google.common.eventbus.EventBus.post(EventBus.java:268)

2013-01-14 05:17:49 [iNFO] [sTDERR] at cpw.mods.fml.common.LoadController.distributeStateMessage(LoadController.java:83)

2013-01-14 05:17:49 [iNFO] [sTDERR] at cpw.mods.fml.common.Loader.initializeMods(Loader.java:657)

2013-01-14 05:17:49 [iNFO] [sTDERR] ... 5 more

2013-01-14 05:17:49 [iNFO] [sTDERR] Caused by: java.lang.ClassNotFoundException: ayp

2013-01-14 05:17:49 [iNFO] [sTDERR] at cpw.mods.fml.relauncher.RelaunchClassLoader.findClass(RelaunchClassLoader.java:185)

2013-01-14 05:17:49 [iNFO] [sTDERR] at java.lang.ClassLoader.loadClass(ClassLoader.java:306)

2013-01-14 05:17:49 [iNFO] [sTDERR] at java.lang.ClassLoader.loadClass(ClassLoader.java:247)

2013-01-14 05:17:49 [iNFO] [sTDERR] ... 33 more

2013-01-14 05:17:49 [iNFO] [sTDERR] Caused by: java.lang.RuntimeException: Attempted to load class ayp for invalid side SERVER

2013-01-14 05:17:49 [iNFO] [sTDERR] at cpw.mods.fml.common.asm.transformers.SideTransformer.transform(SideTransformer.java:38)

2013-01-14 05:17:49 [iNFO] [sTDERR] at cpw.mods.fml.relauncher.RelaunchClassLoader.runTransformers(RelaunchClassLoader.java:228)

2013-01-14 05:17:49 [iNFO] [sTDERR] at cpw.mods.fml.relauncher.RelaunchClassLoader.findClass(RelaunchClassLoader.java:173)

2013-01-14 05:17:49 [iNFO] [sTDERR] ... 35 more

2013-01-14 05:17:49 [sEVERE] [Minecraft] Encountered an unexpected exception LoaderException

cpw.mods.fml.common.LoaderException: java.lang.NoClassDefFoundError: ayp

at cpw.mods.fml.common.LoadController.transition(LoadController.java:117)

at cpw.mods.fml.common.Loader.initializeMods(Loader.java:658)

at cpw.mods.fml.server.FMLServerHandler.finishServerLoading(FMLServerHandler.java:94)

at cpw.mods.fml.common.FMLCommonHandler.onServerStarted(FMLCommonHandler.java:350)

at ho.c(DedicatedServer.java:135)

at net.minecraft.server.MinecraftServer.run(MinecraftServer.java:458)

at fy.run(SourceFile:849)

Caused by: java.lang.NoClassDefFoundError: ayp

at net.minecraftforge.client.MinecraftForgeClient.preloadTexture(MinecraftForgeClient.java:41)

at net.instahouse.InstaHouse.preloadTextures(InstaHouse.java:151)

at net.instahouse.InstaHouse.load(InstaHouse.java:83)

at sun.reflect.NativeMethodAccessorImpl.invoke0(Native Method)

at sun.reflect.NativeMethodAccessorImpl.invoke(NativeMethodAccessorImpl.java:39)

at sun.reflect.DelegatingMethodAccessorImpl.invoke(DelegatingMethodAccessorImpl.java:25)

at java.lang.reflect.Method.invoke(Method.java:597)

at cpw.mods.fml.common.FMLModContainer.handleModStateEvent(FMLModContainer.java:485)

at sun.reflect.GeneratedMethodAccessor3.invoke(Unknown Source)

at sun.reflect.DelegatingMethodAccessorImpl.invoke(DelegatingMethodAccessorImpl.java:25)

at java.lang.reflect.Method.invoke(Method.java:597)

at com.google.common.eventbus.EventHandler.handleEvent(EventHandler.java:69)

at com.google.common.eventbus.SynchronizedEventHandler.handleEvent(SynchronizedEventHandler.java:45)

at com.google.common.eventbus.EventBus.dispatch(EventBus.java:317)

at com.google.common.eventbus.EventBus.dispatchQueuedEvents(EventBus.java:300)

at com.google.common.eventbus.EventBus.post(EventBus.java:268)

at cpw.mods.fml.common.LoadController.propogateStateMessage(LoadController.java:140)

at sun.reflect.NativeMethodAccessorImpl.invoke0(Native Method)

at sun.reflect.NativeMethodAccessorImpl.invoke(NativeMethodAccessorImpl.java:39)

at sun.reflect.DelegatingMethodAccessorImpl.invoke(DelegatingMethodAccessorImpl.java:25)

at java.lang.reflect.Method.invoke(Method.java:597)

at com.google.common.eventbus.EventHandler.handleEvent(EventHandler.java:69)

at com.google.common.eventbus.SynchronizedEventHandler.handleEvent(SynchronizedEventHandler.java:45)

at com.google.common.eventbus.EventBus.dispatch(EventBus.java:317)

at com.google.common.eventbus.EventBus.dispatchQueuedEvents(EventBus.java:300)

at com.google.common.eventbus.EventBus.post(EventBus.java:268)

at cpw.mods.fml.common.LoadController.distributeStateMessage(LoadController.java:83)

at cpw.mods.fml.common.Loader.initializeMods(Loader.java:657)

... 5 more

Caused by: java.lang.ClassNotFoundException: ayp

at cpw.mods.fml.relauncher.RelaunchClassLoader.findClass(RelaunchClassLoader.java:185)

at java.lang.ClassLoader.loadClass(ClassLoader.java:306)

at java.lang.ClassLoader.loadClass(ClassLoader.java:247)

... 33 more

Caused by: java.lang.RuntimeException: Attempted to load class ayp for invalid side SERVER

at cpw.mods.fml.common.asm.transformers.SideTransformer.transform(SideTransformer.java:38)

at cpw.mods.fml.relauncher.RelaunchClassLoader.runTransformers(RelaunchClassLoader.java:228)

at cpw.mods.fml.relauncher.RelaunchClassLoader.findClass(RelaunchClassLoader.java:173)

... 35 more

2013-01-14 05:17:49 [sEVERE] [Minecraft] This crash report has been saved to: /Users/****/Desktop/****/Server/./crash-reports/crash-2013-01-14_05.17.49-server.txt

 

(Censored personal info.)

 

 

 

And here's the crash report.

 

---- Minecraft Crash Report ----

// Shall we play a game?

 

Time: 1/14/13 5:17 AM

Description: Exception in server tick loop

 

cpw.mods.fml.common.LoaderException: java.lang.NoClassDefFoundError: ayp

at cpw.mods.fml.common.LoadController.transition(LoadController.java:117)

at cpw.mods.fml.common.Loader.initializeMods(Loader.java:658)

at cpw.mods.fml.server.FMLServerHandler.finishServerLoading(FMLServerHandler.java:94)

at cpw.mods.fml.common.FMLCommonHandler.onServerStarted(FMLCommonHandler.java:350)

at ho.c(DedicatedServer.java:135)

at net.minecraft.server.MinecraftServer.run(MinecraftServer.java:458)

at fy.run(SourceFile:849)

Caused by: java.lang.NoClassDefFoundError: ayp

at net.minecraftforge.client.MinecraftForgeClient.preloadTexture(MinecraftForgeClient.java:41)

at net.instahouse.InstaHouse.preloadTextures(InstaHouse.java:151)

at net.instahouse.InstaHouse.load(InstaHouse.java:83)

at sun.reflect.NativeMethodAccessorImpl.invoke0(Native Method)

at sun.reflect.NativeMethodAccessorImpl.invoke(NativeMethodAccessorImpl.java:39)

at sun.reflect.DelegatingMethodAccessorImpl.invoke(DelegatingMethodAccessorImpl.java:25)

at java.lang.reflect.Method.invoke(Method.java:597)

at cpw.mods.fml.common.FMLModContainer.handleModStateEvent(FMLModContainer.java:485)

at sun.reflect.GeneratedMethodAccessor3.invoke(Unknown Source)

at sun.reflect.DelegatingMethodAccessorImpl.invoke(DelegatingMethodAccessorImpl.java:25)

at java.lang.reflect.Method.invoke(Method.java:597)

at com.google.common.eventbus.EventHandler.handleEvent(EventHandler.java:69)

at com.google.common.eventbus.SynchronizedEventHandler.handleEvent(SynchronizedEventHandler.java:45)

at com.google.common.eventbus.EventBus.dispatch(EventBus.java:317)

at com.google.common.eventbus.EventBus.dispatchQueuedEvents(EventBus.java:300)

at com.google.common.eventbus.EventBus.post(EventBus.java:268)

at cpw.mods.fml.common.LoadController.propogateStateMessage(LoadController.java:140)

at sun.reflect.NativeMethodAccessorImpl.invoke0(Native Method)

at sun.reflect.NativeMethodAccessorImpl.invoke(NativeMethodAccessorImpl.java:39)

at sun.reflect.DelegatingMethodAccessorImpl.invoke(DelegatingMethodAccessorImpl.java:25)

at java.lang.reflect.Method.invoke(Method.java:597)

at com.google.common.eventbus.EventHandler.handleEvent(EventHandler.java:69)

at com.google.common.eventbus.SynchronizedEventHandler.handleEvent(SynchronizedEventHandler.java:45)

at com.google.common.eventbus.EventBus.dispatch(EventBus.java:317)

at com.google.common.eventbus.EventBus.dispatchQueuedEvents(EventBus.java:300)

at com.google.common.eventbus.EventBus.post(EventBus.java:268)

at cpw.mods.fml.common.LoadController.distributeStateMessage(LoadController.java:83)

at cpw.mods.fml.common.Loader.initializeMods(Loader.java:657)

... 5 more

Caused by: java.lang.ClassNotFoundException: ayp

at cpw.mods.fml.relauncher.RelaunchClassLoader.findClass(RelaunchClassLoader.java:185)

at java.lang.ClassLoader.loadClass(ClassLoader.java:306)

at java.lang.ClassLoader.loadClass(ClassLoader.java:247)

... 33 more

Caused by: java.lang.RuntimeException: Attempted to load class ayp for invalid side SERVER

at cpw.mods.fml.common.asm.transformers.SideTransformer.transform(SideTransformer.java:38)

at cpw.mods.fml.relauncher.RelaunchClassLoader.runTransformers(RelaunchClassLoader.java:228)

at cpw.mods.fml.relauncher.RelaunchClassLoader.findClass(RelaunchClassLoader.java:173)

... 35 more

 

 

A detailed walkthrough of the error, its code path and all known details is as follows:

---------------------------------------------------------------------------------------

 

-- System Details --

Details:

Minecraft Version: 1.4.7

Operating System: Mac OS X (x86_64) version 10.7.5

Java Version: 1.6.0_37, Apple Inc.

Java VM Version: Java HotSpot 64-Bit Server VM (mixed mode), Apple Inc.

Memory: 990243456 bytes (944 MB) / 1065025536 bytes (1015 MB) up to 1065025536 bytes (1015 MB)

JVM Flags: 2 total; -Xmx1G -Xms1G

AABB Pool Size: 0 (0 bytes; 0 MB) allocated, 0 (0 bytes; 0 MB) used

Suspicious classes: FML and Forge are installed

IntCache: cache: 0, tcache: 0, allocated: 0, tallocated: 0

FML: MCP v7.26 FML v4.7.4.520 Minecraft Forge 6.6.0.497 20 mods loaded, 20 mods active

mcp [Minecraft Coder Pack] (minecraft.jar) Unloaded->Constructed->Pre-initialized->Initialized

FML [Forge Mod Loader] (coremods) Unloaded->Constructed->Pre-initialized->Initialized

Forge [Minecraft Forge] (coremods) Unloaded->Constructed->Pre-initialized->Initialized

jammyfurniture [Jammy Furniture Mod] (1.4.6_Jammy_Furniture_Mod_V4.0.zip) Unloaded->Constructed->Pre-initialized->Initialized

MinecraftWero [bacon Mod] (Bacon Modv2.3.zip) Unloaded->Constructed->Pre-initialized->Initialized

CameraCraft [CameraCraft] (CameraCraft2.3.zip) Unloaded->Constructed->Pre-initialized->Initialized

JSOne_Studios.CampfireMod [Campfire Mod] (CampfireMod_2.4_for_1.4.7.zip) Unloaded->Constructed->Pre-initialized->Initialized

CBM [Coloured Beds Mod] (ColouredBedsMod v3.0.2 - 1.4.6.zip) Unloaded->Constructed->Pre-initialized->Initialized

UpdateManager_TheWhiteWolves [Mod Update Manager] (ColouredBedsMod v3.0.2 - 1.4.6.zip) Unloaded->Constructed->Pre-initialized->Initialized

CustomSpawner [DrZhark's CustomSpawner] (CustomMobSpawner 1.10.zip) Unloaded->Constructed->Pre-initialized->Initialized

MoCreatures [DrZhark's Mo'Creatures Mod] (DrZharks MoCreatures Mod v4.4.0.zip) Unloaded->Constructed->Pre-initialized->Initialized

Custom House [Custom House] (Insta House v 3.3.zip) Unloaded->Constructed->Pre-initialized->Initialized

IH [insta House] (Insta House v 3.3.zip) Unloaded->Constructed->Pre-initialized->Errored

MoFoliage [Mo' Foliage Forge Edition] (Mo Foliage 1.5.zip) Unloaded->Constructed->Pre-initialized->Initialized

SecretRoomsMod [The SecretRoomsMod] (SecretRoomsMod-universal-4.4.1.158.zip) Unloaded->Constructed->Pre-initialized->Initialized

stillhungry [still Hungry] (StillHungry-v1.0.1.zip) Unloaded->Constructed->Pre-initialized->Initialized

mod_Timber [Timber!] (Timber! (1.4.6).zip) Unloaded->Constructed->Pre-initialized->Initialized

mod_thKaguya [?????MOD+] (Touhou Items Mod v1.71.zip) Unloaded->Constructed->Pre-initialized->Initialized

BetterFurnaces [better Furnaces] ([1.4.6]BetterFurnacesV2.1.zip) Unloaded->Constructed->Pre-initialized->Initialized

Backpack [backpack] (backpack.zip) Unloaded->Constructed->Pre-initialized->Initialized

Profiler Position: N/A (disabled)

Is Modded: Definitely; Server brand changed to 'fml'

Type: Dedicated Server (map_server.txt)

 

Link to comment
Share on other sites

Guest
This topic is now closed to further replies.
 Share



  • Recently Browsing

    No registered users viewing this page.

  • Posts

    • I already created a github account to upload the debug logs but i dont know where to find them also when it disconnects it say something like io.netty.util.illegalreferencecountexception
    • Hello again sorry for that post i searched further and found à project that re implemented item render
    • hello if someone that can do something see this post i ask him or her to re implement item render. i found an interesting mod that needs it to be updated to higher version precisely in 1.12.2 (it is said on the mod page).the mod is modular bosses if u can't do that pls answer me at my mail adress syanntournadre3@gmail.com and if u can answer after it's done pls. here's the page of the mod https://www.curseforge.com/minecraft/mc-mods/modular-bosses
    • I had posted Block class. Minecraft wiki said,A redstone repeater can power any opaque block (including any opaque mechanism components). for xample stone  sand block can be powerd.  I have registed it as Rendertype solid, but it doesn't work. 
    • gradle fails to build   Microsoft Windows [Version 10.0.19044.1466] (c) Microsoft Corporation. All rights reserved. C:\Users\Admn\Desktop\OresCollection\oresCollections>gradlew genEclipseRuns To honour the JVM settings for this build a single-use Daemon process will be forked. See https://docs.gradle.org/7.3/userguide/gradle_daemon.html#sec:disabling_the_daemon. Daemon will be stopped at the end of the build > Configure project : Java: 17.0.1 JVM: 17.0.1+12(Eclipse Adoptium) Arch: amd64 Error getting artifact: net.minecraft:client:1.18.1:mappings@txt from MinecraftRepo javax.net.ssl.SSLHandshakeException: PKIX path building failed: sun.security.provider.certpath.SunCertPathBuilderException: unable to find valid certification path to requested target at java.base/sun.security.ssl.Alert.createSSLException(Alert.java:131) at java.base/sun.security.ssl.TransportContext.fatal(TransportContext.java:370) at java.base/sun.security.ssl.TransportContext.fatal(TransportContext.java:313) at java.base/sun.security.ssl.TransportContext.fatal(TransportContext.java:308) at java.base/sun.security.ssl.CertificateMessage$T12CertificateConsumer.checkServerCerts(CertificateMessage.java:654) at java.base/sun.security.ssl.CertificateMessage$T12CertificateConsumer.onCertificate(CertificateMessage.java:473) at java.base/sun.security.ssl.CertificateMessage$T12CertificateConsumer.consume(CertificateMessage.java:369) at java.base/sun.security.ssl.SSLHandshake.consume(SSLHandshake.java:396) at java.base/sun.security.ssl.HandshakeContext.dispatch(HandshakeContext.java:480) at java.base/sun.security.ssl.HandshakeContext.dispatch(HandshakeContext.java:458) at java.base/sun.security.ssl.TransportContext.dispatch(TransportContext.java:200) at java.base/sun.security.ssl.SSLTransport.decode(SSLTransport.java:172) at java.base/sun.security.ssl.SSLSocketImpl.decode(SSLSocketImpl.java:1500) at java.base/sun.security.ssl.SSLSocketImpl.readHandshakeRecord(SSLSocketImpl.java:1415) at java.base/sun.security.ssl.SSLSocketImpl.startHandshake(SSLSocketImpl.java:450) at java.base/sun.security.ssl.SSLSocketImpl.startHandshake(SSLSocketImpl.java:421) at java.base/sun.net.www.protocol.https.HttpsClient.afterConnect(HttpsClient.java:580) at java.base/sun.net.www.protocol.https.AbstractDelegateHttpsURLConnection.connect(AbstractDelegateHttpsURLConnection.java:183) at java.base/sun.net.www.protocol.https.HttpsURLConnectionImpl.connect(HttpsURLConnectionImpl.java:142) at net.minecraftforge.gradle.common.util.DownloadUtils.connectHttpWithRedirects(DownloadUtils.java:220) at net.minecraftforge.gradle.common.util.DownloadUtils.downloadEtag(DownloadUtils.java:57) at net.minecraftforge.gradle.common.util.MinecraftRepo.findVersion(MinecraftRepo.java:199) at net.minecraftforge.gradle.common.util.MinecraftRepo.findFile(MinecraftRepo.java:129) at net.minecraftforge.gradle.common.util.BaseRepo.getArtifact(BaseRepo.java:86) at net.minecraftforge.gradle.common.util.BaseRepo.getArtifact(BaseRepo.java:43) at net.minecraftforge.gradle.common.util.BaseRepo$Builder.lambda$null$0(BaseRepo.java:133) at java.base/java.util.stream.ReferencePipeline$3$1.accept(ReferencePipeline.java:197) at java.base/java.util.ArrayList$ArrayListSpliterator.tryAdvance(ArrayList.java:1602) at java.base/java.util.stream.ReferencePipeline.forEachWithCancel(ReferencePipeline.java:129) at java.base/java.util.stream.AbstractPipeline.copyIntoWithCancel(AbstractPipeline.java:527) at java.base/java.util.stream.AbstractPipeline.copyInto(AbstractPipeline.java:513) at java.base/java.util.stream.AbstractPipeline.wrapAndCopyInto(AbstractPipeline.java:499) at java.base/java.util.stream.FindOps$FindOp.evaluateSequential(FindOps.java:150) at java.base/java.util.stream.AbstractPipeline.evaluate(AbstractPipeline.java:234) at java.base/java.util.stream.ReferencePipeline.findFirst(ReferencePipeline.java:647) at net.minecraftforge.gradle.common.util.BaseRepo$Builder.lambda$attach$2(BaseRepo.java:135) at net.minecraftforge.artifactural.base.repository.ArtifactProviderBuilder$Complete.getArtifact(ArtifactProviderBuilder.java:92) at net.minecraftforge.artifactural.base.repository.SimpleRepository.getArtifact(SimpleRepository.java:41) at net.minecraftforge.artifactural.gradle.GradleRepositoryAdapter.getArtifact(GradleRepositoryAdapter.java:326) at net.minecraftforge.gradle.common.util.MavenArtifactDownloader._generate(MavenArtifactDownloader.java:192) at net.minecraftforge.gradle.common.util.MavenArtifactDownloader._download(MavenArtifactDownloader.java:163) at net.minecraftforge.gradle.common.util.MavenArtifactDownloader.generate(MavenArtifactDownloader.java:95) at net.minecraftforge.gradle.common.util.MojangLicenseHelper.getOfficialLicense(MojangLicenseHelper.java:118) at net.minecraftforge.gradle.common.util.MojangLicenseHelper.displayWarning(MojangLicenseHelper.java:50) at net.minecraftforge.gradle.common.util.MojangLicenseHelper.displayWarning(MojangLicenseHelper.java:41) at net.minecraftforge.gradle.userdev.UserDevPlugin.lambda$apply$26(UserDevPlugin.java:255) at org.gradle.configuration.internal.DefaultUserCodeApplicationContext$CurrentApplication$1.execute(DefaultUserCodeApplicationContext.java:123) at org.gradle.configuration.internal.DefaultListenerBuildOperationDecorator$BuildOperationEmittingAction$1.run(DefaultListenerBuildOperationDecorator.java:152) at org.gradle.internal.operations.DefaultBuildOperationRunner$1.execute(DefaultBuildOperationRunner.java:29) at org.gradle.internal.operations.DefaultBuildOperationRunner$1.execute(DefaultBuildOperationRunner.java:26) at org.gradle.internal.operations.DefaultBuildOperationRunner$2.execute(DefaultBuildOperationRunner.java:66) at org.gradle.internal.operations.DefaultBuildOperationRunner$2.execute(DefaultBuildOperationRunner.java:59) at org.gradle.internal.operations.DefaultBuildOperationRunner.execute(DefaultBuildOperationRunner.java:157) at org.gradle.internal.operations.DefaultBuildOperationRunner.execute(DefaultBuildOperationRunner.java:59) at org.gradle.internal.operations.DefaultBuildOperationRunner.run(DefaultBuildOperationRunner.java:47) at org.gradle.internal.operations.DefaultBuildOperationExecutor.run(DefaultBuildOperationExecutor.java:68) at org.gradle.configuration.internal.DefaultListenerBuildOperationDecorator$BuildOperationEmittingAction.execute(DefaultListenerBuildOperationDecorator.java:149) at org.gradle.internal.event.BroadcastDispatch$ActionInvocationHandler.dispatch(BroadcastDispatch.java:95) at org.gradle.internal.event.BroadcastDispatch$ActionInvocationHandler.dispatch(BroadcastDispatch.java:83) at org.gradle.internal.event.AbstractBroadcastDispatch.dispatch(AbstractBroadcastDispatch.java:43) at org.gradle.internal.event.BroadcastDispatch$SingletonDispatch.dispatch(BroadcastDispatch.java:245) at org.gradle.internal.event.BroadcastDispatch$SingletonDispatch.dispatch(BroadcastDispatch.java:157) at org.gradle.internal.event.AbstractBroadcastDispatch.dispatch(AbstractBroadcastDispatch.java:61) at org.gradle.internal.event.BroadcastDispatch$CompositeDispatch.dispatch(BroadcastDispatch.java:346) at org.gradle.internal.event.BroadcastDispatch$CompositeDispatch.dispatch(BroadcastDispatch.java:249) at org.gradle.internal.event.ListenerBroadcast.dispatch(ListenerBroadcast.java:141) at org.gradle.internal.event.ListenerBroadcast.dispatch(ListenerBroadcast.java:37) at org.gradle.internal.dispatch.ProxyDispatchAdapter$DispatchingInvocationHandler.invoke(ProxyDispatchAdapter.java:94) at jdk.proxy1/jdk.proxy1.$Proxy42.afterEvaluate(Unknown Source) at org.gradle.configuration.project.LifecycleProjectEvaluator$NotifyAfterEvaluate$1.execute(LifecycleProjectEvaluator.java:187) at org.gradle.configuration.project.LifecycleProjectEvaluator$NotifyAfterEvaluate$1.execute(LifecycleProjectEvaluator.java:184) at org.gradle.api.internal.project.DefaultProject.stepEvaluationListener(DefaultProject.java:1429) at org.gradle.configuration.project.LifecycleProjectEvaluator$NotifyAfterEvaluate.run(LifecycleProjectEvaluator.java:193) at org.gradle.internal.operations.DefaultBuildOperationRunner$1.execute(DefaultBuildOperationRunner.java:29) at org.gradle.internal.operations.DefaultBuildOperationRunner$1.execute(DefaultBuildOperationRunner.java:26) at org.gradle.internal.operations.DefaultBuildOperationRunner$2.execute(DefaultBuildOperationRunner.java:66) at org.gradle.internal.operations.DefaultBuildOperationRunner$2.execute(DefaultBuildOperationRunner.java:59) at org.gradle.internal.operations.DefaultBuildOperationRunner.execute(DefaultBuildOperationRunner.java:157) at org.gradle.internal.operations.DefaultBuildOperationRunner.execute(DefaultBuildOperationRunner.java:59) at org.gradle.internal.operations.DefaultBuildOperationRunner.run(DefaultBuildOperationRunner.java:47) at org.gradle.internal.operations.DefaultBuildOperationExecutor.run(DefaultBuildOperationExecutor.java:68) at org.gradle.configuration.project.LifecycleProjectEvaluator$EvaluateProject.lambda$run$0(LifecycleProjectEvaluator.java:105) at org.gradle.api.internal.project.DefaultProjectStateRegistry$ProjectStateImpl.lambda$applyToMutableState$0(DefaultProjectStateRegistry.java:366) at org.gradle.api.internal.project.DefaultProjectStateRegistry$ProjectStateImpl.lambda$withProjectLock$3(DefaultProjectStateRegistry.java:426) at org.gradle.internal.work.DefaultWorkerLeaseService.withLocks(DefaultWorkerLeaseService.java:211) at org.gradle.api.internal.project.DefaultProjectStateRegistry$ProjectStateImpl.withProjectLock(DefaultProjectStateRegistry.java:426) at org.gradle.api.internal.project.DefaultProjectStateRegistry$ProjectStateImpl.fromMutableState(DefaultProjectStateRegistry.java:407) at org.gradle.api.internal.project.DefaultProjectStateRegistry$ProjectStateImpl.applyToMutableState(DefaultProjectStateRegistry.java:365) at org.gradle.configuration.project.LifecycleProjectEvaluator$EvaluateProject.run(LifecycleProjectEvaluator.java:91) at org.gradle.internal.operations.DefaultBuildOperationRunner$1.execute(DefaultBuildOperationRunner.java:29) at org.gradle.internal.operations.DefaultBuildOperationRunner$1.execute(DefaultBuildOperationRunner.java:26) at org.gradle.internal.operations.DefaultBuildOperationRunner$2.execute(DefaultBuildOperationRunner.java:66) at org.gradle.internal.operations.DefaultBuildOperationRunner$2.execute(DefaultBuildOperationRunner.java:59) at org.gradle.internal.operations.DefaultBuildOperationRunner.execute(DefaultBuildOperationRunner.java:157) at org.gradle.internal.operations.DefaultBuildOperationRunner.execute(DefaultBuildOperationRunner.java:59) at org.gradle.internal.operations.DefaultBuildOperationRunner.run(DefaultBuildOperationRunner.java:47) at org.gradle.internal.operations.DefaultBuildOperationExecutor.run(DefaultBuildOperationExecutor.java:68) at org.gradle.configuration.project.LifecycleProjectEvaluator.evaluate(LifecycleProjectEvaluator.java:63) at org.gradle.api.internal.project.DefaultProject.evaluate(DefaultProject.java:751) at org.gradle.api.internal.project.DefaultProject.evaluate(DefaultProject.java:151) at org.gradle.api.internal.project.DefaultProjectStateRegistry$ProjectStateImpl.ensureConfigured(DefaultProjectStateRegistry.java:339) at org.gradle.execution.TaskPathProjectEvaluator.configure(TaskPathProjectEvaluator.java:41) at org.gradle.execution.TaskPathProjectEvaluator.configureHierarchy(TaskPathProjectEvaluator.java:55) at org.gradle.configuration.DefaultProjectsPreparer.prepareProjects(DefaultProjectsPreparer.java:48) at org.gradle.configuration.BuildTreePreparingProjectsPreparer.prepareProjects(BuildTreePreparingProjectsPreparer.java:64) at org.gradle.configuration.BuildOperationFiringProjectsPreparer$ConfigureBuild.run(BuildOperationFiringProjectsPreparer.java:52) at org.gradle.internal.operations.DefaultBuildOperationRunner$1.execute(DefaultBuildOperationRunner.java:29) at org.gradle.internal.operations.DefaultBuildOperationRunner$1.execute(DefaultBuildOperationRunner.java:26) at org.gradle.internal.operations.DefaultBuildOperationRunner$2.execute(DefaultBuildOperationRunner.java:66) at org.gradle.internal.operations.DefaultBuildOperationRunner$2.execute(DefaultBuildOperationRunner.java:59) at org.gradle.internal.operations.DefaultBuildOperationRunner.execute(DefaultBuildOperationRunner.java:157) at org.gradle.internal.operations.DefaultBuildOperationRunner.execute(DefaultBuildOperationRunner.java:59) at org.gradle.internal.operations.DefaultBuildOperationRunner.run(DefaultBuildOperationRunner.java:47) at org.gradle.internal.operations.DefaultBuildOperationExecutor.run(DefaultBuildOperationExecutor.java:68) at org.gradle.configuration.BuildOperationFiringProjectsPreparer.prepareProjects(BuildOperationFiringProjectsPreparer.java:40) at org.gradle.initialization.VintageBuildModelController.lambda$prepareProjects$1(VintageBuildModelController.java:93) at org.gradle.internal.build.StateTransitionController.lambda$doTransition$1(StateTransitionController.java:222) at org.gradle.internal.build.StateTransitionController.doTransition(StateTransitionController.java:243) at org.gradle.internal.build.StateTransitionController.doTransition(StateTransitionController.java:221) at org.gradle.internal.build.StateTransitionController.transitionIfNotPreviously(StateTransitionController.java:190) at org.gradle.initialization.VintageBuildModelController.prepareProjects(VintageBuildModelController.java:93) at org.gradle.initialization.VintageBuildModelController.doBuildStages(VintageBuildModelController.java:77) at org.gradle.initialization.VintageBuildModelController.prepareToScheduleTasks(VintageBuildModelController.java:64) at org.gradle.internal.build.DefaultBuildLifecycleController.lambda$prepareToScheduleTasks$0(DefaultBuildLifecycleController.java:105) at org.gradle.internal.build.StateTransitionController.lambda$doTransition$1(StateTransitionController.java:222) at org.gradle.internal.build.StateTransitionController.doTransition(StateTransitionController.java:243) at org.gradle.internal.build.StateTransitionController.doTransition(StateTransitionController.java:221) at org.gradle.internal.build.StateTransitionController.maybeTransition(StateTransitionController.java:174) at org.gradle.internal.build.DefaultBuildLifecycleController.prepareToScheduleTasks(DefaultBuildLifecycleController.java:103) at org.gradle.internal.buildtree.DefaultBuildTreeWorkPreparer.scheduleRequestedTasks(DefaultBuildTreeWorkPreparer.java:33) at org.gradle.internal.buildtree.DefaultBuildTreeLifecycleController.lambda$doScheduleAndRunTasks$2(DefaultBuildTreeLifecycleController.java:86) at org.gradle.composite.internal.DefaultIncludedBuildTaskGraph.withNewTaskGraph(DefaultIncludedBuildTaskGraph.java:94) at org.gradle.internal.buildtree.DefaultBuildTreeLifecycleController.doScheduleAndRunTasks(DefaultBuildTreeLifecycleController.java:85) at org.gradle.internal.buildtree.DefaultBuildTreeLifecycleController.lambda$runBuild$4(DefaultBuildTreeLifecycleController.java:103) at org.gradle.internal.build.StateTransitionController.lambda$transition$0(StateTransitionController.java:145) at org.gradle.internal.build.StateTransitionController.doTransition(StateTransitionController.java:243) at org.gradle.internal.build.StateTransitionController.transition(StateTransitionController.java:145) at org.gradle.internal.buildtree.DefaultBuildTreeLifecycleController.runBuild(DefaultBuildTreeLifecycleController.java:100) at org.gradle.internal.buildtree.DefaultBuildTreeLifecycleController.scheduleAndRunTasks(DefaultBuildTreeLifecycleController.java:66) at org.gradle.tooling.internal.provider.ExecuteBuildActionRunner.run(ExecuteBuildActionRunner.java:31) at org.gradle.launcher.exec.ChainingBuildActionRunner.run(ChainingBuildActionRunner.java:35) at org.gradle.internal.buildtree.ProblemReportingBuildActionRunner.run(ProblemReportingBuildActionRunner.java:49) at org.gradle.launcher.exec.BuildOutcomeReportingBuildActionRunner.run(BuildOutcomeReportingBuildActionRunner.java:69) at org.gradle.tooling.internal.provider.FileSystemWatchingBuildActionRunner.run(FileSystemWatchingBuildActionRunner.java:114) at org.gradle.launcher.exec.BuildCompletionNotifyingBuildActionRunner.run(BuildCompletionNotifyingBuildActionRunner.java:41) at org.gradle.launcher.exec.RootBuildLifecycleBuildActionExecutor.lambda$execute$0(RootBuildLifecycleBuildActionExecutor.java:40) at org.gradle.composite.internal.DefaultRootBuildState.run(DefaultRootBuildState.java:155) at org.gradle.launcher.exec.RootBuildLifecycleBuildActionExecutor.execute(RootBuildLifecycleBuildActionExecutor.java:40) at org.gradle.internal.buildtree.DefaultBuildTreeContext.execute(DefaultBuildTreeContext.java:40) at org.gradle.launcher.exec.BuildTreeLifecycleBuildActionExecutor.lambda$execute$0(BuildTreeLifecycleBuildActionExecutor.java:65) at org.gradle.internal.buildtree.BuildTreeState.run(BuildTreeState.java:53) at org.gradle.launcher.exec.BuildTreeLifecycleBuildActionExecutor.execute(BuildTreeLifecycleBuildActionExecutor.java:65) at org.gradle.launcher.exec.RunAsBuildOperationBuildActionExecutor$3.call(RunAsBuildOperationBuildActionExecutor.java:61) at org.gradle.launcher.exec.RunAsBuildOperationBuildActionExecutor$3.call(RunAsBuildOperationBuildActionExecutor.java:57) at org.gradle.internal.operations.DefaultBuildOperationRunner$CallableBuildOperationWorker.execute(DefaultBuildOperationRunner.java:204) at org.gradle.internal.operations.DefaultBuildOperationRunner$CallableBuildOperationWorker.execute(DefaultBuildOperationRunner.java:199) at org.gradle.internal.operations.DefaultBuildOperationRunner$2.execute(DefaultBuildOperationRunner.java:66) at org.gradle.internal.operations.DefaultBuildOperationRunner$2.execute(DefaultBuildOperationRunner.java:59) at org.gradle.internal.operations.DefaultBuildOperationRunner.execute(DefaultBuildOperationRunner.java:157) at org.gradle.internal.operations.DefaultBuildOperationRunner.execute(DefaultBuildOperationRunner.java:59) at org.gradle.internal.operations.DefaultBuildOperationRunner.call(DefaultBuildOperationRunner.java:53) at org.gradle.internal.operations.DefaultBuildOperationExecutor.call(DefaultBuildOperationExecutor.java:73) at org.gradle.launcher.exec.RunAsBuildOperationBuildActionExecutor.execute(RunAsBuildOperationBuildActionExecutor.java:57) at org.gradle.launcher.exec.RunAsWorkerThreadBuildActionExecutor.lambda$execute$0(RunAsWorkerThreadBuildActionExecutor.java:38) at org.gradle.internal.work.DefaultWorkerLeaseService.withLocks(DefaultWorkerLeaseService.java:211) at org.gradle.launcher.exec.RunAsWorkerThreadBuildActionExecutor.execute(RunAsWorkerThreadBuildActionExecutor.java:38) at org.gradle.tooling.internal.provider.ContinuousBuildActionExecutor.execute(ContinuousBuildActionExecutor.java:103) at org.gradle.tooling.internal.provider.SubscribableBuildActionExecutor.execute(SubscribableBuildActionExecutor.java:64) at org.gradle.internal.session.DefaultBuildSessionContext.execute(DefaultBuildSessionContext.java:46) at org.gradle.tooling.internal.provider.BuildSessionLifecycleBuildActionExecuter$ActionImpl.apply(BuildSessionLifecycleBuildActionExecuter.java:100) at org.gradle.tooling.internal.provider.BuildSessionLifecycleBuildActionExecuter$ActionImpl.apply(BuildSessionLifecycleBuildActionExecuter.java:88) at org.gradle.internal.session.BuildSessionState.run(BuildSessionState.java:69) at org.gradle.tooling.internal.provider.BuildSessionLifecycleBuildActionExecuter.execute(BuildSessionLifecycleBuildActionExecuter.java:62) at org.gradle.tooling.internal.provider.BuildSessionLifecycleBuildActionExecuter.execute(BuildSessionLifecycleBuildActionExecuter.java:41) at org.gradle.tooling.internal.provider.GradleThreadBuildActionExecuter.execute(GradleThreadBuildActionExecuter.java:36) at org.gradle.tooling.internal.provider.GradleThreadBuildActionExecuter.execute(GradleThreadBuildActionExecuter.java:25) at org.gradle.tooling.internal.provider.StartParamsValidatingActionExecuter.execute(StartParamsValidatingActionExecuter.java:63) at org.gradle.tooling.internal.provider.StartParamsValidatingActionExecuter.execute(StartParamsValidatingActionExecuter.java:31) at org.gradle.tooling.internal.provider.SessionFailureReportingActionExecuter.execute(SessionFailureReportingActionExecuter.java:58) at org.gradle.tooling.internal.provider.SessionFailureReportingActionExecuter.execute(SessionFailureReportingActionExecuter.java:42) at org.gradle.tooling.internal.provider.SetupLoggingActionExecuter.execute(SetupLoggingActionExecuter.java:47) at org.gradle.tooling.internal.provider.SetupLoggingActionExecuter.execute(SetupLoggingActionExecuter.java:31) at org.gradle.launcher.daemon.server.exec.ExecuteBuild.doBuild(ExecuteBuild.java:65) at org.gradle.launcher.daemon.server.exec.BuildCommandOnly.execute(BuildCommandOnly.java:37) at org.gradle.launcher.daemon.server.api.DaemonCommandExecution.proceed(DaemonCommandExecution.java:104) at org.gradle.launcher.daemon.server.exec.WatchForDisconnection.execute(WatchForDisconnection.java:39) at org.gradle.launcher.daemon.server.api.DaemonCommandExecution.proceed(DaemonCommandExecution.java:104) at org.gradle.launcher.daemon.server.exec.ResetDeprecationLogger.execute(ResetDeprecationLogger.java:29) at org.gradle.launcher.daemon.server.api.DaemonCommandExecution.proceed(DaemonCommandExecution.java:104) at org.gradle.launcher.daemon.server.exec.RequestStopIfSingleUsedDaemon.execute(RequestStopIfSingleUsedDaemon.java:35) at org.gradle.launcher.daemon.server.api.DaemonCommandExecution.proceed(DaemonCommandExecution.java:104) at org.gradle.launcher.daemon.server.exec.ForwardClientInput$2.create(ForwardClientInput.java:78) at org.gradle.launcher.daemon.server.exec.ForwardClientInput$2.create(ForwardClientInput.java:75) at org.gradle.util.internal.Swapper.swap(Swapper.java:38) at org.gradle.launcher.daemon.server.exec.ForwardClientInput.execute(ForwardClientInput.java:75) at org.gradle.launcher.daemon.server.api.DaemonCommandExecution.proceed(DaemonCommandExecution.java:104) at org.gradle.launcher.daemon.server.exec.LogAndCheckHealth.execute(LogAndCheckHealth.java:50) at org.gradle.launcher.daemon.server.api.DaemonCommandExecution.proceed(DaemonCommandExecution.java:104) at org.gradle.launcher.daemon.server.exec.LogToClient.doBuild(LogToClient.java:63) at org.gradle.launcher.daemon.server.exec.BuildCommandOnly.execute(BuildCommandOnly.java:37) at org.gradle.launcher.daemon.server.api.DaemonCommandExecution.proceed(DaemonCommandExecution.java:104) at org.gradle.launcher.daemon.server.exec.EstablishBuildEnvironment.doBuild(EstablishBuildEnvironment.java:84) at org.gradle.launcher.daemon.server.exec.BuildCommandOnly.execute(BuildCommandOnly.java:37) at org.gradle.launcher.daemon.server.api.DaemonCommandExecution.proceed(DaemonCommandExecution.java:104) at org.gradle.launcher.daemon.server.exec.StartBuildOrRespondWithBusy$1.run(StartBuildOrRespondWithBusy.java:52) at org.gradle.launcher.daemon.server.DaemonStateCoordinator$1.run(DaemonStateCoordinator.java:297) at org.gradle.internal.concurrent.ExecutorPolicy$CatchAndRecordFailures.onExecute(ExecutorPolicy.java:64) at org.gradle.internal.concurrent.ManagedExecutorImpl$1.run(ManagedExecutorImpl.java:48) at java.base/java.util.concurrent.ThreadPoolExecutor.runWorker(ThreadPoolExecutor.java:1136) at java.base/java.util.concurrent.ThreadPoolExecutor$Worker.run(ThreadPoolExecutor.java:635) at org.gradle.internal.concurrent.ThreadFactoryImpl$ManagedThreadRunnable.run(ThreadFactoryImpl.java:61) at java.base/java.lang.Thread.run(Thread.java:833) Caused by: sun.security.validator.ValidatorException: PKIX path building failed: sun.security.provider.certpath.SunCertPathBuilderException: unable to find valid certification path to requested target at java.base/sun.security.validator.PKIXValidator.doBuild(PKIXValidator.java:439) at java.base/sun.security.validator.PKIXValidator.engineValidate(PKIXValidator.java:306) at java.base/sun.security.validator.Validator.validate(Validator.java:264) at java.base/sun.security.ssl.X509TrustManagerImpl.checkTrusted(X509TrustManagerImpl.java:231) at java.base/sun.security.ssl.X509TrustManagerImpl.checkServerTrusted(X509TrustManagerImpl.java:132) at java.base/sun.security.ssl.CertificateMessage$T12CertificateConsumer.checkServerCerts(CertificateMessage.java:638) ... 207 more Caused by: sun.security.provider.certpath.SunCertPathBuilderException: unable to find valid certification path to requested target at java.base/sun.security.provider.certpath.SunCertPathBuilder.build(SunCertPathBuilder.java:141) at java.base/sun.security.provider.certpath.SunCertPathBuilder.engineBuild(SunCertPathBuilder.java:126) at java.base/java.security.cert.CertPathBuilder.build(CertPathBuilder.java:297) at java.base/sun.security.validator.PKIXValidator.doBuild(PKIXValidator.java:434) ... 212 more WARNING: This project is configured to use the official obfuscation mappings provided by Mojang. These mapping fall under their associated license, you should be fully aware of this license. For the latest license text, refer to the mapping file itself, or the reference copy here: https://github.com/MinecraftForge/MCPConfig/blob/master/Mojang.md, You can hide this warning by running the `hideOfficialWarningUntilChanged` task FAILURE: Build failed with an exception. * What went wrong: A problem occurred configuring root project 'oresCollections'. > Invalid patcher dependency: net.minecraftforge:forge:1.18.1-39.0.55:userdev * Try: > Run with --stacktrace option to get the stack trace. > Run with --info or --debug option to get more log output. > Run with --scan to get full insights. * Get more help at https://help.gradle.org BUILD FAILED in 13s C:\Users\Admn\Desktop\OresCollection\oresCollections>--info '--info' is not recognized as an internal or external command, operable program or batch file. C:\Users\Admn\Desktop\OresCollection\oresCollections>gradlew --info Initialized native services in: C:\Users\Admn\.gradle\native Initialized jansi services in: C:\Users\Admn\.gradle\native To honour the JVM settings for this build a single-use Daemon process will be forked. See https://docs.gradle.org/7.3/userguide/gradle_daemon.html#sec:disabling_the_daemon. Starting process 'Gradle build daemon'. Working directory: C:\Users\Admn\.gradle\daemon\7.3 Command: C:\Program Files\Eclipse Adoptium\jdk-17.0.1.12-hotspot\bin\java.exe --add-opens java.base/java.util=ALL-UNNAMED --add-opens java.base/java.lang=ALL-UNNAMED --add-opens java.base/java.lang.invoke=ALL-UNNAMED --add-opens java.base/java.util=ALL-UNNAMED --add-opens java.prefs/java.util.prefs=ALL-UNNAMED --add-opens java.prefs/java.util.prefs=ALL-UNNAMED --add-opens java.base/java.nio.charset=ALL-UNNAMED --add-opens java.base/java.net=ALL-UNNAMED --add-opens java.base/java.util.concurrent.atomic=ALL-UNNAMED -Xmx3G -Dfile.encoding=windows-1252 -Duser.country=PH -Duser.language=en -Duser.variant -cp C:\Users\Admn\.gradle\wrapper\dists\gradle-7.3-bin\ddwl0k7mt9g6ak16i1m905vyv\gradle-7.3\lib\gradle-launcher-7.3.jar org.gradle.launcher.daemon.bootstrap.GradleDaemon 7.3 Successfully started process 'Gradle build daemon' An attempt to start the daemon took 1.961 secs. The client will now receive all logging from the daemon (pid: 3564). The daemon log file: C:\Users\Admn\.gradle\daemon\7.3\daemon-3564.out.log Daemon will be stopped at the end of the build Using 4 worker leases. Watching the file system is configured to be enabled if available Now considering [C:\Users\Admn\Desktop\OresCollection\oresCollections] as hierarchies to watch File system watching is active Starting Build Settings evaluated using settings file 'C:\Users\Admn\Desktop\OresCollection\oresCollections\settings.gradle'. Projects loaded. Root project using build file 'C:\Users\Admn\Desktop\OresCollection\oresCollections\build.gradle'. Included projects: [root project 'oresCollections'] > Configure project : Evaluating root project 'oresCollections' using build file 'C:\Users\Admn\Desktop\OresCollection\oresCollections\build.gradle'. Java: 17.0.1 JVM: 17.0.1+12(Eclipse Adoptium) Arch: amd64 Downloading net.minecraft:client:1.18.1:mappings@txt Error getting artifact: net.minecraft:client:1.18.1:mappings@txt from MinecraftRepo javax.net.ssl.SSLHandshakeException: PKIX path building failed: sun.security.provider.certpath.SunCertPathBuilderException: unable to find valid certification path to requested target at java.base/sun.security.ssl.Alert.createSSLException(Alert.java:131) at java.base/sun.security.ssl.TransportContext.fatal(TransportContext.java:370) at java.base/sun.security.ssl.TransportContext.fatal(TransportContext.java:313) at java.base/sun.security.ssl.TransportContext.fatal(TransportContext.java:308) at java.base/sun.security.ssl.CertificateMessage$T12CertificateConsumer.checkServerCerts(CertificateMessage.java:654) at java.base/sun.security.ssl.CertificateMessage$T12CertificateConsumer.onCertificate(CertificateMessage.java:473) at java.base/sun.security.ssl.CertificateMessage$T12CertificateConsumer.consume(CertificateMessage.java:369) at java.base/sun.security.ssl.SSLHandshake.consume(SSLHandshake.java:396) at java.base/sun.security.ssl.HandshakeContext.dispatch(HandshakeContext.java:480) at java.base/sun.security.ssl.HandshakeContext.dispatch(HandshakeContext.java:458) at java.base/sun.security.ssl.TransportContext.dispatch(TransportContext.java:200) at java.base/sun.security.ssl.SSLTransport.decode(SSLTransport.java:172) at java.base/sun.security.ssl.SSLSocketImpl.decode(SSLSocketImpl.java:1500) at java.base/sun.security.ssl.SSLSocketImpl.readHandshakeRecord(SSLSocketImpl.java:1415) at java.base/sun.security.ssl.SSLSocketImpl.startHandshake(SSLSocketImpl.java:450) at java.base/sun.security.ssl.SSLSocketImpl.startHandshake(SSLSocketImpl.java:421) at java.base/sun.net.www.protocol.https.HttpsClient.afterConnect(HttpsClient.java:580) at java.base/sun.net.www.protocol.https.AbstractDelegateHttpsURLConnection.connect(AbstractDelegateHttpsURLConnection.java:183) at java.base/sun.net.www.protocol.https.HttpsURLConnectionImpl.connect(HttpsURLConnectionImpl.java:142) at net.minecraftforge.gradle.common.util.DownloadUtils.connectHttpWithRedirects(DownloadUtils.java:220) at net.minecraftforge.gradle.common.util.DownloadUtils.downloadEtag(DownloadUtils.java:57) at net.minecraftforge.gradle.common.util.MinecraftRepo.findVersion(MinecraftRepo.java:199) at net.minecraftforge.gradle.common.util.MinecraftRepo.findFile(MinecraftRepo.java:129) at net.minecraftforge.gradle.common.util.BaseRepo.getArtifact(BaseRepo.java:86) at net.minecraftforge.gradle.common.util.BaseRepo.getArtifact(BaseRepo.java:43) at net.minecraftforge.gradle.common.util.BaseRepo$Builder.lambda$null$0(BaseRepo.java:133) at java.base/java.util.stream.ReferencePipeline$3$1.accept(ReferencePipeline.java:197) at java.base/java.util.ArrayList$ArrayListSpliterator.tryAdvance(ArrayList.java:1602) at java.base/java.util.stream.ReferencePipeline.forEachWithCancel(ReferencePipeline.java:129) at java.base/java.util.stream.AbstractPipeline.copyIntoWithCancel(AbstractPipeline.java:527) at java.base/java.util.stream.AbstractPipeline.copyInto(AbstractPipeline.java:513) at java.base/java.util.stream.AbstractPipeline.wrapAndCopyInto(AbstractPipeline.java:499) at java.base/java.util.stream.FindOps$FindOp.evaluateSequential(FindOps.java:150) at java.base/java.util.stream.AbstractPipeline.evaluate(AbstractPipeline.java:234) at java.base/java.util.stream.ReferencePipeline.findFirst(ReferencePipeline.java:647) at net.minecraftforge.gradle.common.util.BaseRepo$Builder.lambda$attach$2(BaseRepo.java:135) at net.minecraftforge.artifactural.base.repository.ArtifactProviderBuilder$Complete.getArtifact(ArtifactProviderBuilder.java:92) at net.minecraftforge.artifactural.base.repository.SimpleRepository.getArtifact(SimpleRepository.java:41) at net.minecraftforge.artifactural.gradle.GradleRepositoryAdapter.getArtifact(GradleRepositoryAdapter.java:326) at net.minecraftforge.gradle.common.util.MavenArtifactDownloader._generate(MavenArtifactDownloader.java:192) at net.minecraftforge.gradle.common.util.MavenArtifactDownloader._download(MavenArtifactDownloader.java:163) at net.minecraftforge.gradle.common.util.MavenArtifactDownloader.generate(MavenArtifactDownloader.java:95) at net.minecraftforge.gradle.common.util.MojangLicenseHelper.getOfficialLicense(MojangLicenseHelper.java:118) at net.minecraftforge.gradle.common.util.MojangLicenseHelper.displayWarning(MojangLicenseHelper.java:50) at net.minecraftforge.gradle.common.util.MojangLicenseHelper.displayWarning(MojangLicenseHelper.java:41) at net.minecraftforge.gradle.userdev.UserDevPlugin.lambda$apply$26(UserDevPlugin.java:255) at org.gradle.configuration.internal.DefaultUserCodeApplicationContext$CurrentApplication$1.execute(DefaultUserCodeApplicationContext.java:123) at org.gradle.configuration.internal.DefaultListenerBuildOperationDecorator$BuildOperationEmittingAction$1.run(DefaultListenerBuildOperationDecorator.java:152) at org.gradle.internal.operations.DefaultBuildOperationRunner$1.execute(DefaultBuildOperationRunner.java:29) at org.gradle.internal.operations.DefaultBuildOperationRunner$1.execute(DefaultBuildOperationRunner.java:26) at org.gradle.internal.operations.DefaultBuildOperationRunner$2.execute(DefaultBuildOperationRunner.java:66) at org.gradle.internal.operations.DefaultBuildOperationRunner$2.execute(DefaultBuildOperationRunner.java:59) at org.gradle.internal.operations.DefaultBuildOperationRunner.execute(DefaultBuildOperationRunner.java:157) at org.gradle.internal.operations.DefaultBuildOperationRunner.execute(DefaultBuildOperationRunner.java:59) at org.gradle.internal.operations.DefaultBuildOperationRunner.run(DefaultBuildOperationRunner.java:47) at org.gradle.internal.operations.DefaultBuildOperationExecutor.run(DefaultBuildOperationExecutor.java:68) at org.gradle.configuration.internal.DefaultListenerBuildOperationDecorator$BuildOperationEmittingAction.execute(DefaultListenerBuildOperationDecorator.java:149) at org.gradle.internal.event.BroadcastDispatch$ActionInvocationHandler.dispatch(BroadcastDispatch.java:95) at org.gradle.internal.event.BroadcastDispatch$ActionInvocationHandler.dispatch(BroadcastDispatch.java:83) at org.gradle.internal.event.AbstractBroadcastDispatch.dispatch(AbstractBroadcastDispatch.java:43) at org.gradle.internal.event.BroadcastDispatch$SingletonDispatch.dispatch(BroadcastDispatch.java:245) at org.gradle.internal.event.BroadcastDispatch$SingletonDispatch.dispatch(BroadcastDispatch.java:157) at org.gradle.internal.event.AbstractBroadcastDispatch.dispatch(AbstractBroadcastDispatch.java:61) at org.gradle.internal.event.BroadcastDispatch$CompositeDispatch.dispatch(BroadcastDispatch.java:346) at org.gradle.internal.event.BroadcastDispatch$CompositeDispatch.dispatch(BroadcastDispatch.java:249) at org.gradle.internal.event.ListenerBroadcast.dispatch(ListenerBroadcast.java:141) at org.gradle.internal.event.ListenerBroadcast.dispatch(ListenerBroadcast.java:37) at org.gradle.internal.dispatch.ProxyDispatchAdapter$DispatchingInvocationHandler.invoke(ProxyDispatchAdapter.java:94) at jdk.proxy1/jdk.proxy1.$Proxy42.afterEvaluate(Unknown Source) at org.gradle.configuration.project.LifecycleProjectEvaluator$NotifyAfterEvaluate$1.execute(LifecycleProjectEvaluator.java:187) at org.gradle.configuration.project.LifecycleProjectEvaluator$NotifyAfterEvaluate$1.execute(LifecycleProjectEvaluator.java:184) at org.gradle.api.internal.project.DefaultProject.stepEvaluationListener(DefaultProject.java:1429) at org.gradle.configuration.project.LifecycleProjectEvaluator$NotifyAfterEvaluate.run(LifecycleProjectEvaluator.java:193) at org.gradle.internal.operations.DefaultBuildOperationRunner$1.execute(DefaultBuildOperationRunner.java:29) at org.gradle.internal.operations.DefaultBuildOperationRunner$1.execute(DefaultBuildOperationRunner.java:26) at org.gradle.internal.operations.DefaultBuildOperationRunner$2.execute(DefaultBuildOperationRunner.java:66) at org.gradle.internal.operations.DefaultBuildOperationRunner$2.execute(DefaultBuildOperationRunner.java:59) at org.gradle.internal.operations.DefaultBuildOperationRunner.execute(DefaultBuildOperationRunner.java:157) at org.gradle.internal.operations.DefaultBuildOperationRunner.execute(DefaultBuildOperationRunner.java:59) at org.gradle.internal.operations.DefaultBuildOperationRunner.run(DefaultBuildOperationRunner.java:47) at org.gradle.internal.operations.DefaultBuildOperationExecutor.run(DefaultBuildOperationExecutor.java:68) at org.gradle.configuration.project.LifecycleProjectEvaluator$EvaluateProject.lambda$run$0(LifecycleProjectEvaluator.java:105) at org.gradle.api.internal.project.DefaultProjectStateRegistry$ProjectStateImpl.lambda$applyToMutableState$0(DefaultProjectStateRegistry.java:366) at org.gradle.api.internal.project.DefaultProjectStateRegistry$ProjectStateImpl.lambda$withProjectLock$3(DefaultProjectStateRegistry.java:426) at org.gradle.internal.work.DefaultWorkerLeaseService.withLocks(DefaultWorkerLeaseService.java:211) at org.gradle.api.internal.project.DefaultProjectStateRegistry$ProjectStateImpl.withProjectLock(DefaultProjectStateRegistry.java:426) at org.gradle.api.internal.project.DefaultProjectStateRegistry$ProjectStateImpl.fromMutableState(DefaultProjectStateRegistry.java:407) at org.gradle.api.internal.project.DefaultProjectStateRegistry$ProjectStateImpl.applyToMutableState(DefaultProjectStateRegistry.java:365) at org.gradle.configuration.project.LifecycleProjectEvaluator$EvaluateProject.run(LifecycleProjectEvaluator.java:91) at org.gradle.internal.operations.DefaultBuildOperationRunner$1.execute(DefaultBuildOperationRunner.java:29) at org.gradle.internal.operations.DefaultBuildOperationRunner$1.execute(DefaultBuildOperationRunner.java:26) at org.gradle.internal.operations.DefaultBuildOperationRunner$2.execute(DefaultBuildOperationRunner.java:66) at org.gradle.internal.operations.DefaultBuildOperationRunner$2.execute(DefaultBuildOperationRunner.java:59) at org.gradle.internal.operations.DefaultBuildOperationRunner.execute(DefaultBuildOperationRunner.java:157) at org.gradle.internal.operations.DefaultBuildOperationRunner.execute(DefaultBuildOperationRunner.java:59) at org.gradle.internal.operations.DefaultBuildOperationRunner.run(DefaultBuildOperationRunner.java:47) at org.gradle.internal.operations.DefaultBuildOperationExecutor.run(DefaultBuildOperationExecutor.java:68) at org.gradle.configuration.project.LifecycleProjectEvaluator.evaluate(LifecycleProjectEvaluator.java:63) at org.gradle.api.internal.project.DefaultProject.evaluate(DefaultProject.java:751) at org.gradle.api.internal.project.DefaultProject.evaluate(DefaultProject.java:151) at org.gradle.api.internal.project.DefaultProjectStateRegistry$ProjectStateImpl.ensureConfigured(DefaultProjectStateRegistry.java:339) at org.gradle.execution.TaskPathProjectEvaluator.configure(TaskPathProjectEvaluator.java:41) at org.gradle.execution.TaskPathProjectEvaluator.configureHierarchy(TaskPathProjectEvaluator.java:55) at org.gradle.configuration.DefaultProjectsPreparer.prepareProjects(DefaultProjectsPreparer.java:48) at org.gradle.configuration.BuildTreePreparingProjectsPreparer.prepareProjects(BuildTreePreparingProjectsPreparer.java:64) at org.gradle.configuration.BuildOperationFiringProjectsPreparer$ConfigureBuild.run(BuildOperationFiringProjectsPreparer.java:52) at org.gradle.internal.operations.DefaultBuildOperationRunner$1.execute(DefaultBuildOperationRunner.java:29) at org.gradle.internal.operations.DefaultBuildOperationRunner$1.execute(DefaultBuildOperationRunner.java:26) at org.gradle.internal.operations.DefaultBuildOperationRunner$2.execute(DefaultBuildOperationRunner.java:66) at org.gradle.internal.operations.DefaultBuildOperationRunner$2.execute(DefaultBuildOperationRunner.java:59) at org.gradle.internal.operations.DefaultBuildOperationRunner.execute(DefaultBuildOperationRunner.java:157) at org.gradle.internal.operations.DefaultBuildOperationRunner.execute(DefaultBuildOperationRunner.java:59) at org.gradle.internal.operations.DefaultBuildOperationRunner.run(DefaultBuildOperationRunner.java:47) at org.gradle.internal.operations.DefaultBuildOperationExecutor.run(DefaultBuildOperationExecutor.java:68) at org.gradle.configuration.BuildOperationFiringProjectsPreparer.prepareProjects(BuildOperationFiringProjectsPreparer.java:40) at org.gradle.initialization.VintageBuildModelController.lambda$prepareProjects$1(VintageBuildModelController.java:93) at org.gradle.internal.build.StateTransitionController.lambda$doTransition$1(StateTransitionController.java:222) at org.gradle.internal.build.StateTransitionController.doTransition(StateTransitionController.java:243) at org.gradle.internal.build.StateTransitionController.doTransition(StateTransitionController.java:221) at org.gradle.internal.build.StateTransitionController.transitionIfNotPreviously(StateTransitionController.java:190) at org.gradle.initialization.VintageBuildModelController.prepareProjects(VintageBuildModelController.java:93) at org.gradle.initialization.VintageBuildModelController.doBuildStages(VintageBuildModelController.java:77) at org.gradle.initialization.VintageBuildModelController.prepareToScheduleTasks(VintageBuildModelController.java:64) at org.gradle.internal.build.DefaultBuildLifecycleController.lambda$prepareToScheduleTasks$0(DefaultBuildLifecycleController.java:105) at org.gradle.internal.build.StateTransitionController.lambda$doTransition$1(StateTransitionController.java:222) at org.gradle.internal.build.StateTransitionController.doTransition(StateTransitionController.java:243) at org.gradle.internal.build.StateTransitionController.doTransition(StateTransitionController.java:221) at org.gradle.internal.build.StateTransitionController.maybeTransition(StateTransitionController.java:174) at org.gradle.internal.build.DefaultBuildLifecycleController.prepareToScheduleTasks(DefaultBuildLifecycleController.java:103) at org.gradle.internal.buildtree.DefaultBuildTreeWorkPreparer.scheduleRequestedTasks(DefaultBuildTreeWorkPreparer.java:33) at org.gradle.internal.buildtree.DefaultBuildTreeLifecycleController.lambda$doScheduleAndRunTasks$2(DefaultBuildTreeLifecycleController.java:86) at org.gradle.composite.internal.DefaultIncludedBuildTaskGraph.withNewTaskGraph(DefaultIncludedBuildTaskGraph.java:94) at org.gradle.internal.buildtree.DefaultBuildTreeLifecycleController.doScheduleAndRunTasks(DefaultBuildTreeLifecycleController.java:85) at org.gradle.internal.buildtree.DefaultBuildTreeLifecycleController.lambda$runBuild$4(DefaultBuildTreeLifecycleController.java:103) at org.gradle.internal.build.StateTransitionController.lambda$transition$0(StateTransitionController.java:145) at org.gradle.internal.build.StateTransitionController.doTransition(StateTransitionController.java:243) at org.gradle.internal.build.StateTransitionController.transition(StateTransitionController.java:145) at org.gradle.internal.buildtree.DefaultBuildTreeLifecycleController.runBuild(DefaultBuildTreeLifecycleController.java:100) at org.gradle.internal.buildtree.DefaultBuildTreeLifecycleController.scheduleAndRunTasks(DefaultBuildTreeLifecycleController.java:66) at org.gradle.tooling.internal.provider.ExecuteBuildActionRunner.run(ExecuteBuildActionRunner.java:31) at org.gradle.launcher.exec.ChainingBuildActionRunner.run(ChainingBuildActionRunner.java:35) at org.gradle.internal.buildtree.ProblemReportingBuildActionRunner.run(ProblemReportingBuildActionRunner.java:49) at org.gradle.launcher.exec.BuildOutcomeReportingBuildActionRunner.run(BuildOutcomeReportingBuildActionRunner.java:69) at org.gradle.tooling.internal.provider.FileSystemWatchingBuildActionRunner.run(FileSystemWatchingBuildActionRunner.java:114) at org.gradle.launcher.exec.BuildCompletionNotifyingBuildActionRunner.run(BuildCompletionNotifyingBuildActionRunner.java:41) at org.gradle.launcher.exec.RootBuildLifecycleBuildActionExecutor.lambda$execute$0(RootBuildLifecycleBuildActionExecutor.java:40) at org.gradle.composite.internal.DefaultRootBuildState.run(DefaultRootBuildState.java:155) at org.gradle.launcher.exec.RootBuildLifecycleBuildActionExecutor.execute(RootBuildLifecycleBuildActionExecutor.java:40) at org.gradle.internal.buildtree.DefaultBuildTreeContext.execute(DefaultBuildTreeContext.java:40) at org.gradle.launcher.exec.BuildTreeLifecycleBuildActionExecutor.lambda$execute$0(BuildTreeLifecycleBuildActionExecutor.java:65) at org.gradle.internal.buildtree.BuildTreeState.run(BuildTreeState.java:53) at org.gradle.launcher.exec.BuildTreeLifecycleBuildActionExecutor.execute(BuildTreeLifecycleBuildActionExecutor.java:65) at org.gradle.launcher.exec.RunAsBuildOperationBuildActionExecutor$3.call(RunAsBuildOperationBuildActionExecutor.java:61) at org.gradle.launcher.exec.RunAsBuildOperationBuildActionExecutor$3.call(RunAsBuildOperationBuildActionExecutor.java:57) at org.gradle.internal.operations.DefaultBuildOperationRunner$CallableBuildOperationWorker.execute(DefaultBuildOperationRunner.java:204) at org.gradle.internal.operations.DefaultBuildOperationRunner$CallableBuildOperationWorker.execute(DefaultBuildOperationRunner.java:199) at org.gradle.internal.operations.DefaultBuildOperationRunner$2.execute(DefaultBuildOperationRunner.java:66) at org.gradle.internal.operations.DefaultBuildOperationRunner$2.execute(DefaultBuildOperationRunner.java:59) at org.gradle.internal.operations.DefaultBuildOperationRunner.execute(DefaultBuildOperationRunner.java:157) at org.gradle.internal.operations.DefaultBuildOperationRunner.execute(DefaultBuildOperationRunner.java:59) at org.gradle.internal.operations.DefaultBuildOperationRunner.call(DefaultBuildOperationRunner.java:53) at org.gradle.internal.operations.DefaultBuildOperationExecutor.call(DefaultBuildOperationExecutor.java:73) at org.gradle.launcher.exec.RunAsBuildOperationBuildActionExecutor.execute(RunAsBuildOperationBuildActionExecutor.java:57) at org.gradle.launcher.exec.RunAsWorkerThreadBuildActionExecutor.lambda$execute$0(RunAsWorkerThreadBuildActionExecutor.java:38) at org.gradle.internal.work.DefaultWorkerLeaseService.withLocks(DefaultWorkerLeaseService.java:211) at org.gradle.launcher.exec.RunAsWorkerThreadBuildActionExecutor.execute(RunAsWorkerThreadBuildActionExecutor.java:38) at org.gradle.tooling.internal.provider.ContinuousBuildActionExecutor.execute(ContinuousBuildActionExecutor.java:103) at org.gradle.tooling.internal.provider.SubscribableBuildActionExecutor.execute(SubscribableBuildActionExecutor.java:64) at org.gradle.internal.session.DefaultBuildSessionContext.execute(DefaultBuildSessionContext.java:46) at org.gradle.tooling.internal.provider.BuildSessionLifecycleBuildActionExecuter$ActionImpl.apply(BuildSessionLifecycleBuildActionExecuter.java:100) at org.gradle.tooling.internal.provider.BuildSessionLifecycleBuildActionExecuter$ActionImpl.apply(BuildSessionLifecycleBuildActionExecuter.java:88) at org.gradle.internal.session.BuildSessionState.run(BuildSessionState.java:69) at org.gradle.tooling.internal.provider.BuildSessionLifecycleBuildActionExecuter.execute(BuildSessionLifecycleBuildActionExecuter.java:62) at org.gradle.tooling.internal.provider.BuildSessionLifecycleBuildActionExecuter.execute(BuildSessionLifecycleBuildActionExecuter.java:41) at org.gradle.tooling.internal.provider.GradleThreadBuildActionExecuter.execute(GradleThreadBuildActionExecuter.java:36) at org.gradle.tooling.internal.provider.GradleThreadBuildActionExecuter.execute(GradleThreadBuildActionExecuter.java:25) at org.gradle.tooling.internal.provider.StartParamsValidatingActionExecuter.execute(StartParamsValidatingActionExecuter.java:63) at org.gradle.tooling.internal.provider.StartParamsValidatingActionExecuter.execute(StartParamsValidatingActionExecuter.java:31) at org.gradle.tooling.internal.provider.SessionFailureReportingActionExecuter.execute(SessionFailureReportingActionExecuter.java:58) at org.gradle.tooling.internal.provider.SessionFailureReportingActionExecuter.execute(SessionFailureReportingActionExecuter.java:42) at org.gradle.tooling.internal.provider.SetupLoggingActionExecuter.execute(SetupLoggingActionExecuter.java:47) at org.gradle.tooling.internal.provider.SetupLoggingActionExecuter.execute(SetupLoggingActionExecuter.java:31) at org.gradle.launcher.daemon.server.exec.ExecuteBuild.doBuild(ExecuteBuild.java:65) at org.gradle.launcher.daemon.server.exec.BuildCommandOnly.execute(BuildCommandOnly.java:37) at org.gradle.launcher.daemon.server.api.DaemonCommandExecution.proceed(DaemonCommandExecution.java:104) at org.gradle.launcher.daemon.server.exec.WatchForDisconnection.execute(WatchForDisconnection.java:39) at org.gradle.launcher.daemon.server.api.DaemonCommandExecution.proceed(DaemonCommandExecution.java:104) at org.gradle.launcher.daemon.server.exec.ResetDeprecationLogger.execute(ResetDeprecationLogger.java:29) at org.gradle.launcher.daemon.server.api.DaemonCommandExecution.proceed(DaemonCommandExecution.java:104) at org.gradle.launcher.daemon.server.exec.RequestStopIfSingleUsedDaemon.execute(RequestStopIfSingleUsedDaemon.java:35) at org.gradle.launcher.daemon.server.api.DaemonCommandExecution.proceed(DaemonCommandExecution.java:104) at org.gradle.launcher.daemon.server.exec.ForwardClientInput$2.create(ForwardClientInput.java:78) at org.gradle.launcher.daemon.server.exec.ForwardClientInput$2.create(ForwardClientInput.java:75) at org.gradle.util.internal.Swapper.swap(Swapper.java:38) at org.gradle.launcher.daemon.server.exec.ForwardClientInput.execute(ForwardClientInput.java:75) at org.gradle.launcher.daemon.server.api.DaemonCommandExecution.proceed(DaemonCommandExecution.java:104) at org.gradle.launcher.daemon.server.exec.LogAndCheckHealth.execute(LogAndCheckHealth.java:50) at org.gradle.launcher.daemon.server.api.DaemonCommandExecution.proceed(DaemonCommandExecution.java:104) at org.gradle.launcher.daemon.server.exec.LogToClient.doBuild(LogToClient.java:63) at org.gradle.launcher.daemon.server.exec.BuildCommandOnly.execute(BuildCommandOnly.java:37) at org.gradle.launcher.daemon.server.api.DaemonCommandExecution.proceed(DaemonCommandExecution.java:104) at org.gradle.launcher.daemon.server.exec.EstablishBuildEnvironment.doBuild(EstablishBuildEnvironment.java:84) at org.gradle.launcher.daemon.server.exec.BuildCommandOnly.execute(BuildCommandOnly.java:37) at org.gradle.launcher.daemon.server.api.DaemonCommandExecution.proceed(DaemonCommandExecution.java:104) at org.gradle.launcher.daemon.server.exec.StartBuildOrRespondWithBusy$1.run(StartBuildOrRespondWithBusy.java:52) at org.gradle.launcher.daemon.server.DaemonStateCoordinator$1.run(DaemonStateCoordinator.java:297) at org.gradle.internal.concurrent.ExecutorPolicy$CatchAndRecordFailures.onExecute(ExecutorPolicy.java:64) at org.gradle.internal.concurrent.ManagedExecutorImpl$1.run(ManagedExecutorImpl.java:48) at java.base/java.util.concurrent.ThreadPoolExecutor.runWorker(ThreadPoolExecutor.java:1136) at java.base/java.util.concurrent.ThreadPoolExecutor$Worker.run(ThreadPoolExecutor.java:635) at org.gradle.internal.concurrent.ThreadFactoryImpl$ManagedThreadRunnable.run(ThreadFactoryImpl.java:61) at java.base/java.lang.Thread.run(Thread.java:833) Caused by: sun.security.validator.ValidatorException: PKIX path building failed: sun.security.provider.certpath.SunCertPathBuilderException: unable to find valid certification path to requested target at java.base/sun.security.validator.PKIXValidator.doBuild(PKIXValidator.java:439) at java.base/sun.security.validator.PKIXValidator.engineValidate(PKIXValidator.java:306) at java.base/sun.security.validator.Validator.validate(Validator.java:264) at java.base/sun.security.ssl.X509TrustManagerImpl.checkTrusted(X509TrustManagerImpl.java:231) at java.base/sun.security.ssl.X509TrustManagerImpl.checkServerTrusted(X509TrustManagerImpl.java:132) at java.base/sun.security.ssl.CertificateMessage$T12CertificateConsumer.checkServerCerts(CertificateMessage.java:638) ... 207 more Caused by: sun.security.provider.certpath.SunCertPathBuilderException: unable to find valid certification path to requested target at java.base/sun.security.provider.certpath.SunCertPathBuilder.build(SunCertPathBuilder.java:141) at java.base/sun.security.provider.certpath.SunCertPathBuilder.engineBuild(SunCertPathBuilder.java:126) at java.base/java.security.cert.CertPathBuilder.build(CertPathBuilder.java:297) at java.base/sun.security.validator.PKIXValidator.doBuild(PKIXValidator.java:434) ... 212 more WARNING: This project is configured to use the official obfuscation mappings provided by Mojang. These mapping fall under their associated license, you should be fully aware of this license. For the latest license text, refer to the mapping file itself, or the reference copy here: https://github.com/MinecraftForge/MCPConfig/blob/master/Mojang.md, You can hide this warning by running the `hideOfficialWarningUntilChanged` task Downloading net.minecraftforge:forge:1.18.1-39.0.55:userdev FAILURE: Build failed with an exception. * What went wrong: A problem occurred configuring root project 'oresCollections'. > Invalid patcher dependency: net.minecraftforge:forge:1.18.1-39.0.55:userdev * Try: > Run with --stacktrace option to get the stack trace. > Run with --debug option to get more log output. > Run with --scan to get full insights. * Get more help at https://help.gradle.org BUILD FAILED in 12s Watched directory hierarchies: [] C:\Users\Admn\Desktop\OresCollection\oresCollections>  
  • Topics

  • Who's Online (See full list)

×
×
  • Create New...

Important Information

By using this site, you agree to our Privacy Policy.