Jump to content
Search In
  • More options...
Find results that contain...
Find results in...

gradlew (...) doesn't work


TheKillTnT
 Share

Recommended Posts

hello, i have a big problem, because all of the gradlew commands are down and return the same exception.

If you can help me thanks !


 

Quote

FAILURE: Build failed with an exception.

* Where:
Build file 'C:\Users\Aurelien\Desktop\alesiummod\build.gradle' line: 18

* What went wrong:
A problem occurred evaluating root project 'alesiummod'.
> com.google.gson.stream.MalformedJsonException: Unterminated string at line 88780 column 12

* Try:
Run with --info or --debug option to get more log output.

* Exception is:
org.gradle.api.GradleScriptException: A problem occurred evaluating root project 'alesiummod'.
    at org.gradle.groovy.scripts.internal.DefaultScriptRunnerFactory$ScriptRunnerImpl.run(DefaultScriptRunnerFactory.java:54)
    at org.gradle.configuration.DefaultScriptPluginFactory$ScriptPluginImpl.apply(DefaultScriptPluginFactory.java:187)
    at org.gradle.configuration.project.BuildScriptProcessor.execute(BuildScriptProcessor.java:39)
    at org.gradle.configuration.project.BuildScriptProcessor.execute(BuildScriptProcessor.java:26)
    at org.gradle.configuration.project.ConfigureActionsProjectEvaluator.evaluate(ConfigureActionsProjectEvaluator.java:34)
    at org.gradle.configuration.project.LifecycleProjectEvaluator.evaluate(LifecycleProjectEvaluator.java:55)
    at org.gradle.api.internal.project.AbstractProject.evaluate(AbstractProject.java:470)
    at org.gradle.api.internal.project.AbstractProject.evaluate(AbstractProject.java:79)
    at org.gradle.configuration.DefaultBuildConfigurer.configure(DefaultBuildConfigurer.java:31)
    at org.gradle.initialization.DefaultGradleLauncher.doBuildStages(DefaultGradleLauncher.java:128)
    at org.gradle.initialization.DefaultGradleLauncher.doBuild(DefaultGradleLauncher.java:105)
    at org.gradle.initialization.DefaultGradleLauncher.run(DefaultGradleLauncher.java:85)
    at org.gradle.launcher.exec.InProcessBuildActionExecuter$DefaultBuildController.run(InProcessBuildActionExecuter.java:81)
    at org.gradle.launcher.cli.ExecuteBuildAction.run(ExecuteBuildAction.java:33)
    at org.gradle.launcher.cli.ExecuteBuildAction.run(ExecuteBuildAction.java:24)
    at org.gradle.launcher.exec.InProcessBuildActionExecuter.execute(InProcessBuildActionExecuter.java:39)
    at org.gradle.launcher.exec.InProcessBuildActionExecuter.execute(InProcessBuildActionExecuter.java:29)
    at org.gradle.launcher.cli.RunBuildAction.run(RunBuildAction.java:50)
    at org.gradle.internal.Actions$RunnableActionAdapter.execute(Actions.java:171)
    at org.gradle.launcher.cli.CommandLineActionFactory$ParseAndBuildAction.execute(CommandLineActionFactory.java:237)
    at org.gradle.launcher.cli.CommandLineActionFactory$ParseAndBuildAction.execute(CommandLineActionFactory.java:210)
    at org.gradle.launcher.cli.JavaRuntimeValidationAction.execute(JavaRuntimeValidationAction.java:35)
    at org.gradle.launcher.cli.JavaRuntimeValidationAction.execute(JavaRuntimeValidationAction.java:24)
    at org.gradle.launcher.cli.CommandLineActionFactory$WithLogging.execute(CommandLineActionFactory.java:206)
    at org.gradle.launcher.cli.CommandLineActionFactory$WithLogging.execute(CommandLineActionFactory.java:169)
    at org.gradle.launcher.cli.ExceptionReportingAction.execute(ExceptionReportingAction.java:33)
    at org.gradle.launcher.cli.ExceptionReportingAction.execute(ExceptionReportingAction.java:22)
    at org.gradle.launcher.Main.doAction(Main.java:33)
    at org.gradle.launcher.bootstrap.EntryPoint.run(EntryPoint.java:45)
    at org.gradle.launcher.bootstrap.ProcessBootstrap.runNoExit(ProcessBootstrap.java:54)
    at org.gradle.launcher.bootstrap.ProcessBootstrap.run(ProcessBootstrap.java:35)
    at org.gradle.launcher.GradleMain.main(GradleMain.java:23)
    at org.gradle.wrapper.BootstrapMainStarter.start(BootstrapMainStarter.java:30)
    at org.gradle.wrapper.WrapperExecutor.execute(WrapperExecutor.java:127)
    at org.gradle.wrapper.GradleWrapperMain.main(GradleWrapperMain.java:56)
Caused by: com.google.gson.JsonSyntaxException: com.google.gson.stream.MalformedJsonException: Unterminated string at line 88780 column 12
    at com.google.gson.Gson.fromJson(Gson.java:818)
    at com.google.gson.Gson.fromJson(Gson.java:768)
    at com.google.gson.Gson.fromJson(Gson.java:717)
    at com.google.gson.Gson.fromJson(Gson.java:689)
    at net.minecraftforge.gradle.user.patch.UserPatchBasePlugin.setVersionInfoJson(UserPatchBasePlugin.java:145)
    at net.minecraftforge.gradle.user.patch.UserPatchBasePlugin.applyPlugin(UserPatchBasePlugin.java:46)
    at net.minecraftforge.gradle.common.BasePlugin.apply(BasePlugin.java:154)
    at net.minecraftforge.gradle.common.BasePlugin.apply(BasePlugin.java:49)
    at org.gradle.api.internal.plugins.DefaultPluginContainer.providePlugin(DefaultPluginContainer.java:110)
    at org.gradle.api.internal.plugins.DefaultPluginContainer.addPluginInternal(DefaultPluginContainer.java:69)
    at org.gradle.api.internal.plugins.DefaultPluginContainer.apply(DefaultPluginContainer.java:35)
    at org.gradle.api.internal.plugins.DefaultObjectConfigurationAction.applyPlugin(DefaultObjectConfigurationAction.java:117)
    at org.gradle.api.internal.plugins.DefaultObjectConfigurationAction.access$200(DefaultObjectConfigurationAction.java:36)
    at org.gradle.api.internal.plugins.DefaultObjectConfigurationAction$3.run(DefaultObjectConfigurationAction.java:85)
    at org.gradle.api.internal.plugins.DefaultObjectConfigurationAction.execute(DefaultObjectConfigurationAction.java:130)
    at org.gradle.api.internal.project.AbstractPluginAware.apply(AbstractPluginAware.java:41)
    at org.gradle.api.Project$apply$0.call(Unknown Source)
    at org.gradle.api.internal.project.ProjectScript.apply(ProjectScript.groovy:34)
    at org.gradle.api.Script$apply$0.callCurrent(Unknown Source)
    at build_1ethdvnn5ct4i4sgk0iauqd0cd.run(C:\Users\Aurelien\Desktop\alesiummod\build.gradle:18)
    at org.gradle.groovy.scripts.internal.DefaultScriptRunnerFactory$ScriptRunnerImpl.run(DefaultScriptRunnerFactory.java:52)
    ... 34 more
Caused by: com.google.gson.stream.MalformedJsonException: Unterminated string at line 88780 column 12
    at com.google.gson.stream.JsonReader.syntaxError(JsonReader.java:1505)
    at com.google.gson.stream.JsonReader.skipQuotedValue(JsonReader.java:1100)
    at com.google.gson.stream.JsonReader.skipValue(JsonReader.java:1229)
    at com.google.gson.internal.bind.ReflectiveTypeAdapterFactory$Adapter.read(ReflectiveTypeAdapterFactory.java:170)
    at com.google.gson.internal.bind.TypeAdapterRuntimeTypeWrapper.read(TypeAdapterRuntimeTypeWrapper.java:40)
    at com.google.gson.internal.bind.MapTypeAdapterFactory$Adapter.read(MapTypeAdapterFactory.java:187)
    at com.google.gson.internal.bind.MapTypeAdapterFactory$Adapter.read(MapTypeAdapterFactory.java:145)
    at com.google.gson.internal.bind.ReflectiveTypeAdapterFactory$1.read(ReflectiveTypeAdapterFactory.java:93)
    at com.google.gson.internal.bind.ReflectiveTypeAdapterFactory$Adapter.read(ReflectiveTypeAdapterFactory.java:172)
    at com.google.gson.Gson.fromJson(Gson.java:803)
    ... 54 more


BUILD FAILED

Total time: 19.086 secs


 

 

Link to comment
Share on other sites

2 hours ago, TheKillTnT said:

Caused by: com.google.gson.stream.MalformedJsonException: Unterminated string at line 88780 column 12

Uhmmm... How does your build.gradle look like?

Don't PM me with questions. They will be ignored! Make a thread on the appropriate board for support.

 

1.12 -> 1.13 primer by williewillus.

 

1.7.10 and older versions of Minecraft are no longer supported due to it's age! Update to the latest version for support.

 

http://www.howoldisminecraft1710.today/

Link to comment
Share on other sites

Why did you comment out the "apply plugin: 'forge'"? It needs to be there.

 

Also, stop modding for 1.7.10. It's not supported anymore because of its age.

Don't PM me with questions. They will be ignored! Make a thread on the appropriate board for support.

 

1.12 -> 1.13 primer by williewillus.

 

1.7.10 and older versions of Minecraft are no longer supported due to it's age! Update to the latest version for support.

 

http://www.howoldisminecraft1710.today/

Link to comment
Share on other sites

Guest
This topic is now closed to further replies.
 Share



  • Recently Browsing

    No registered users viewing this page.

  • Posts

    • I am trying to let friends play on my server but all of the server ip's that i try don't work. I need to know what my servers address is.
    • Oh, Now that I see it better the error is different.  This is the error now i dont saw much of it: 2022-01-19 21:36:34,998 main WARN Advanced terminal features are not available in this environment [21:36:36] [main/INFO] [cp.mo.mo.Launcher/MODLAUNCHER]: ModLauncher running: args [--gameDir, ., --launchTarget, fmlserver, --fml.forgeVersion, 36.2.22, --fml.mcpVersion, 20210115.111550, --fml.mcVersion, 1.16.5, --fml.forgeGroup, net.minecraftforge] [21:36:36] [main/INFO] [cp.mo.mo.Launcher/MODLAUNCHER]: ModLauncher 8.0.9+86+master.3cf110c starting: java version 1.8.0_25 by Oracle Corporation [21:36:36] [main/WARN] [cp.mo.mo.SecureJarHandler/]: LEGACY JDK DETECTED, SECURED JAR HANDLING DISABLED [21:36:38] [main/INFO] [ne.mi.fm.lo.FixSSL/CORE]: Added Lets Encrypt root certificates as additional trust [21:36:38] [main/INFO] [mixin/]: SpongePowered MIXIN Subsystem Version=0.8.4 Source=file:/C:/Users/Lautaro/Desktop/server1/libraries/org/spongepowered/mixin/0.8.4/mixin-0.8.4.jar Service=ModLauncher Env=SERVER Exception in thread "main" [21:36:39] [main/INFO] [STDERR/]: [java.lang.ThreadGroup:uncaughtException:1052]: java.lang.BootstrapMethodError: java.lang.NoClassDefFoundError: jdk/nashorn/api/scripting/ClassFilter [21:36:39] [main/INFO] [STDERR/]: [java.lang.ThreadGroup:uncaughtException:1052]:       at net.minecraftforge.coremod.NashornFactory.createEngine(NashornFactory.java:13) [21:36:39] [main/INFO] [STDERR/]: [java.lang.ThreadGroup:uncaughtException:1052]:       at net.minecraftforge.coremod.CoreModEngine.loadCoreMod(CoreModEngine.java:52) [21:36:39] [main/INFO] [STDERR/]: [java.lang.ThreadGroup:uncaughtException:1052]:       at net.minecraftforge.coremod.CoreModProvider.addCoreMod(CoreModProvider.java:12) [21:36:39] [main/INFO] [STDERR/]: [java.lang.ThreadGroup:uncaughtException:1052]:       at net.minecraftforge.fml.loading.LoadingModList$$Lambda$347/589987187.accept(Unknown Source) [21:36:39] [main/INFO] [STDERR/]: [java.lang.ThreadGroup:uncaughtException:1052]:       at java.util.stream.ForEachOps$ForEachOp$OfRef.accept(ForEachOps.java:183) [21:36:39] [main/INFO] [STDERR/]: [java.lang.ThreadGroup:uncaughtException:1052]:       at java.util.ArrayList$ArrayListSpliterator.forEachRemaining(ArrayList.java:1374) [21:36:39] [main/INFO] [STDERR/]: [java.lang.ThreadGroup:uncaughtException:1052]:       at java.util.stream.ReferencePipeline$Head.forEach(ReferencePipeline.java:580) [21:36:39] [main/INFO] [STDERR/]: [java.lang.ThreadGroup:uncaughtException:1052]:       at java.util.stream.ReferencePipeline$7$1.accept(ReferencePipeline.java:270) [21:36:39] [main/INFO] [STDERR/]: [java.lang.ThreadGroup:uncaughtException:1052]:       at java.util.stream.ReferencePipeline$3$1.accept(ReferencePipeline.java:193) [21:36:39] [main/INFO] [STDERR/]: [java.lang.ThreadGroup:uncaughtException:1052]:       at java.util.stream.ReferencePipeline$3$1.accept(ReferencePipeline.java:193) [21:36:39] [main/INFO] [STDERR/]: [java.lang.ThreadGroup:uncaughtException:1052]:       at java.util.ArrayList$ArrayListSpliterator.forEachRemaining(ArrayList.java:1374) [21:36:39] [main/INFO] [STDERR/]: [java.lang.ThreadGroup:uncaughtException:1052]:       at java.util.stream.AbstractPipeline.copyInto(AbstractPipeline.java:512) [21:36:39] [main/INFO] [STDERR/]: [java.lang.ThreadGroup:uncaughtException:1052]:       at java.util.stream.AbstractPipeline.wrapAndCopyInto(AbstractPipeline.java:502) [21:36:39] [main/INFO] [STDERR/]: [java.lang.ThreadGroup:uncaughtException:1052]:       at java.util.stream.ForEachOps$ForEachOp.evaluateSequential(ForEachOps.java:150) [21:36:39] [main/INFO] [STDERR/]: [java.lang.ThreadGroup:uncaughtException:1052]:       at java.util.stream.ForEachOps$ForEachOp$OfRef.evaluateSequential(ForEachOps.java:173) [21:36:39] [main/INFO] [STDERR/]: [java.lang.ThreadGroup:uncaughtException:1052]:       at java.util.stream.AbstractPipeline.evaluate(AbstractPipeline.java:234) [21:36:39] [main/INFO] [STDERR/]: [java.lang.ThreadGroup:uncaughtException:1052]:       at java.util.stream.ReferencePipeline.forEach(ReferencePipeline.java:418) [21:36:39] [main/INFO] [STDERR/]: [java.lang.ThreadGroup:uncaughtException:1052]:       at net.minecraftforge.fml.loading.LoadingModList.addCoreMods(LoadingModList.java:85) [21:36:39] [main/INFO] [STDERR/]: [java.lang.ThreadGroup:uncaughtException:1052]:       at net.minecraftforge.fml.loading.moddiscovery.ModDiscoverer.discoverMods(ModDiscoverer.java:130) [21:36:39] [main/INFO] [STDERR/]: [java.lang.ThreadGroup:uncaughtException:1052]:       at net.minecraftforge.fml.loading.FMLLoader.beginModScan(FMLLoader.java:216) [21:36:39] [main/INFO] [STDERR/]: [java.lang.ThreadGroup:uncaughtException:1052]:       at net.minecraftforge.fml.loading.FMLServiceProvider.runScan(FMLServiceProvider.java:107) [21:36:39] [main/INFO] [STDERR/]: [java.lang.ThreadGroup:uncaughtException:1052]:       at cpw.mods.modlauncher.TransformationServiceDecorator.runScan(TransformationServiceDecorator.java:114) [21:36:39] [main/INFO] [STDERR/]: [java.lang.ThreadGroup:uncaughtException:1052]:       at cpw.mods.modlauncher.TransformationServicesHandler.lambda$runScanningTransformationServices$8(TransformationServicesHandler.java:115) [21:36:39] [main/INFO] [STDERR/]: [java.lang.ThreadGroup:uncaughtException:1052]:       at cpw.mods.modlauncher.TransformationServicesHandler$$Lambda$185/259564670.apply(Unknown Source) [21:36:39] [main/INFO] [STDERR/]: [java.lang.ThreadGroup:uncaughtException:1052]:       at java.util.stream.ReferencePipeline$7$1.accept(ReferencePipeline.java:267) [21:36:39] [main/INFO] [STDERR/]: [java.lang.ThreadGroup:uncaughtException:1052]:       at java.util.HashMap$ValueSpliterator.forEachRemaining(HashMap.java:1612) [21:36:39] [main/INFO] [STDERR/]: [java.lang.ThreadGroup:uncaughtException:1052]:       at java.util.stream.AbstractPipeline.copyInto(AbstractPipeline.java:512) [21:36:39] [main/INFO] [STDERR/]: [java.lang.ThreadGroup:uncaughtException:1052]:       at java.util.stream.AbstractPipeline.wrapAndCopyInto(AbstractPipeline.java:502) [21:36:39] [main/INFO] [STDERR/]: [java.lang.ThreadGroup:uncaughtException:1052]:       at java.util.stream.ReduceOps$ReduceOp.evaluateSequential(ReduceOps.java:708) [21:36:39] [main/INFO] [STDERR/]: [java.lang.ThreadGroup:uncaughtException:1052]:       at java.util.stream.AbstractPipeline.evaluate(AbstractPipeline.java:234) [21:36:39] [main/INFO] [STDERR/]: [java.lang.ThreadGroup:uncaughtException:1052]:       at java.util.stream.ReferencePipeline.collect(ReferencePipeline.java:499) [21:36:39] [main/INFO] [STDERR/]: [java.lang.ThreadGroup:uncaughtException:1052]:       at cpw.mods.modlauncher.TransformationServicesHandler.runScanningTransformationServices(TransformationServicesHandler.java:116) [21:36:39] [main/INFO] [STDERR/]: [java.lang.ThreadGroup:uncaughtException:1052]:       at cpw.mods.modlauncher.TransformationServicesHandler.initializeTransformationServices(TransformationServicesHandler.java:63) [21:36:39] [main/INFO] [STDERR/]: [java.lang.ThreadGroup:uncaughtException:1052]:       at cpw.mods.modlauncher.Launcher.run(Launcher.java:76) [21:36:39] [main/INFO] [STDERR/]: [java.lang.ThreadGroup:uncaughtException:1052]:       at cpw.mods.modlauncher.Launcher.main(Launcher.java:66) [21:36:39] [main/INFO] [STDERR/]: [java.lang.ThreadGroup:uncaughtException:1052]:       at net.minecraftforge.server.ServerMain$Runner.runLauncher(ServerMain.java:63) [21:36:39] [main/INFO] [STDERR/]: [java.lang.ThreadGroup:uncaughtException:1052]:       at net.minecraftforge.server.ServerMain$Runner.access$100(ServerMain.java:60) [21:36:39] [main/INFO] [STDERR/]: [java.lang.ThreadGroup:uncaughtException:1052]:       at net.minecraftforge.server.ServerMain.main(ServerMain.java:57) [21:36:39] [main/INFO] [STDERR/]: [java.lang.ThreadGroup:uncaughtException:1061]: Caused by: java.lang.NoClassDefFoundError: jdk/nashorn/api/scripting/ClassFilter [21:36:39] [main/INFO] [STDERR/]: [java.lang.ThreadGroup:uncaughtException:1061]:       ... 38 more [21:36:39] [main/INFO] [STDERR/]: [java.lang.Throwable:printStackTrace:643]: Caused by: java.lang.ClassNotFoundException: jdk.nashorn.api.scripting.ClassFilter [21:36:39] [main/INFO] [STDERR/]: [java.lang.Throwable:printStackTrace:643]:    at java.net.URLClassLoader$1.run(URLClassLoader.java:372) [21:36:39] [main/INFO] [STDERR/]: [java.lang.Throwable:printStackTrace:643]:    at java.net.URLClassLoader$1.run(URLClassLoader.java:361) [21:36:39] [main/INFO] [STDERR/]: [java.lang.Throwable:printStackTrace:643]:    at java.security.AccessController.doPrivileged(Native Method) [21:36:39] [main/INFO] [STDERR/]: [java.lang.Throwable:printStackTrace:643]:    at java.net.URLClassLoader.findClass(URLClassLoader.java:360) [21:36:39] [main/INFO] [STDERR/]: [java.lang.Throwable:printStackTrace:643]:    at java.lang.ClassLoader.loadClass(ClassLoader.java:424) [21:36:39] [main/INFO] [STDERR/]: [java.lang.Throwable:printStackTrace:643]:    at sun.misc.Launcher$AppClassLoader.loadClass(Launcher.java:308) [21:36:39] [main/INFO] [STDERR/]: [java.lang.Throwable:printStackTrace:643]:    at java.lang.ClassLoader.loadClass(ClassLoader.java:357) [21:36:39] [main/INFO] [STDERR/]: [java.lang.Throwable:printStackTrace:643]:    ... 38 more
    • i tried that but it says the same error
    • No, and it is in fact broken. Firstly, you never register this type, so it will never work correctly. Secondly, you must not create registry entries in static initializers. You did it correctly above: Use this instead. However this is in the wrong class, as particle types (as all registry entries) must be registered on both sides (client and server). As such doing this in a client-only class will never work right.
    • Every time you post you post in the wrong subforum and I have to move your thread. Please take the hint. This is broken. You must not return null from this method. Use NetworkHooks.getEntitySpawningPacket. You must also only spawn your entity and start riding it on the server.
  • Topics

  • Who's Online (See full list)

×
×
  • Create New...

Important Information

By using this site, you agree to our Privacy Policy.