Jump to content

Could not resolve all files for configuration ':runtimeClasspathCopy'.


hasker2

Recommended Posts

1.16.5

 

I want to start modiing with forge.

I found course on youtube and downloaded jdk from this site https://adoptium.net/?variant=openjdk8&jvmVariant=hotspot

But when I open the project I get build error.

Could not resolve all files for configuration ':runtimeClasspathCopy'.
> Could not find net.minecraftforge:forge:1.16.5-36.2.34_mapped_official_1.16.5.
  Searched in the following locations:
    - file:/C:/Users/User/.gradle/caches/forge_gradle/bundeled_repo/net/minecraftforge/forge/1.16.5-36.2.34_mapped_official_1.16.5/forge-1.16.5-36.2.34_mapped_official_1.16.5.pom
    - file:/C:/Users/User/.gradle/caches/forge_gradle/bundeled_repo/net/minecraftforge/forge/1.16.5-36.2.34_mapped_official_1.16.5/forge-1.16.5-36.2.34_mapped_official_1.16.5.jar
  Required by:
      project :

Possible solution:
 - Declare repository providing the artifact, see the documentation at https://docs.gradle.org/current/userguide/declaring_repositories.html
 

 

Full error from 

2022-08-29-144126.png

Big text

Spoiler

Starting Gradle Daemon...
Gradle Daemon started in 1 s 843 ms
Download https://maven.minecraftforge.net/net/minecraftforge/gradle/ForgeGradle/maven-metadata.xml, took 1 s 764 ms (0 B)
Download https://maven.minecraftforge.net/net/minecraftforge/gradle/ForgeGradle/5.1.56/ForgeGradle-5.1.56.pom, took 135 ms (4,88 kB)
Download https://maven.minecraftforge.net/net/minecraftforge/gradle/ForgeGradle/5.1.56/ForgeGradle-5.1.56.module, took 136 ms (6,46 kB)
Download https://maven.minecraftforge.net/commons-io/commons-io/2.8.0/commons-io-2.8.0.pom, took 255 ms (16 kB)
Download https://maven.minecraftforge.net/net/minecraftforge/DiffPatch/2.0.7/DiffPatch-2.0.7.pom, took 397 ms (2,51 kB)
Download https://maven.minecraftforge.net/com/google/code/gson/gson/2.8.6/gson-2.8.6.pom, took 440 ms (2,53 kB)
Download https://maven.minecraftforge.net/net/minecraftforge/JarJarMetadata/0.3.17/JarJarMetadata-0.3.17.pom, took 452 ms (2,66 kB)
Download https://maven.minecraftforge.net/org/apache/commons/commons-parent/52/commons-parent-52.pom, took 268 ms (79,27 kB)
Download https://maven.minecraftforge.net/net/minecraftforge/DiffPatch/2.0.7/DiffPatch-2.0.7.module, took 137 ms (2,76 kB)
Download https://maven.minecraftforge.net/net/minecraftforge/JarJarMetadata/0.3.17/JarJarMetadata-0.3.17.module, took 141 ms (4,56 kB)
Download https://maven.minecraftforge.net/com/google/code/gson/gson-parent/2.8.6/gson-parent-2.8.6.pom, took 139 ms (4,42 kB)
Download https://maven.minecraftforge.net/net/minecraftforge/srgutils/0.4.13/srgutils-0.4.13.pom, took 174 ms (1,24 kB)
Download https://maven.minecraftforge.net/org/apache/apache/23/apache-23.pom, took 183 ms (18,42 kB)
Download https://maven.minecraftforge.net/org/sonatype/oss/oss-parent/7/oss-parent-7.pom, took 202 ms (4,82 kB)
Download https://maven.minecraftforge.net/net/minecraftforge/JarJarSelector/0.3.17/JarJarSelector-0.3.17.pom, took 199 ms (2,84 kB)
Download https://maven.minecraftforge.net/org/apache/maven/maven-artifact/3.6.3/maven-artifact-3.6.3.pom, took 151 ms (2,39 kB)
Download https://maven.minecraftforge.net/net/minecraftforge/JarJarSelector/0.3.17/JarJarSelector-0.3.17.module, took 156 ms (4,89 kB)
Download https://maven.minecraftforge.net/com/google/guava/guava/30.1-jre/guava-30.1-jre.pom, took 134 ms (12,21 kB)
Download https://maven.minecraftforge.net/org/apache/httpcomponents/httpclient/4.5.13/httpclient-4.5.13.pom, took 143 ms (6,61 kB)
Download https://maven.minecraftforge.net/org/apache/maven/maven/3.6.3/maven-3.6.3.pom, took 267 ms (26,43 kB)
Download https://maven.minecraftforge.net/net/minecraftforge/artifactural/3.0.8/artifactural-3.0.8.pom, took 132 ms (1,91 kB)
Download https://maven.minecraftforge.net/com/google/guava/guava-parent/30.1-jre/guava-parent-30.1-jre.pom, took 141 ms (13,54 kB)
Download https://maven.minecraftforge.net/org/apache/httpcomponents/httpcomponents-client/4.5.13/httpcomponents-client-4.5.13.pom, took 153 ms (16,38 kB)
Download https://maven.minecraftforge.net/net/minecraftforge/artifactural/3.0.8/artifactural-3.0.8.module, took 137 ms (3,09 kB)
Download https://maven.minecraftforge.net/org/apache/maven/maven-parent/33/maven-parent-33.pom, took 270 ms (44,16 kB)
Download https://maven.minecraftforge.net/net/minecraftforge/unsafe/0.2.0/unsafe-0.2.0.pom, took 148 ms (1,51 kB)
Download https://maven.minecraftforge.net/org/apache/apache/21/apache-21.pom, took 138 ms (17,11 kB)
Download https://maven.minecraftforge.net/de/siegmar/fastcsv/2.0.0/fastcsv-2.0.0.pom, took 133 ms (1,35 kB)
Download https://maven.minecraftforge.net/org/apache/httpcomponents/httpcomponents-parent/11/httpcomponents-parent-11.pom, took 262 ms (34,7 kB)
Download https://maven.minecraftforge.net/de/siegmar/fastcsv/2.0.0/fastcsv-2.0.0.module, took 136 ms (3,48 kB)
Download https://maven.minecraftforge.net/com/google/code/findbugs/jsr305/3.0.2/jsr305-3.0.2.pom, took 132 ms (4,29 kB)
Download https://maven.minecraftforge.net/com/google/guava/failureaccess/1.0.1/failureaccess-1.0.1.pom, took 133 ms (2,41 kB)
Download https://maven.minecraftforge.net/com/google/errorprone/error_prone_annotations/2.3.4/error_prone_annotations-2.3.4.pom, took 140 ms (2,11 kB)
Download https://maven.minecraftforge.net/org/checkerframework/checker-qual/3.5.0/checker-qual-3.5.0.pom, took 143 ms (2,17 kB)
Download https://maven.minecraftforge.net/com/google/errorprone/error_prone_parent/2.3.4/error_prone_parent-2.3.4.pom, took 135 ms (5,42 kB)
Download https://maven.minecraftforge.net/com/google/j2objc/j2objc-annotations/1.3/j2objc-annotations-1.3.pom, took 156 ms (2,76 kB)
Download https://maven.minecraftforge.net/com/google/guava/guava-parent/26.0-android/guava-parent-26.0-android.pom, took 165 ms (10,18 kB)
Download https://maven.minecraftforge.net/com/google/guava/listenablefuture/9999.0-empty-to-avoid-conflict-with-guava/listenablefuture-9999.0-empty-to-avoid-conflict-with-guava.pom, took 182 ms (2,28 kB)
Download https://maven.minecraftforge.net/org/sonatype/oss/oss-parent/9/oss-parent-9.pom, took 137 ms (6,57 kB)
Download https://maven.minecraftforge.net/org/codehaus/plexus/plexus-utils/3.2.1/plexus-utils-3.2.1.pom, took 146 ms (5,34 kB)
Download https://maven.minecraftforge.net/org/apache/commons/commons-lang3/3.8.1/commons-lang3-3.8.1.pom, took 149 ms (27,89 kB)
Download https://maven.minecraftforge.net/org/codehaus/plexus/plexus/5.1/plexus-5.1.pom, took 138 ms (22,5 kB)
Download https://maven.minecraftforge.net/org/apache/commons/commons-parent/47/commons-parent-47.pom, took 414 ms (77,56 kB)
Download https://maven.minecraftforge.net/org/apache/apache/19/apache-19.pom, took 137 ms (15,49 kB)
Download https://maven.minecraftforge.net/org/apache/httpcomponents/httpcore/4.4.13/httpcore-4.4.13.pom, took 136 ms (4,97 kB)
Download https://maven.minecraftforge.net/commons-logging/commons-logging/1.2/commons-logging-1.2.pom, took 137 ms (19,21 kB)
Download https://maven.minecraftforge.net/commons-codec/commons-codec/1.11/commons-codec-1.11.pom, took 256 ms (13,97 kB)
Download https://maven.minecraftforge.net/org/apache/httpcomponents/httpcomponents-core/4.4.13/httpcomponents-core-4.4.13.pom, took 138 ms (13,17 kB)
Download https://maven.minecraftforge.net/org/apache/commons/commons-parent/34/commons-parent-34.pom, took 268 ms (55,94 kB)
Download https://maven.minecraftforge.net/org/apache/commons/commons-parent/42/commons-parent-42.pom, took 260 ms (67,96 kB)
Download https://maven.minecraftforge.net/org/apache/apache/13/apache-13.pom, took 137 ms (13,97 kB)
Download https://maven.minecraftforge.net/org/apache/apache/18/apache-18.pom, took 130 ms (15,67 kB)
Download https://maven.minecraftforge.net/org/apache/commons/commons-lang3/3.9/commons-lang3-3.9.pom, took 135 ms (28,38 kB)
Download https://maven.minecraftforge.net/org/apache/commons/commons-parent/48/commons-parent-48.pom, took 255 ms (72,03 kB)
Download https://maven.minecraftforge.net/it/unimi/dsi/fastutil/8.3.1/fastutil-8.3.1.pom, took 131 ms (1,4 kB)
Download https://maven.minecraftforge.net/org/apache/commons/commons-compress/1.18/commons-compress-1.18.pom, took 138 ms (18,23 kB)
Download https://maven.minecraftforge.net/org/tukaani/xz/1.8/xz-1.8.pom, took 140 ms (1,91 kB)
Download https://maven.minecraftforge.net/net/sf/jopt-simple/jopt-simple/5.0.4/jopt-simple-5.0.4.pom, took 268 ms (13,97 kB)
Download https://maven.minecraftforge.net/org/apache/maven/maven-artifact/3.8.1/maven-artifact-3.8.1.pom, took 136 ms (2,39 kB)
Download https://maven.minecraftforge.net/org/apache/maven/maven/3.8.1/maven-3.8.1.pom, took 266 ms (26,43 kB)
Download https://maven.minecraftforge.net/com/google/guava/guava/31.0.1-jre/guava-31.0.1-jre.pom, took 137 ms (10,96 kB)
Download https://maven.minecraftforge.net/com/google/guava/guava-parent/31.0.1-jre/guava-parent-31.0.1-jre.pom, took 138 ms (13,83 kB)
Download https://maven.minecraftforge.net/com/machinezoo/noexception/noexception/1.7.1/noexception-1.7.1.pom, took 136 ms (5,15 kB)
Download https://maven.minecraftforge.net/org/slf4j/slf4j-api/1.7.30/slf4j-api-1.7.30.pom, took 139 ms (3,83 kB)
Download https://maven.minecraftforge.net/org/slf4j/slf4j-parent/1.7.30/slf4j-parent-1.7.30.pom, took 254 ms (13,81 kB)
Download https://maven.minecraftforge.net/com/google/errorprone/error_prone_annotations/2.7.1/error_prone_annotations-2.7.1.pom, took 134 ms (2,11 kB)
Download https://maven.minecraftforge.net/org/checkerframework/checker-qual/3.12.0/checker-qual-3.12.0.pom, took 140 ms (2,09 kB)
Download https://maven.minecraftforge.net/com/google/errorprone/error_prone_parent/2.7.1/error_prone_parent-2.7.1.pom, took 137 ms (6,98 kB)
Download https://maven.minecraftforge.net/org/checkerframework/checker-qual/3.12.0/checker-qual-3.12.0.module, took 136 ms (3,55 kB)
Download https://maven.minecraftforge.net/net/minecraftforge/JarJarSelector/0.3.17/JarJarSelector-0.3.17.jar, took 141 ms (17,37 kB)
Download https://maven.minecraftforge.net/net/minecraftforge/JarJarMetadata/0.3.17/JarJarMetadata-0.3.17.jar, took 256 ms (15,89 kB)
Download https://maven.minecraftforge.net/org/slf4j/slf4j-simple/1.7.30/slf4j-simple-1.7.30.jar, took 133 ms (15,24 kB)
Download https://maven.minecraftforge.net/commons-io/commons-io/2.8.0/commons-io-2.8.0.jar, took 786 ms (285,42 kB)
Download https://maven.minecraftforge.net/com/google/code/gson/gson/2.8.6/gson-2.8.6.jar, took 660 ms (240,25 kB)
Download https://maven.minecraftforge.net/de/siegmar/fastcsv/2.0.0/fastcsv-2.0.0.jar, took 139 ms (29,48 kB)
Download https://maven.minecraftforge.net/net/minecraftforge/gradle/ForgeGradle/5.1.56/ForgeGradle-5.1.56.jar, took 1 s 166 ms (453,8 kB)
Download https://maven.minecraftforge.net/net/sf/jopt-simple/jopt-simple/5.0.4/jopt-simple-5.0.4.jar, took 270 ms (78,15 kB)
Download https://maven.minecraftforge.net/com/machinezoo/noexception/noexception/1.7.1/noexception-1.7.1.jar, took 533 ms (250,86 kB)
Download https://maven.minecraftforge.net/net/minecraftforge/artifactural/3.0.8/artifactural-3.0.8.jar, took 136 ms (56,74 kB)
Download https://maven.minecraftforge.net/org/slf4j/slf4j-api/1.7.30/slf4j-api-1.7.30.jar, took 144 ms (41,47 kB)
Download https://maven.minecraftforge.net/net/minecraftforge/unsafe/0.2.0/unsafe-0.2.0.jar, took 132 ms (2,83 kB)
Download https://maven.minecraftforge.net/org/apache/maven/maven-artifact/3.8.1/maven-artifact-3.8.1.jar, took 144 ms (57,84 kB)
Download https://maven.minecraftforge.net/org/tukaani/xz/1.8/xz-1.8.jar, took 272 ms (108,56 kB)
Download https://maven.minecraftforge.net/org/apache/commons/commons-compress/1.18/commons-compress-1.18.jar, took 1 s 287 ms (591,75 kB)
Download https://maven.minecraftforge.net/net/minecraftforge/srgutils/0.4.13/srgutils-0.4.13.jar, took 260 ms (69,3 kB)
Download https://maven.minecraftforge.net/org/apache/httpcomponents/httpclient/4.5.13/httpclient-4.5.13.jar, took 1 s 634 ms (780,32 kB)
Download https://maven.minecraftforge.net/commons-codec/commons-codec/1.11/commons-codec-1.11.jar, took 780 ms (335,04 kB)
Download https://maven.minecraftforge.net/commons-logging/commons-logging/1.2/commons-logging-1.2.jar, took 794 ms (61,83 kB)
Download https://maven.minecraftforge.net/com/google/guava/failureaccess/1.0.1/failureaccess-1.0.1.jar, took 135 ms (4,62 kB)
Download https://maven.minecraftforge.net/org/apache/httpcomponents/httpcore/4.4.13/httpcore-4.4.13.jar, took 771 ms (328,59 kB)
Download https://maven.minecraftforge.net/net/minecraftforge/DiffPatch/2.0.7/DiffPatch-2.0.7-all.jar, took 2 s 782 ms (1,36 MB)
Download https://maven.minecraftforge.net/com/google/guava/listenablefuture/9999.0-empty-to-avoid-conflict-with-guava/listenablefuture-9999.0-empty-to-avoid-conflict-with-guava.jar, took 132 ms (2,2 kB)
Download https://maven.minecraftforge.net/com/google/code/findbugs/jsr305/3.0.2/jsr305-3.0.2.jar, took 133 ms (19,94 kB)
Download https://maven.minecraftforge.net/com/google/guava/guava/31.0.1-jre/guava-31.0.1-jre.jar, took 5 s 948 ms (2,97 MB)
Download https://maven.minecraftforge.net/org/codehaus/plexus/plexus-utils/3.2.1/plexus-utils-3.2.1.jar, took 642 ms (261,8 kB)
Download https://maven.minecraftforge.net/org/checkerframework/checker-qual/3.12.0/checker-qual-3.12.0.jar, took 508 ms (208,84 kB)
Download https://maven.minecraftforge.net/com/google/j2objc/j2objc-annotations/1.3/j2objc-annotations-1.3.jar, took 134 ms (8,78 kB)
Download https://maven.minecraftforge.net/com/google/errorprone/error_prone_annotations/2.7.1/error_prone_annotations-2.7.1.jar, took 133 ms (14,84 kB)
Download https://maven.minecraftforge.net/org/apache/commons/commons-lang3/3.9/commons-lang3-3.9.jar, took 1 s 59 ms (503,88 kB)
Download https://maven.minecraftforge.net/it/unimi/dsi/fastutil/8.3.1/fastutil-8.3.1.jar, took 37 s 994 ms (19,01 MB)

> Configure project :
Java: 17.0.4.1 JVM: 17.0.4.1+1(Eclipse Adoptium) Arch: amd64
WARNING: This project is configured to use the official obfuscation mappings provided by Mojang. These mapping fall under their associated license, you should be fully aware of this license. For the latest license text, refer below, or the reference copy here: https://github.com/MinecraftForge/MCPConfig/blob/master/Mojang.md, You can hide this warning by running the `hideOfficialWarningUntilChanged` task
WARNING: (c) 2020 Microsoft Corporation. These mappings are provided "as-is" and you bear the risk of using them. You may copy and use the mappings for development purposes, but you may not redistribute the mappings complete and unmodified. Microsoft makes no warranties, express or implied, with respect to the mappings provided here.  Use and modification of this document or the source code (in any form) of Minecraft: Java Edition is governed by the Minecraft End User License Agreement available at https://account.mojang.com/documents/minecraft_eula.
Download https://maven.minecraftforge.net/net/minecraftforge/mergetool/1.0.9/mergetool-1.0.9.pom, took 132 ms (2,08 kB)
Download https://maven.minecraftforge.net/org/ow2/asm/asm/9.1/asm-9.1.pom, took 132 ms (2,37 kB)
Download https://maven.minecraftforge.net/org/ow2/asm/asm-commons/9.1/asm-commons-9.1.pom, took 137 ms (2,96 kB)
Download https://maven.minecraftforge.net/com/google/code/findbugs/jsr305/3.0.1/jsr305-3.0.1.pom, took 133 ms (4,29 kB)
Download https://maven.minecraftforge.net/org/ow2/ow2/1.5/ow2-1.5.pom, took 266 ms (11,23 kB)
Download https://maven.minecraftforge.net/net/minecraftforge/forge/1.16.5-36.2.34/forge-1.16.5-36.2.34.pom, took 132 ms (1,23 kB)
Download https://maven.minecraftforge.net/org/ow2/asm/asm-tree/9.1/asm-tree-9.1.pom, took 137 ms (2,59 kB)
Download https://maven.minecraftforge.net/cpw/mods/modlauncher/8.1.3/modlauncher-8.1.3.module, took 133 ms (3,69 kB)
Download https://maven.minecraftforge.net/org/ow2/asm/asm-util/9.1/asm-util-9.1.pom, took 137 ms (2,94 kB)
Download https://maven.minecraftforge.net/org/spongepowered/mixin/0.8.4/mixin-0.8.4.pom, took 133 ms (1,08 kB)
Download https://maven.minecraftforge.net/cpw/mods/grossjava9hacks/1.3.3/grossjava9hacks-1.3.3.module, took 136 ms (2,32 kB)
Download https://maven.minecraftforge.net/net/minecrell/terminalconsoleappender/1.2.0/terminalconsoleappender-1.2.0.pom, took 132 ms (1,82 kB)
Download https://maven.minecraftforge.net/org/ow2/asm/asm-analysis/9.1/asm-analysis-9.1.pom, took 133 ms (2,62 kB)
Download https://maven.minecraftforge.net/org/apache/logging/log4j/log4j-slf4j18-impl/2.15.0/log4j-slf4j18-impl-2.15.0.pom, took 132 ms (9,23 kB)
Download https://maven.minecraftforge.net/net/minecraftforge/accesstransformers/3.0.1/accesstransformers-3.0.1.module, took 136 ms (4,47 kB)
Download https://maven.minecraftforge.net/org/apache/logging/log4j/log4j-core/2.15.0/log4j-core-2.15.0.pom, took 264 ms (23,5 kB)
Download https://maven.minecraftforge.net/org/antlr/antlr4-runtime/4.9.1/antlr4-runtime-4.9.1.pom, took 136 ms (3,62 kB)
Download https://maven.minecraftforge.net/org/apache/logging/log4j/log4j/2.15.0/log4j-2.15.0.pom, took 384 ms (68,85 kB)
Download https://maven.minecraftforge.net/org/antlr/antlr4-master/4.9.1/antlr4-master-4.9.1.pom, took 133 ms (4,4 kB)
Download https://maven.minecraftforge.net/org/apache/logging/logging-parent/3/logging-parent-3.pom, took 132 ms (3,14 kB)
Download https://maven.minecraftforge.net/org/apache/logging/log4j/log4j-api/2.15.0/log4j-api-2.15.0.pom, took 139 ms (14,04 kB)
Download https://maven.minecraftforge.net/net/minecraftforge/eventbus/4.0.0/eventbus-4.0.0.module, took 135 ms (3,47 kB)
Download https://maven.minecraftforge.net/net/jodah/typetools/0.8.3/typetools-0.8.3.module, took 132 ms (2,71 kB)
Download https://maven.minecraftforge.net/net/minecraftforge/forgespi/3.2.0/forgespi-3.2.0.module, took 138 ms (3,07 kB)
Download https://maven.minecraftforge.net/net/minecraftforge/coremods/4.0.6/coremods-4.0.6.module, took 139 ms (3,22 kB)
Download https://maven.minecraftforge.net/org/jline/jline/3.12.1/jline-3.12.1.pom, took 266 ms (15,38 kB)
Download https://maven.minecraftforge.net/com/electronwill/night-config/toml/3.6.3/toml-3.6.3.pom, took 133 ms (1,45 kB)
Download https://maven.minecraftforge.net/org/jline/jline-parent/3.12.1/jline-parent-3.12.1.pom, took 132 ms (19 kB)
Download https://maven.minecraftforge.net/com/electronwill/night-config/core/3.6.3/core-3.6.3.pom, took 135 ms (1,23 kB)
Download https://maven.minecraftforge.net/com/ibm/icu/icu4j/66.1/icu4j-66.1.pom, took 137 ms (4,94 kB)
Download https://maven.minecraftforge.net/net/java/dev/jna/jna/4.4.0/jna-4.4.0.pom, took 146 ms (1,58 kB)
Download https://maven.minecraftforge.net/org/lwjgl/lwjgl-stb/3.2.2/lwjgl-stb-3.2.2.pom, took 189 ms (1,42 kB)
Download https://maven.minecraftforge.net/io/netty/netty-all/4.1.25.Final/netty-all-4.1.25.Final.pom, took 270 ms (25,57 kB)
Download https://maven.minecraftforge.net/net/java/dev/jna/platform/3.4.0/platform-3.4.0.pom, took 131 ms (2,44 kB)
Download https://maven.minecraftforge.net/io/netty/netty-parent/4.1.25.Final/netty-parent-4.1.25.Final.pom, took 270 ms (53,23 kB)
Download https://maven.minecraftforge.net/com/google/guava/guava/21.0/guava-21.0.pom, took 138 ms (7,01 kB)
Download https://maven.minecraftforge.net/org/lwjgl/lwjgl/3.2.2/lwjgl-3.2.2.pom, took 144 ms (1,13 kB)
Download https://maven.minecraftforge.net/org/lwjgl/lwjgl-jemalloc/3.2.2/lwjgl-jemalloc-3.2.2.pom, took 131 ms (1,46 kB)
Download https://maven.minecraftforge.net/org/apache/commons/commons-lang3/3.5/commons-lang3-3.5.pom, took 263 ms (23,35 kB)
Download https://maven.minecraftforge.net/com/google/guava/guava-parent/21.0/guava-parent-21.0.pom, took 148 ms (9,66 kB)
Download https://maven.minecraftforge.net/commons-io/commons-io/2.5/commons-io-2.5.pom, took 139 ms (13,29 kB)
Download https://maven.minecraftforge.net/org/apache/httpcomponents/httpclient/4.3.3/httpclient-4.3.3.pom, took 131 ms (5,37 kB)
Download https://maven.minecraftforge.net/commons-logging/commons-logging/1.1.3/commons-logging-1.1.3.pom, took 132 ms (18,35 kB)
Download https://maven.minecraftforge.net/org/apache/commons/commons-parent/39/commons-parent-39.pom, took 143 ms (61,98 kB)
Download https://maven.minecraftforge.net/org/apache/commons/commons-parent/41/commons-parent-41.pom, took 269 ms (64,84 kB)
Download https://maven.minecraftforge.net/org/apache/httpcomponents/httpcomponents-client/4.3.3/httpcomponents-client-4.3.3.pom, took 260 ms (15,85 kB)
Download https://maven.minecraftforge.net/org/apache/apache/16/apache-16.pom, took 134 ms (15,4 kB)
Download https://maven.minecraftforge.net/org/apache/commons/commons-parent/28/commons-parent-28.pom, took 157 ms (50,15 kB)
Download https://maven.minecraftforge.net/org/apache/httpcomponents/project/7/project-7.pom, took 172 ms (27,24 kB)
Download https://maven.minecraftforge.net/org/apache/httpcomponents/httpcore/4.3.2/httpcore-4.3.2.pom, took 130 ms (4,6 kB)
Download https://maven.minecraftforge.net/org/apache/commons/commons-compress/1.8.1/commons-compress-1.8.1.pom, took 136 ms (11,43 kB)
Download https://maven.minecraftforge.net/commons-codec/commons-codec/1.10/commons-codec-1.10.pom, took 132 ms (11,61 kB)
Download https://maven.minecraftforge.net/it/unimi/dsi/fastutil/8.2.1/fastutil-8.2.1.pom, took 155 ms (1,4 kB)
Download https://maven.minecraftforge.net/org/apache/commons/commons-parent/33/commons-parent-33.pom, took 171 ms (53,09 kB)
Download https://maven.minecraftforge.net/org/apache/httpcomponents/httpcomponents-core/4.3.2/httpcomponents-core-4.3.2.pom, took 177 ms (12,15 kB)
Download https://maven.minecraftforge.net/org/apache/commons/commons-parent/35/commons-parent-35.pom, took 140 ms (57,77 kB)
Download https://maven.minecraftforge.net/net/java/jinput/jinput/2.0.5/jinput-2.0.5.pom, took 151 ms (1,79 kB)
Download https://maven.minecraftforge.net/org/lwjgl/lwjgl-glfw/3.2.2/lwjgl-glfw-3.2.2.pom, took 155 ms (1,52 kB)
Download https://maven.minecraftforge.net/net/java/jutils/jutils/1.0.0/jutils-1.0.0.pom, took 138 ms (2,7 kB)
Download https://maven.minecraftforge.net/org/lwjgl/lwjgl-opengl/3.2.2/lwjgl-opengl-3.2.2.pom, took 137 ms (1,48 kB)
Download https://maven.minecraftforge.net/org/apache/apache/15/apache-15.pom, took 155 ms (15,24 kB)
Download https://maven.minecraftforge.net/com/google/code/gson/gson/2.8.0/gson-2.8.0.pom, took 133 ms (1,45 kB)
Download https://maven.minecraftforge.net/org/lwjgl/lwjgl-tinyfd/3.2.2/lwjgl-tinyfd-3.2.2.pom, took 148 ms (1,38 kB)
Download https://maven.minecraftforge.net/com/google/code/gson/gson-parent/2.8.0/gson-parent-2.8.0.pom, took 138 ms (3,46 kB)
Download https://maven.minecraftforge.net/org/lwjgl/lwjgl-openal/3.2.2/lwjgl-openal-3.2.2.pom, took 136 ms (1,46 kB)
Download https://maven.minecraftforge.net/org/apache/logging/log4j/log4j-api/maven-metadata.xml, took 194 ms (0 B)
Download https://maven.minecraftforge.net/org/apache/logging/log4j/log4j-api/2.11.2/log4j-api-2.11.2.pom, took 138 ms (13,14 kB)
Download https://maven.minecraftforge.net/org/apache/logging/log4j/log4j/2.11.2/log4j-2.11.2.pom, took 262 ms (61,75 kB)
Download https://repo.maven.apache.org/maven2/org/apache/logging/log4j/log4j-api/maven-metadata.xml, took 40 ms (2,04 kB)
Download https://maven.minecraftforge.net/cpw/mods/modlauncher/maven-metadata.xml, took 133 ms (0 B)
Download https://maven.minecraftforge.net/cpw/mods/modlauncher/6.1.3/modlauncher-6.1.3.module, took 131 ms (3,73 kB)
Download https://maven.minecraftforge.net/cpw/mods/modlauncher/5.1.2/modlauncher-5.1.2.module, took 132 ms (3,73 kB)
Download https://maven.minecraftforge.net/net/minecraftforge/forgespi/maven-metadata.xml, took 132 ms (1,48 kB)
Download https://maven.minecraftforge.net/net/minecraftforge/forgespi/3.1.1/forgespi-3.1.1.module, took 133 ms (3,07 kB)
Download https://maven.minecraftforge.net/org/apache/logging/log4j/log4j-core/maven-metadata.xml, took 132 ms (0 B)
Download https://maven.minecraftforge.net/org/apache/logging/log4j/log4j-core/2.11.2/log4j-core-2.11.2.pom, took 133 ms (23,15 kB)
Download https://repo.maven.apache.org/maven2/org/apache/logging/log4j/log4j-core/maven-metadata.xml, took 41 ms (2,04 kB)
Download https://maven.minecraftforge.net/org/slf4j/slf4j-api/1.8.0-beta4/slf4j-api-1.8.0-beta4.pom, took 132 ms (1,65 kB)
Download https://maven.minecraftforge.net/org/slf4j/slf4j-parent/1.8.0-beta4/slf4j-parent-1.8.0-beta4.pom, took 132 ms (16,98 kB)
Download https://maven.minecraftforge.net/org/jline/jline-reader/3.12.1/jline-reader-3.12.1.pom, took 134 ms (1,11 kB)
Download https://maven.minecraftforge.net/org/jline/jline-terminal/3.12.1/jline-terminal-3.12.1.pom, took 131 ms (1,14 kB)
Download https://maven.minecraftforge.net/net/minecraftforge/coremods/4.0.6/coremods-4.0.6.jar, took 270 ms (25,45 kB)
Download https://maven.minecraftforge.net/net/minecraftforge/eventbus/4.0.0/eventbus-4.0.0.jar, took 385 ms (42,87 kB)
Download https://maven.minecraftforge.net/net/minecraftforge/accesstransformers/3.0.1/accesstransformers-3.0.1.jar, took 392 ms (76,59 kB)
Download https://maven.minecraftforge.net/net/java/jinput/jinput/2.0.5/jinput-2.0.5.jar, took 526 ms (208,34 kB)
Download https://maven.minecraftforge.net/commons-codec/commons-codec/1.10/commons-codec-1.10.jar, took 663 ms (284,18 kB)
Download https://maven.minecraftforge.net/net/java/jutils/jutils/1.0.0/jutils-1.0.0.jar, took 148 ms (7,51 kB)
Download https://libraries.minecraft.net/com/mojang/brigadier/1.0.17/brigadier-1.0.17.jar, took 112 ms (77,39 kB)
Download https://maven.minecraftforge.net/org/apache/httpcomponents/httpclient/4.3.3/httpclient-4.3.3.jar, took 1 s 333 ms (589,51 kB)
Download https://libraries.minecraft.net/com/mojang/datafixerupper/4.0.26/datafixerupper-4.0.26.jar, took 547 ms (673,18 kB)
Download https://libraries.minecraft.net/com/mojang/authlib/2.1.28/authlib-2.1.28.jar, took 247 ms (76,33 kB)
Download https://maven.minecraftforge.net/com/google/code/gson/gson/2.8.0/gson-2.8.0.jar, took 658 ms (231,95 kB)
Download https://maven.minecraftforge.net/commons-logging/commons-logging/1.1.3/commons-logging-1.1.3.jar, took 135 ms (62,05 kB)
Download https://maven.minecraftforge.net/org/apache/httpcomponents/httpcore/4.3.2/httpcore-4.3.2.jar, took 653 ms (282,27 kB)
Download https://maven.minecraftforge.net/org/lwjgl/lwjgl-jemalloc/3.2.2/lwjgl-jemalloc-3.2.2.jar, took 136 ms (34,85 kB)
Download https://maven.minecraftforge.net/org/apache/commons/commons-compress/1.8.1/commons-compress-1.8.1.jar, took 803 ms (365,55 kB)
Download https://maven.minecraftforge.net/org/lwjgl/lwjgl-openal/3.2.2/lwjgl-openal-3.2.2.jar, took 265 ms (80,01 kB)
Download https://maven.minecraftforge.net/org/lwjgl/lwjgl-jemalloc/3.2.2/lwjgl-jemalloc-3.2.2-natives-windows.jar, took 534 ms (220,62 kB)
Download https://maven.minecraftforge.net/org/lwjgl/lwjgl-opengl/3.2.2/lwjgl-opengl-3.2.2-natives-windows.jar, took 671 ms (170,8 kB)
Download https://maven.minecraftforge.net/org/lwjgl/lwjgl-glfw/3.2.2/lwjgl-glfw-3.2.2.jar, took 273 ms (108,91 kB)
Download https://maven.minecraftforge.net/org/lwjgl/lwjgl-opengl/3.2.2/lwjgl-opengl-3.2.2.jar, took 1 s 980 ms (929,78 kB)
Download https://maven.minecraftforge.net/org/lwjgl/lwjgl-stb/3.2.2/lwjgl-stb-3.2.2.jar, took 270 ms (104,47 kB)
Download https://maven.minecraftforge.net/org/lwjgl/lwjgl-openal/3.2.2/lwjgl-openal-3.2.2-natives-windows.jar, took 2 s 698 ms (1,31 MB)
Download https://maven.minecraftforge.net/org/lwjgl/lwjgl-glfw/3.2.2/lwjgl-glfw-3.2.2-natives-windows.jar, took 667 ms (266,65 kB)
Download https://maven.minecraftforge.net/org/lwjgl/lwjgl-tinyfd/3.2.2/lwjgl-tinyfd-3.2.2.jar, took 133 ms (7,09 kB)
Download https://maven.minecraftforge.net/org/lwjgl/lwjgl-tinyfd/3.2.2/lwjgl-tinyfd-3.2.2-natives-windows.jar, took 535 ms (208,31 kB)
Download https://maven.minecraftforge.net/org/lwjgl/lwjgl/3.2.2/lwjgl-3.2.2.jar, took 696 ms (321,9 kB)
Download https://libraries.minecraft.net/com/mojang/text2speech/1.11.3/text2speech-1.11.3.jar, took 53 ms (13,16 kB)
Download https://maven.minecraftforge.net/org/lwjgl/lwjgl-stb/3.2.2/lwjgl-stb-3.2.2-natives-windows.jar, took 1 s 57 ms (465,81 kB)
Download https://libraries.minecraft.net/com/mojang/text2speech/1.11.3/text2speech-1.11.3-natives-windows.jar, took 98 ms (81,38 kB)
Download https://maven.minecraftforge.net/org/slf4j/slf4j-api/1.8.0-beta4/slf4j-api-1.8.0-beta4.jar, took 147 ms (44,21 kB)
Download https://maven.minecraftforge.net/net/java/jinput/jinput-platform/2.0.5/jinput-platform-2.0.5-natives-linux.jar, took 137 ms (10,36 kB)
Download https://maven.minecraftforge.net/org/lwjgl/lwjgl/3.2.2/lwjgl-3.2.2-natives-windows.jar, took 675 ms (279,59 kB)
Download https://maven.minecraftforge.net/org/jline/jline-reader/3.12.1/jline-reader-3.12.1.jar, took 394 ms (150,76 kB)
Download https://maven.minecraftforge.net/net/java/jinput/jinput-platform/2.0.5/jinput-platform-2.0.5-natives-osx.jar, took 136 ms (12,19 kB)
Download https://maven.minecraftforge.net/net/minecraftforge/forgespi/3.2.0/forgespi-3.2.0.jar, took 137 ms (20,17 kB)
Download https://maven.minecraftforge.net/net/java/jinput/jinput-platform/2.0.5/jinput-platform-2.0.5-natives-windows.jar, took 402 ms (155,18 kB)
Download https://maven.minecraftforge.net/cpw/mods/modlauncher/8.1.3/modlauncher-8.1.3.jar, took 270 ms (126,75 kB)
Download https://maven.minecraftforge.net/org/jline/jline-terminal/3.12.1/jline-terminal-3.12.1.jar, took 518 ms (211,71 kB)
Download https://maven.minecraftforge.net/cpw/mods/modlauncher/8.1.3/modlauncher-8.1.3-api.jar, took 134 ms (4,42 kB)
Download https://maven.minecraftforge.net/commons-io/commons-io/2.5/commons-io-2.5.jar, took 535 ms (208,7 kB)
Download https://maven.minecraftforge.net/org/apache/commons/commons-lang3/3.8.1/commons-lang3-3.8.1.jar, took 1 s 63 ms (501,88 kB)
Download https://libraries.minecraft.net/com/mojang/patchy/1.3.9/patchy-1.3.9.jar, took 53 ms (23,58 kB)
Download https://maven.minecraftforge.net/net/java/dev/jna/platform/3.4.0/platform-3.4.0.jar, took 1 s 911 ms (913,44 kB)
Download https://maven.minecraftforge.net/net/java/dev/jna/jna/4.4.0/jna-4.4.0.jar, took 2 s 278 ms (1,09 MB)
Download https://libraries.minecraft.net/com/mojang/javabridge/1.0.22/javabridge-1.0.22.jar, took 50 ms (5,11 kB)
Download https://maven.minecraftforge.net/cpw/mods/grossjava9hacks/1.3.3/grossjava9hacks-1.3.3.jar, took 137 ms (2,11 kB)
Download https://maven.minecraftforge.net/net/minecrell/terminalconsoleappender/1.2.0/terminalconsoleappender-1.2.0.jar, took 137 ms (15,98 kB)
Download https://libraries.minecraft.net/oshi-project/oshi-core/1.1/oshi-core-1.1.jar, took 54 ms (30,97 kB)
Download https://maven.minecraftforge.net/com/google/guava/guava/21.0/guava-21.0.jar, took 5 s 68 ms (2,52 MB)
Download https://maven.minecraftforge.net/io/netty/netty-all/4.1.25.Final/netty-all-4.1.25.Final.jar, took 7 s 784 ms (3,82 MB)
Download https://maven.minecraftforge.net/net/minecraftforge/forge/1.16.5-36.2.34/forge-1.16.5-36.2.34-launcher.jar, took 530 ms (212,61 kB)
Download https://maven.minecraftforge.net/net/minecraftforge/nashorn-core-compat/15.1.1.1/nashorn-core-compat-15.1.1.1.jar, took 4 s 374 ms (2,19 MB)
Download https://maven.minecraftforge.net/net/minecraftforge/mergetool/1.0.9/mergetool-1.0.9-api.jar, took 133 ms (2,55 kB)
Download https://maven.minecraftforge.net/org/apache/logging/log4j/log4j-api/2.15.0/log4j-api-2.15.0.jar, took 656 ms (301,8 kB)
Download https://maven.minecraftforge.net/org/ow2/asm/asm-commons/9.1/asm-commons-9.1.jar, took 262 ms (72,64 kB)
Download https://maven.minecraftforge.net/org/spongepowered/mixin/0.8.4/mixin-0.8.4.jar, took 2 s 249 ms (1,07 MB)
Download https://maven.minecraftforge.net/org/ow2/asm/asm-util/9.1/asm-util-9.1.jar, took 268 ms (84,68 kB)
Download https://maven.minecraftforge.net/org/jline/jline/3.12.1/jline-3.12.1.jar, took 1 s 587 ms (732,93 kB)
Download https://maven.minecraftforge.net/org/ow2/asm/asm/9.1/asm-9.1.jar, took 271 ms (121,79 kB)
Download https://maven.minecraftforge.net/net/jodah/typetools/0.8.3/typetools-0.8.3.jar, took 136 ms (15,43 kB)
Download https://maven.minecraftforge.net/org/apache/logging/log4j/log4j-slf4j18-impl/2.15.0/log4j-slf4j18-impl-2.15.0.jar, took 137 ms (21,22 kB)
Download https://maven.minecraftforge.net/org/apache/maven/maven-artifact/3.6.3/maven-artifact-3.6.3.jar, took 142 ms (57,82 kB)
Download https://maven.minecraftforge.net/org/apache/logging/log4j/log4j-core/2.15.0/log4j-core-2.15.0.jar, took 3 s 634 ms (1,79 MB)
Download https://maven.minecraftforge.net/org/ow2/asm/asm-tree/9.1/asm-tree-9.1.jar, took 138 ms (52,66 kB)
Download https://maven.minecraftforge.net/org/ow2/asm/asm-analysis/9.1/asm-analysis-9.1.jar, took 135 ms (34,26 kB)
Download https://maven.minecraftforge.net/com/electronwill/night-config/core/3.6.3/core-3.6.3.jar, took 515 ms (199,09 kB)
Download https://maven.minecraftforge.net/com/electronwill/night-config/toml/3.6.3/toml-3.6.3.jar, took 153 ms (31,29 kB)
Download https://maven.minecraftforge.net/org/antlr/antlr4-runtime/4.9.1/antlr4-runtime-4.9.1.jar, took 807 ms (337,87 kB)
Download https://maven.minecraftforge.net/com/ibm/icu/icu4j/66.1/icu4j-66.1.jar, took 26 s 306 ms (12,94 MB)
Download https://maven.minecraftforge.net/it/unimi/dsi/fastutil/8.2.1/fastutil-8.2.1.jar, took 36 s 812 ms (18,8 MB)
Setting up MCP environment
Initializing steps
Executing steps
 > Running 'downloadManifest'
 > Running 'downloadJson'
 > Running 'downloadClient'
 > Running 'downloadServer'
 > Running 'stripClient'
 > Running 'stripServer'
 > Running 'merge'
 > Running 'rename'
Stopping at requested step: C:\Users\User\.gradle\caches\forge_gradle\mcp_repo\de\oceanlabs\mcp\mcp_config\1.16.5-20210115.111550\joined\rename\output.jar
java.lang.IllegalStateException: Could not find tools.jar. Please check that C:\Program Files\Java\jre1.8.0_341 contains a valid JDK installation.
    at org.gradle.api.internal.tasks.compile.JdkTools.<init>(JdkTools.java:77)
    at org.gradle.api.internal.tasks.compile.JavaHomeBasedJavaCompilerFactory.createJdkTools(JavaHomeBasedJavaCompilerFactory.java:48)
    at java.util.concurrent.ConcurrentHashMap.computeIfAbsent(Unknown Source)
    at org.gradle.api.internal.tasks.compile.JavaHomeBasedJavaCompilerFactory.create(JavaHomeBasedJavaCompilerFactory.java:43)
    at org.gradle.api.internal.tasks.compile.JavaHomeBasedJavaCompilerFactory.create(JavaHomeBasedJavaCompilerFactory.java:29)
    at org.gradle.api.internal.tasks.compile.JdkJavaCompiler.createCompileTask(JdkJavaCompiler.java:63)
    at org.gradle.api.internal.tasks.compile.JdkJavaCompiler.execute(JdkJavaCompiler.java:53)
    at org.gradle.api.internal.tasks.compile.JdkJavaCompiler.execute(JdkJavaCompiler.java:39)
    at org.gradle.api.internal.tasks.compile.daemon.AbstractDaemonCompiler$CompilerWorkAction.execute(AbstractDaemonCompiler.java:135)
    at org.gradle.workers.internal.DefaultWorkerServer.execute(DefaultWorkerServer.java:63)
    at org.gradle.workers.internal.AbstractClassLoaderWorker$1.create(AbstractClassLoaderWorker.java:49)
    at org.gradle.workers.internal.AbstractClassLoaderWorker$1.create(AbstractClassLoaderWorker.java:43)
    at org.gradle.internal.classloader.ClassLoaderUtils.executeInClassloader(ClassLoaderUtils.java:97)
    at org.gradle.workers.internal.AbstractClassLoaderWorker.executeInClassLoader(AbstractClassLoaderWorker.java:43)
    at org.gradle.workers.internal.FlatClassLoaderWorker.run(FlatClassLoaderWorker.java:32)
    at org.gradle.workers.internal.FlatClassLoaderWorker.run(FlatClassLoaderWorker.java:22)
    at org.gradle.workers.internal.WorkerDaemonServer.run(WorkerDaemonServer.java:85)
    at org.gradle.workers.internal.WorkerDaemonServer.run(WorkerDaemonServer.java:55)
    at org.gradle.process.internal.worker.request.WorkerAction$1.call(WorkerAction.java:138)
    at org.gradle.process.internal.worker.child.WorkerLogEventListener.withWorkerLoggingProtocol(WorkerLogEventListener.java:41)
    at org.gradle.process.internal.worker.request.WorkerAction.run(WorkerAction.java:135)
    at sun.reflect.NativeMethodAccessorImpl.invoke0(Native Method)
    at sun.reflect.NativeMethodAccessorImpl.invoke(Unknown Source)
    at sun.reflect.DelegatingMethodAccessorImpl.invoke(Unknown Source)
    at java.lang.reflect.Method.invoke(Unknown Source)
    at org.gradle.internal.dispatch.ReflectionDispatch.dispatch(ReflectionDispatch.java:36)
    at org.gradle.internal.dispatch.ReflectionDispatch.dispatch(ReflectionDispatch.java:24)
    at org.gradle.internal.remote.internal.hub.MessageHubBackedObjectConnection$DispatchWrapper.dispatch(MessageHubBackedObjectConnection.java:182)
    at org.gradle.internal.remote.internal.hub.MessageHubBackedObjectConnection$DispatchWrapper.dispatch(MessageHubBackedObjectConnection.java:164)
    at org.gradle.internal.remote.internal.hub.MessageHub$Handler.run(MessageHub.java:414)
    at org.gradle.internal.concurrent.ExecutorPolicy$CatchAndRecordFailures.onExecute(ExecutorPolicy.java:64)
    at org.gradle.internal.concurrent.ManagedExecutorImpl$1.run(ManagedExecutorImpl.java:48)
    at java.util.concurrent.ThreadPoolExecutor.runWorker(Unknown Source)
    at java.util.concurrent.ThreadPoolExecutor$Worker.run(Unknown Source)
    at org.gradle.internal.concurrent.ThreadFactoryImpl$ManagedThreadRunnable.run(ThreadFactoryImpl.java:61)
    at java.lang.Thread.run(Unknown Source)
java.lang.IllegalStateException: Could not find tools.jar. Please check that C:\Program Files\Java\jre1.8.0_341 contains a valid JDK installation.
    at org.gradle.api.internal.tasks.compile.JdkTools.<init>(JdkTools.java:77)
    at org.gradle.api.internal.tasks.compile.JavaHomeBasedJavaCompilerFactory.createJdkTools(JavaHomeBasedJavaCompilerFactory.java:48)
    at java.util.concurrent.ConcurrentHashMap.computeIfAbsent(Unknown Source)
    at org.gradle.api.internal.tasks.compile.JavaHomeBasedJavaCompilerFactory.create(JavaHomeBasedJavaCompilerFactory.java:43)
    at org.gradle.api.internal.tasks.compile.JavaHomeBasedJavaCompilerFactory.create(JavaHomeBasedJavaCompilerFactory.java:29)
    at org.gradle.api.internal.tasks.compile.JdkJavaCompiler.createCompileTask(JdkJavaCompiler.java:63)
    at org.gradle.api.internal.tasks.compile.JdkJavaCompiler.execute(JdkJavaCompiler.java:53)
    at org.gradle.api.internal.tasks.compile.JdkJavaCompiler.execute(JdkJavaCompiler.java:39)
    at org.gradle.api.internal.tasks.compile.daemon.AbstractDaemonCompiler$CompilerWorkAction.execute(AbstractDaemonCompiler.java:135)
    at org.gradle.workers.internal.DefaultWorkerServer.execute(DefaultWorkerServer.java:63)
    at org.gradle.workers.internal.AbstractClassLoaderWorker$1.create(AbstractClassLoaderWorker.java:49)
    at org.gradle.workers.internal.AbstractClassLoaderWorker$1.create(AbstractClassLoaderWorker.java:43)
    at org.gradle.internal.classloader.ClassLoaderUtils.executeInClassloader(ClassLoaderUtils.java:97)
    at org.gradle.workers.internal.AbstractClassLoaderWorker.executeInClassLoader(AbstractClassLoaderWorker.java:43)
    at org.gradle.workers.internal.FlatClassLoaderWorker.run(FlatClassLoaderWorker.java:32)
    at org.gradle.workers.internal.FlatClassLoaderWorker.run(FlatClassLoaderWorker.java:22)
    at org.gradle.workers.internal.WorkerDaemonServer.run(WorkerDaemonServer.java:85)
    at org.gradle.workers.internal.WorkerDaemonServer.run(WorkerDaemonServer.java:55)
    at org.gradle.process.internal.worker.request.WorkerAction$1.call(WorkerAction.java:138)
    at org.gradle.process.internal.worker.child.WorkerLogEventListener.withWorkerLoggingProtocol(WorkerLogEventListener.java:41)
    at org.gradle.process.internal.worker.request.WorkerAction.run(WorkerAction.java:135)
    at sun.reflect.NativeMethodAccessorImpl.invoke0(Native Method)
    at sun.reflect.NativeMethodAccessorImpl.invoke(Unknown Source)
    at sun.reflect.DelegatingMethodAccessorImpl.invoke(Unknown Source)
    at java.lang.reflect.Method.invoke(Unknown Source)
    at org.gradle.internal.dispatch.ReflectionDispatch.dispatch(ReflectionDispatch.java:36)
    at org.gradle.internal.dispatch.ReflectionDispatch.dispatch(ReflectionDispatch.java:24)
    at org.gradle.internal.remote.internal.hub.MessageHubBackedObjectConnection$DispatchWrapper.dispatch(MessageHubBackedObjectConnection.java:182)
    at org.gradle.internal.remote.internal.hub.MessageHubBackedObjectConnection$DispatchWrapper.dispatch(MessageHubBackedObjectConnection.java:164)
    at org.gradle.internal.remote.internal.hub.MessageHub$Handler.run(MessageHub.java:414)
    at org.gradle.internal.concurrent.ExecutorPolicy$CatchAndRecordFailures.onExecute(ExecutorPolicy.java:64)
    at org.gradle.internal.concurrent.ManagedExecutorImpl$1.run(ManagedExecutorImpl.java:48)
    at java.util.concurrent.ThreadPoolExecutor.runWorker(Unknown Source)
    at java.util.concurrent.ThreadPoolExecutor$Worker.run(Unknown Source)
    at org.gradle.internal.concurrent.ThreadFactoryImpl$ManagedThreadRunnable.run(ThreadFactoryImpl.java:61)
    at java.lang.Thread.run(Unknown Source)

FAILURE: Build failed with an exception.

* What went wrong:
Could not resolve all files for configuration ':runtimeClasspathCopy'.
> Could not find net.minecraftforge:forge:1.16.5-36.2.34_mapped_official_1.16.5.
  Searched in the following locations:
    - file:/C:/Users/User/.gradle/caches/forge_gradle/bundeled_repo/net/minecraftforge/forge/1.16.5-36.2.34_mapped_official_1.16.5/forge-1.16.5-36.2.34_mapped_official_1.16.5.pom
    - file:/C:/Users/User/.gradle/caches/forge_gradle/bundeled_repo/net/minecraftforge/forge/1.16.5-36.2.34_mapped_official_1.16.5/forge-1.16.5-36.2.34_mapped_official_1.16.5.jar
  Required by:
      project :

* Try:
> Run with --info or --debug option to get more log output.
> Run with --scan to get full insights.

* Exception is:
org.gradle.api.internal.artifacts.ivyservice.DefaultLenientConfiguration$ArtifactResolveException: Could not resolve all files for configuration ':runtimeClasspathCopy'.
    at org.gradle.api.internal.artifacts.configurations.DefaultConfiguration.rethrowFailure(DefaultConfiguration.java:1423)
    at org.gradle.api.internal.artifacts.configurations.DefaultConfiguration.access$3600(DefaultConfiguration.java:152)
    at org.gradle.api.internal.artifacts.configurations.DefaultConfiguration$DefaultResolutionHost.rethrowFailure(DefaultConfiguration.java:2035)
    at org.gradle.api.internal.artifacts.configurations.DefaultConfiguration$ConfigurationFileCollection.visitContents(DefaultConfiguration.java:1395)
    at org.gradle.api.internal.artifacts.configurations.DefaultConfiguration.visitContents(DefaultConfiguration.java:498)
    at org.gradle.api.internal.file.AbstractFileCollection.getFiles(AbstractFileCollection.java:130)
    at org.gradle.api.internal.artifacts.configurations.DefaultConfiguration_Decorated.getFiles(Unknown Source)
    at org.gradle.api.internal.artifacts.configurations.DefaultConfiguration.resolve(DefaultConfiguration.java:488)
    at net.minecraftforge.gradle.common.util.runs.RunConfigGenerator.getResolvedClasspath(RunConfigGenerator.java:233)
    at net.minecraftforge.gradle.common.util.runs.RunConfigGenerator.createRuntimeClassPathList(RunConfigGenerator.java:241)
    at net.minecraftforge.gradle.common.util.runs.RunConfigGenerator.configureTokensLazy(RunConfigGenerator.java:199)
    at net.minecraftforge.gradle.common.util.runs.RunConfigGenerator.createRunTask(RunConfigGenerator.java:256)
    at net.minecraftforge.gradle.common.util.runs.RunConfigGenerator.createRunTask(RunConfigGenerator.java:229)
    at net.minecraftforge.gradle.common.util.Utils.lambda$null$10(Utils.java:409)
    at net.minecraftforge.gradle.common.util.Utils.lambda$createRunConfigTasks$11(Utils.java:409)
    at org.gradle.configuration.internal.DefaultUserCodeApplicationContext$CurrentApplication$1.execute(DefaultUserCodeApplicationContext.java:123)
    at org.gradle.configuration.internal.DefaultListenerBuildOperationDecorator$BuildOperationEmittingAction$1.run(DefaultListenerBuildOperationDecorator.java:152)
    at org.gradle.internal.operations.DefaultBuildOperationRunner$1.execute(DefaultBuildOperationRunner.java:29)
    at org.gradle.internal.operations.DefaultBuildOperationRunner$1.execute(DefaultBuildOperationRunner.java:26)
    at org.gradle.internal.operations.DefaultBuildOperationRunner$2.execute(DefaultBuildOperationRunner.java:66)
    at org.gradle.internal.operations.DefaultBuildOperationRunner$2.execute(DefaultBuildOperationRunner.java:59)
    at org.gradle.internal.operations.DefaultBuildOperationRunner.execute(DefaultBuildOperationRunner.java:157)
    at org.gradle.internal.operations.DefaultBuildOperationRunner.execute(DefaultBuildOperationRunner.java:59)
    at org.gradle.internal.operations.DefaultBuildOperationRunner.run(DefaultBuildOperationRunner.java:47)
    at org.gradle.internal.operations.DefaultBuildOperationExecutor.run(DefaultBuildOperationExecutor.java:68)
    at org.gradle.configuration.internal.DefaultListenerBuildOperationDecorator$BuildOperationEmittingAction.execute(DefaultListenerBuildOperationDecorator.java:149)
    at org.gradle.internal.event.BroadcastDispatch$ActionInvocationHandler.dispatch(BroadcastDispatch.java:95)
    at org.gradle.internal.event.BroadcastDispatch$ActionInvocationHandler.dispatch(BroadcastDispatch.java:83)
    at org.gradle.internal.event.AbstractBroadcastDispatch.dispatch(AbstractBroadcastDispatch.java:43)
    at org.gradle.internal.event.BroadcastDispatch$SingletonDispatch.dispatch(BroadcastDispatch.java:245)
    at org.gradle.internal.event.BroadcastDispatch$SingletonDispatch.dispatch(BroadcastDispatch.java:157)
    at org.gradle.internal.event.AbstractBroadcastDispatch.dispatch(AbstractBroadcastDispatch.java:61)
    at org.gradle.internal.event.BroadcastDispatch$CompositeDispatch.dispatch(BroadcastDispatch.java:346)
    at org.gradle.internal.event.BroadcastDispatch$CompositeDispatch.dispatch(BroadcastDispatch.java:249)
    at org.gradle.internal.event.ListenerBroadcast.dispatch(ListenerBroadcast.java:141)
    at org.gradle.internal.event.ListenerBroadcast.dispatch(ListenerBroadcast.java:37)
    at org.gradle.internal.dispatch.ProxyDispatchAdapter$DispatchingInvocationHandler.invoke(ProxyDispatchAdapter.java:94)
    at jdk.proxy1/jdk.proxy1.$Proxy27.projectsEvaluated(Unknown Source)
    at org.gradle.initialization.ProjectsEvaluatedNotifier$NotifyProjectsEvaluatedListeners.run(ProjectsEvaluatedNotifier.java:47)
    at org.gradle.internal.operations.DefaultBuildOperationRunner$1.execute(DefaultBuildOperationRunner.java:29)
    at org.gradle.internal.operations.DefaultBuildOperationRunner$1.execute(DefaultBuildOperationRunner.java:26)
    at org.gradle.internal.operations.DefaultBuildOperationRunner$2.execute(DefaultBuildOperationRunner.java:66)
    at org.gradle.internal.operations.DefaultBuildOperationRunner$2.execute(DefaultBuildOperationRunner.java:59)
    at org.gradle.internal.operations.DefaultBuildOperationRunner.execute(DefaultBuildOperationRunner.java:157)
    at org.gradle.internal.operations.DefaultBuildOperationRunner.execute(DefaultBuildOperationRunner.java:59)
    at org.gradle.internal.operations.DefaultBuildOperationRunner.run(DefaultBuildOperationRunner.java:47)
    at org.gradle.internal.operations.DefaultBuildOperationExecutor.run(DefaultBuildOperationExecutor.java:68)
    at org.gradle.initialization.ProjectsEvaluatedNotifier.notify(ProjectsEvaluatedNotifier.java:35)
    at org.gradle.configuration.DefaultProjectsPreparer.prepareProjects(DefaultProjectsPreparer.java:49)
    at org.gradle.configuration.BuildTreePreparingProjectsPreparer.prepareProjects(BuildTreePreparingProjectsPreparer.java:64)
    at org.gradle.configuration.BuildOperationFiringProjectsPreparer$ConfigureBuild.run(BuildOperationFiringProjectsPreparer.java:52)
    at org.gradle.internal.operations.DefaultBuildOperationRunner$1.execute(DefaultBuildOperationRunner.java:29)
    at org.gradle.internal.operations.DefaultBuildOperationRunner$1.execute(DefaultBuildOperationRunner.java:26)
    at org.gradle.internal.operations.DefaultBuildOperationRunner$2.execute(DefaultBuildOperationRunner.java:66)
    at org.gradle.internal.operations.DefaultBuildOperationRunner$2.execute(DefaultBuildOperationRunner.java:59)
    at org.gradle.internal.operations.DefaultBuildOperationRunner.execute(DefaultBuildOperationRunner.java:157)
    at org.gradle.internal.operations.DefaultBuildOperationRunner.execute(DefaultBuildOperationRunner.java:59)
    at org.gradle.internal.operations.DefaultBuildOperationRunner.run(DefaultBuildOperationRunner.java:47)
    at org.gradle.internal.operations.DefaultBuildOperationExecutor.run(DefaultBuildOperationExecutor.java:68)
    at org.gradle.configuration.BuildOperationFiringProjectsPreparer.prepareProjects(BuildOperationFiringProjectsPreparer.java:40)
    at org.gradle.initialization.VintageBuildModelController.lambda$prepareProjects$1(VintageBuildModelController.java:93)
    at org.gradle.internal.build.StateTransitionController.lambda$doTransition$1(StateTransitionController.java:222)
    at org.gradle.internal.build.StateTransitionController.doTransition(StateTransitionController.java:243)
    at org.gradle.internal.build.StateTransitionController.doTransition(StateTransitionController.java:221)
    at org.gradle.internal.build.StateTransitionController.transitionIfNotPreviously(StateTransitionController.java:190)
    at org.gradle.initialization.VintageBuildModelController.prepareProjects(VintageBuildModelController.java:93)
    at org.gradle.initialization.VintageBuildModelController.doBuildStages(VintageBuildModelController.java:77)
    at org.gradle.initialization.VintageBuildModelController.getConfiguredModel(VintageBuildModelController.java:58)
    at org.gradle.internal.build.StateTransitionController.notInStateIgnoreOtherThreads(StateTransitionController.java:89)
    at org.gradle.internal.build.DefaultBuildLifecycleController.getConfiguredBuild(DefaultBuildLifecycleController.java:98)
    at org.gradle.internal.build.AbstractBuildState.ensureProjectsConfigured(AbstractBuildState.java:65)
    at org.gradle.internal.buildtree.DefaultBuildTreeModelCreator$DefaultBuildToolingModelController.locateBuilderForTarget(DefaultBuildTreeModelCreator.java:90)
    at org.gradle.internal.buildtree.DefaultBuildTreeModelCreator$DefaultBuildToolingModelController.locateBuilderForDefaultTarget(DefaultBuildTreeModelCreator.java:82)
    at org.gradle.tooling.internal.provider.runner.DefaultBuildController$DefaultTargetModel.locate(DefaultBuildController.java:239)
    at org.gradle.tooling.internal.provider.runner.DefaultBuildController.getToolingModelBuilder(DefaultBuildController.java:184)
    at org.gradle.tooling.internal.provider.runner.DefaultBuildController.getModel(DefaultBuildController.java:98)
    at org.gradle.tooling.internal.consumer.connection.ParameterAwareBuildControllerAdapter.getModel(ParameterAwareBuildControllerAdapter.java:39)
    at org.gradle.tooling.internal.consumer.connection.UnparameterizedBuildController.getModel(UnparameterizedBuildController.java:113)
    at org.gradle.tooling.internal.consumer.connection.NestedActionAwareBuildControllerAdapter.getModel(NestedActionAwareBuildControllerAdapter.java:31)
    at org.gradle.tooling.internal.consumer.connection.UnparameterizedBuildController.findModel(UnparameterizedBuildController.java:97)
    at org.gradle.tooling.internal.consumer.connection.NestedActionAwareBuildControllerAdapter.findModel(NestedActionAwareBuildControllerAdapter.java:31)
    at org.gradle.tooling.internal.consumer.connection.UnparameterizedBuildController.findModel(UnparameterizedBuildController.java:81)
    at org.gradle.tooling.internal.consumer.connection.NestedActionAwareBuildControllerAdapter.findModel(NestedActionAwareBuildControllerAdapter.java:31)
    at org.gradle.tooling.internal.consumer.connection.UnparameterizedBuildController.findModel(UnparameterizedBuildController.java:66)
    at org.gradle.tooling.internal.consumer.connection.NestedActionAwareBuildControllerAdapter.findModel(NestedActionAwareBuildControllerAdapter.java:31)
    at org.jetbrains.plugins.gradle.model.ProjectImportAction.execute(ProjectImportAction.java:130)
    at org.jetbrains.plugins.gradle.model.ProjectImportAction.execute(ProjectImportAction.java:42)
    at org.gradle.tooling.internal.consumer.connection.InternalBuildActionAdapter.execute(InternalBuildActionAdapter.java:64)
    at org.gradle.tooling.internal.provider.runner.AbstractClientProvidedBuildActionRunner$ActionAdapter.runAction(AbstractClientProvidedBuildActionRunner.java:131)
    at org.gradle.tooling.internal.provider.runner.AbstractClientProvidedBuildActionRunner$ActionAdapter.beforeTasks(AbstractClientProvidedBuildActionRunner.java:99)
    at org.gradle.internal.buildtree.DefaultBuildTreeModelCreator.beforeTasks(DefaultBuildTreeModelCreator.java:57)
    at org.gradle.internal.buildtree.DefaultBuildTreeLifecycleController.lambda$fromBuildModel$1(DefaultBuildTreeLifecycleController.java:72)
    at org.gradle.internal.buildtree.DefaultBuildTreeLifecycleController.lambda$runBuild$4(DefaultBuildTreeLifecycleController.java:103)
    at org.gradle.internal.build.StateTransitionController.lambda$transition$0(StateTransitionController.java:145)
    at org.gradle.internal.build.StateTransitionController.doTransition(StateTransitionController.java:243)
    at org.gradle.internal.build.StateTransitionController.transition(StateTransitionController.java:145)
    at org.gradle.internal.buildtree.DefaultBuildTreeLifecycleController.runBuild(DefaultBuildTreeLifecycleController.java:100)
    at org.gradle.internal.buildtree.DefaultBuildTreeLifecycleController.fromBuildModel(DefaultBuildTreeLifecycleController.java:71)
    at org.gradle.tooling.internal.provider.runner.AbstractClientProvidedBuildActionRunner.runClientAction(AbstractClientProvidedBuildActionRunner.java:43)
    at org.gradle.tooling.internal.provider.runner.ClientProvidedPhasedActionRunner.run(ClientProvidedPhasedActionRunner.java:53)
    at org.gradle.launcher.exec.ChainingBuildActionRunner.run(ChainingBuildActionRunner.java:35)
    at org.gradle.internal.buildtree.ProblemReportingBuildActionRunner.run(ProblemReportingBuildActionRunner.java:49)
    at org.gradle.launcher.exec.BuildOutcomeReportingBuildActionRunner.run(BuildOutcomeReportingBuildActionRunner.java:69)
    at org.gradle.tooling.internal.provider.FileSystemWatchingBuildActionRunner.run(FileSystemWatchingBuildActionRunner.java:114)
    at org.gradle.launcher.exec.BuildCompletionNotifyingBuildActionRunner.run(BuildCompletionNotifyingBuildActionRunner.java:41)
    at org.gradle.launcher.exec.RootBuildLifecycleBuildActionExecutor.lambda$execute$0(RootBuildLifecycleBuildActionExecutor.java:40)
    at org.gradle.composite.internal.DefaultRootBuildState.run(DefaultRootBuildState.java:155)
    at org.gradle.launcher.exec.RootBuildLifecycleBuildActionExecutor.execute(RootBuildLifecycleBuildActionExecutor.java:40)
    at org.gradle.internal.buildtree.DefaultBuildTreeContext.execute(DefaultBuildTreeContext.java:40)
    at org.gradle.launcher.exec.BuildTreeLifecycleBuildActionExecutor.lambda$execute$0(BuildTreeLifecycleBuildActionExecutor.java:65)
    at org.gradle.internal.buildtree.BuildTreeState.run(BuildTreeState.java:53)
    at org.gradle.launcher.exec.BuildTreeLifecycleBuildActionExecutor.execute(BuildTreeLifecycleBuildActionExecutor.java:65)
    at org.gradle.launcher.exec.RunAsBuildOperationBuildActionExecutor$3.call(RunAsBuildOperationBuildActionExecutor.java:61)
    at org.gradle.launcher.exec.RunAsBuildOperationBuildActionExecutor$3.call(RunAsBuildOperationBuildActionExecutor.java:57)
    at org.gradle.internal.operations.DefaultBuildOperationRunner$CallableBuildOperationWorker.execute(DefaultBuildOperationRunner.java:204)
    at org.gradle.internal.operations.DefaultBuildOperationRunner$CallableBuildOperationWorker.execute(DefaultBuildOperationRunner.java:199)
    at org.gradle.internal.operations.DefaultBuildOperationRunner$2.execute(DefaultBuildOperationRunner.java:66)
    at org.gradle.internal.operations.DefaultBuildOperationRunner$2.execute(DefaultBuildOperationRunner.java:59)
    at org.gradle.internal.operations.DefaultBuildOperationRunner.execute(DefaultBuildOperationRunner.java:157)
    at org.gradle.internal.operations.DefaultBuildOperationRunner.execute(DefaultBuildOperationRunner.java:59)
    at org.gradle.internal.operations.DefaultBuildOperationRunner.call(DefaultBuildOperationRunner.java:53)
    at org.gradle.internal.operations.DefaultBuildOperationExecutor.call(DefaultBuildOperationExecutor.java:73)
    at org.gradle.launcher.exec.RunAsBuildOperationBuildActionExecutor.execute(RunAsBuildOperationBuildActionExecutor.java:57)
    at org.gradle.launcher.exec.RunAsWorkerThreadBuildActionExecutor.lambda$execute$0(RunAsWorkerThreadBuildActionExecutor.java:38)
    at org.gradle.internal.work.DefaultWorkerLeaseService.withLocks(DefaultWorkerLeaseService.java:211)
    at org.gradle.launcher.exec.RunAsWorkerThreadBuildActionExecutor.execute(RunAsWorkerThreadBuildActionExecutor.java:38)
    at org.gradle.tooling.internal.provider.ContinuousBuildActionExecutor.execute(ContinuousBuildActionExecutor.java:103)
    at org.gradle.tooling.internal.provider.SubscribableBuildActionExecutor.execute(SubscribableBuildActionExecutor.java:64)
    at org.gradle.internal.session.DefaultBuildSessionContext.execute(DefaultBuildSessionContext.java:46)
    at org.gradle.tooling.internal.provider.BuildSessionLifecycleBuildActionExecuter$ActionImpl.apply(BuildSessionLifecycleBuildActionExecuter.java:100)
    at org.gradle.tooling.internal.provider.BuildSessionLifecycleBuildActionExecuter$ActionImpl.apply(BuildSessionLifecycleBuildActionExecuter.java:88)
    at org.gradle.internal.session.BuildSessionState.run(BuildSessionState.java:69)
    at org.gradle.tooling.internal.provider.BuildSessionLifecycleBuildActionExecuter.execute(BuildSessionLifecycleBuildActionExecuter.java:62)
    at org.gradle.tooling.internal.provider.BuildSessionLifecycleBuildActionExecuter.execute(BuildSessionLifecycleBuildActionExecuter.java:41)
    at org.gradle.tooling.internal.provider.GradleThreadBuildActionExecuter.execute(GradleThreadBuildActionExecuter.java:36)
    at org.gradle.tooling.internal.provider.GradleThreadBuildActionExecuter.execute(GradleThreadBuildActionExecuter.java:25)
    at org.gradle.tooling.internal.provider.StartParamsValidatingActionExecuter.execute(StartParamsValidatingActionExecuter.java:63)
    at org.gradle.tooling.internal.provider.StartParamsValidatingActionExecuter.execute(StartParamsValidatingActionExecuter.java:31)
    at org.gradle.tooling.internal.provider.SessionFailureReportingActionExecuter.execute(SessionFailureReportingActionExecuter.java:58)
    at org.gradle.tooling.internal.provider.SessionFailureReportingActionExecuter.execute(SessionFailureReportingActionExecuter.java:42)
    at org.gradle.tooling.internal.provider.SetupLoggingActionExecuter.execute(SetupLoggingActionExecuter.java:47)
    at org.gradle.tooling.internal.provider.SetupLoggingActionExecuter.execute(SetupLoggingActionExecuter.java:31)
    at org.gradle.launcher.daemon.server.exec.ExecuteBuild.doBuild(ExecuteBuild.java:65)
    at org.gradle.launcher.daemon.server.exec.BuildCommandOnly.execute(BuildCommandOnly.java:37)
    at org.gradle.launcher.daemon.server.api.DaemonCommandExecution.proceed(DaemonCommandExecution.java:104)
    at org.gradle.launcher.daemon.server.exec.WatchForDisconnection.execute(WatchForDisconnection.java:39)
    at org.gradle.launcher.daemon.server.api.DaemonCommandExecution.proceed(DaemonCommandExecution.java:104)
    at org.gradle.launcher.daemon.server.exec.ResetDeprecationLogger.execute(ResetDeprecationLogger.java:29)
    at org.gradle.launcher.daemon.server.api.DaemonCommandExecution.proceed(DaemonCommandExecution.java:104)
    at org.gradle.launcher.daemon.server.exec.RequestStopIfSingleUsedDaemon.execute(RequestStopIfSingleUsedDaemon.java:35)
    at org.gradle.launcher.daemon.server.api.DaemonCommandExecution.proceed(DaemonCommandExecution.java:104)
    at org.gradle.launcher.daemon.server.exec.ForwardClientInput$2.create(ForwardClientInput.java:78)
    at org.gradle.launcher.daemon.server.exec.ForwardClientInput$2.create(ForwardClientInput.java:75)
    at org.gradle.util.internal.Swapper.swap(Swapper.java:38)
    at org.gradle.launcher.daemon.server.exec.ForwardClientInput.execute(ForwardClientInput.java:75)
    at org.gradle.launcher.daemon.server.api.DaemonCommandExecution.proceed(DaemonCommandExecution.java:104)
    at org.gradle.launcher.daemon.server.exec.LogAndCheckHealth.execute(LogAndCheckHealth.java:55)
    at org.gradle.launcher.daemon.server.api.DaemonCommandExecution.proceed(DaemonCommandExecution.java:104)
    at org.gradle.launcher.daemon.server.exec.LogToClient.doBuild(LogToClient.java:63)
    at org.gradle.launcher.daemon.server.exec.BuildCommandOnly.execute(BuildCommandOnly.java:37)
    at org.gradle.launcher.daemon.server.api.DaemonCommandExecution.proceed(DaemonCommandExecution.java:104)
    at org.gradle.launcher.daemon.server.exec.EstablishBuildEnvironment.doBuild(EstablishBuildEnvironment.java:84)
    at org.gradle.launcher.daemon.server.exec.BuildCommandOnly.execute(BuildCommandOnly.java:37)
    at org.gradle.launcher.daemon.server.api.DaemonCommandExecution.proceed(DaemonCommandExecution.java:104)
    at org.gradle.launcher.daemon.server.exec.StartBuildOrRespondWithBusy$1.run(StartBuildOrRespondWithBusy.java:52)
    at org.gradle.launcher.daemon.server.DaemonStateCoordinator$1.run(DaemonStateCoordinator.java:297)
    at org.gradle.internal.concurrent.ExecutorPolicy$CatchAndRecordFailures.onExecute(ExecutorPolicy.java:64)
    at org.gradle.internal.concurrent.ManagedExecutorImpl$1.run(ManagedExecutorImpl.java:48)
    at org.gradle.internal.concurrent.ThreadFactoryImpl$ManagedThreadRunnable.run(ThreadFactoryImpl.java:61)
Caused by: org.gradle.internal.resolve.ModuleVersionNotFoundException: Could not find net.minecraftforge:forge:1.16.5-36.2.34_mapped_official_1.16.5.
Searched in the following locations:
  - file:/C:/Users/User/.gradle/caches/forge_gradle/bundeled_repo/net/minecraftforge/forge/1.16.5-36.2.34_mapped_official_1.16.5/forge-1.16.5-36.2.34_mapped_official_1.16.5.pom
  - file:/C:/Users/User/.gradle/caches/forge_gradle/bundeled_repo/net/minecraftforge/forge/1.16.5-36.2.34_mapped_official_1.16.5/forge-1.16.5-36.2.34_mapped_official_1.16.5.jar
Required by:
    project :


* Get more help at https://help.gradle.org

CONFIGURE FAILED in 7m 28s

Deprecated Gradle features were used in this build, making it incompatible with Gradle 8.0.

You can use '--warning-mode all' to show the individual deprecation warnings and determine if they come from your own scripts or plugins.

See https://docs.gradle.org/7.3.3/userguide/command_line_interface.html#sec:command_line_warnings
 

What should I do?

Link to comment
Share on other sites

Guest
This topic is now closed to further replies.

Announcements



×
×
  • Create New...

Important Information

By using this site, you agree to our Terms of Use.