Jump to content

[1.7.2]Installation - recompForge error


WH-Reaper

Recommended Posts

Hello,

  I run into problem with installation of Forge using gradlew.bat. I always get recompForge error, and as suggestion that I should check if I have JDK installed and added to environment path. I have JDK installed and added to environment path correctly(launching java via command line works fine). I tried it several times, cleaned the cache, refreshed dependencies, but nothing helps. I even tried to change the path variable to point to 32bit Java instead of 64bit, but with the same result.

 

Here is error output, as obtained after using this command:

gradlew.bat setupDecompWorkspace --refresh-dependencies 2> out.txt

 

download attempt 1 failed! : e9833a1512b57bcf88ac4fdcc8df4e5a7e9d701d != da39a3ee5e6b4b0d3255bfef95601890afd80709

java.io.FileNotFoundException: C:\Users\Reaper\.gradle\caches\minecraft\assets\objects\e9\e9833a1512b57bcf88ac4fdcc8df4e5a7e9d701d (System cannot find given file)

at java.io.FileInputStream.open(Native Method)

at java.io.FileInputStream.<init>(Unknown Source)

at net.minecraftforge.gradle.common.Constants.hash(Constants.java:152)

at net.minecraftforge.gradle.tasks.DownloadAssetsTask$AssetsThread.run(DownloadAssetsTask.java:194)

download attempt 1 failed! : e9833a1512b57bcf88ac4fdcc8df4e5a7e9d701d != null

java.io.FileNotFoundException: C:\Users\Reaper\.gradle\caches\minecraft\assets\objects\e9\e9833a1512b57bcf88ac4fdcc8df4e5a7e9d701d (System cannot find given file)

at java.io.FileInputStream.open(Native Method)

at java.io.FileInputStream.<init>(Unknown Source)

at net.minecraftforge.gradle.common.Constants.hash(Constants.java:152)

at net.minecraftforge.gradle.tasks.DownloadAssetsTask$AssetsThread.run(DownloadAssetsTask.java:194)

download attempt 2 failed! : e9833a1512b57bcf88ac4fdcc8df4e5a7e9d701d != null

 

FAILURE: Build failed with an exception.

 

* What went wrong:

Execution failed for task ':recompForge'.

> Cannot find System Java Compiler. Ensure that you have installed a JDK (not just a JRE) and configured your JAVA_HOME system variable to point to the according directory.

 

* Try:

Run with --info or --debug option to get more log output.

 

* Exception is:

org.gradle.api.tasks.TaskExecutionException: Execution failed for task ':recompForge'.

at org.gradle.api.internal.tasks.execution.ExecuteActionsTaskExecuter.executeActions(ExecuteActionsTaskExecuter.java:69)

at org.gradle.api.internal.tasks.execution.ExecuteActionsTaskExecuter.execute(ExecuteActionsTaskExecuter.java:46)

at org.gradle.api.internal.tasks.execution.PostExecutionAnalysisTaskExecuter.execute(PostExecutionAnalysisTaskExecuter.java:35)

at org.gradle.api.internal.tasks.execution.SkipUpToDateTaskExecuter.execute(SkipUpToDateTaskExecuter.java:64)

at org.gradle.api.internal.tasks.execution.ValidatingTaskExecuter.execute(ValidatingTaskExecuter.java:58)

at org.gradle.api.internal.tasks.execution.SkipEmptySourceFilesTaskExecuter.execute(SkipEmptySourceFilesTaskExecuter.java:42)

at org.gradle.api.internal.tasks.execution.SkipTaskWithNoActionsExecuter.execute(SkipTaskWithNoActionsExecuter.java:52)

at org.gradle.api.internal.tasks.execution.SkipOnlyIfTaskExecuter.execute(SkipOnlyIfTaskExecuter.java:53)

at org.gradle.api.internal.tasks.execution.ExecuteAtMostOnceTaskExecuter.execute(ExecuteAtMostOnceTaskExecuter.java:43)

at org.gradle.api.internal.AbstractTask.executeWithoutThrowingTaskFailure(AbstractTask.java:289)

at org.gradle.execution.taskgraph.AbstractTaskPlanExecutor$TaskExecutorWorker.executeTask(AbstractTaskPlanExecutor.java:79)

at org.gradle.execution.taskgraph.AbstractTaskPlanExecutor$TaskExecutorWorker.processTask(AbstractTaskPlanExecutor.java:63)

at org.gradle.execution.taskgraph.AbstractTaskPlanExecutor$TaskExecutorWorker.run(AbstractTaskPlanExecutor.java:51)

at org.gradle.execution.taskgraph.DefaultTaskPlanExecutor$1.run(DefaultTaskPlanExecutor.java:33)

at org.gradle.internal.Factories$1.create(Factories.java:22)

at org.gradle.cache.internal.DefaultCacheAccess.longRunningOperation(DefaultCacheAccess.java:198)

at org.gradle.cache.internal.DefaultCacheAccess.longRunningOperation(DefaultCacheAccess.java:266)

at org.gradle.cache.internal.DefaultPersistentDirectoryStore.longRunningOperation(DefaultPersistentDirectoryStore.java:135)

at org.gradle.api.internal.changedetection.state.DefaultTaskArtifactStateCacheAccess.longRunningOperation(DefaultTaskArtifactStateCacheAccess.java:95)

at org.gradle.execution.taskgraph.DefaultTaskPlanExecutor.process(DefaultTaskPlanExecutor.java:31)

at org.gradle.execution.taskgraph.DefaultTaskGraphExecuter.execute(DefaultTaskGraphExecuter.java:86)

at org.gradle.execution.SelectedTaskExecutionAction.execute(SelectedTaskExecutionAction.java:29)

at org.gradle.execution.DefaultBuildExecuter.execute(DefaultBuildExecuter.java:61)

at org.gradle.execution.DefaultBuildExecuter.access$200(DefaultBuildExecuter.java:23)

at org.gradle.execution.DefaultBuildExecuter$2.proceed(DefaultBuildExecuter.java:67)

at org.gradle.execution.DryRunBuildExecutionAction.execute(DryRunBuildExecutionAction.java:32)

at org.gradle.execution.DefaultBuildExecuter.execute(DefaultBuildExecuter.java:61)

at org.gradle.execution.DefaultBuildExecuter.execute(DefaultBuildExecuter.java:54)

at org.gradle.initialization.DefaultGradleLauncher.doBuildStages(DefaultGradleLauncher.java:166)

at org.gradle.initialization.DefaultGradleLauncher.doBuild(DefaultGradleLauncher.java:113)

at org.gradle.initialization.DefaultGradleLauncher.run(DefaultGradleLauncher.java:81)

at org.gradle.launcher.exec.InProcessBuildActionExecuter$DefaultBuildController.run(InProcessBuildActionExecuter.java:64)

at org.gradle.launcher.cli.ExecuteBuildAction.run(ExecuteBuildAction.java:33)

at org.gradle.launcher.cli.ExecuteBuildAction.run(ExecuteBuildAction.java:24)

at org.gradle.launcher.exec.InProcessBuildActionExecuter.execute(InProcessBuildActionExecuter.java:35)

at org.gradle.launcher.exec.InProcessBuildActionExecuter.execute(InProcessBuildActionExecuter.java:26)

at org.gradle.launcher.cli.RunBuildAction.run(RunBuildAction.java:50)

at org.gradle.internal.Actions$RunnableActionAdapter.execute(Actions.java:171)

at org.gradle.launcher.cli.CommandLineActionFactory$ParseAndBuildAction.execute(CommandLineActionFactory.java:201)

at org.gradle.launcher.cli.CommandLineActionFactory$ParseAndBuildAction.execute(CommandLineActionFactory.java:174)

at org.gradle.launcher.cli.CommandLineActionFactory$WithLogging.execute(CommandLineActionFactory.java:170)

at org.gradle.launcher.cli.CommandLineActionFactory$WithLogging.execute(CommandLineActionFactory.java:139)

at org.gradle.launcher.cli.ExceptionReportingAction.execute(ExceptionReportingAction.java:33)

at org.gradle.launcher.cli.ExceptionReportingAction.execute(ExceptionReportingAction.java:22)

at org.gradle.launcher.Main.doAction(Main.java:46)

at org.gradle.launcher.bootstrap.EntryPoint.run(EntryPoint.java:45)

at org.gradle.launcher.Main.main(Main.java:37)

at org.gradle.launcher.bootstrap.ProcessBootstrap.runNoExit(ProcessBootstrap.java:50)

at org.gradle.launcher.bootstrap.ProcessBootstrap.run(ProcessBootstrap.java:32)

at org.gradle.launcher.GradleMain.main(GradleMain.java:23)

at org.gradle.wrapper.BootstrapMainStarter.start(BootstrapMainStarter.java:30)

at org.gradle.wrapper.WrapperExecutor.execute(WrapperExecutor.java:127)

at org.gradle.wrapper.GradleWrapperMain.main(GradleWrapperMain.java:58)

Caused by: java.lang.RuntimeException: Cannot find System Java Compiler. Ensure that you have installed a JDK (not just a JRE) and configured your JAVA_HOME system variable to point to the according directory.

at org.gradle.api.internal.tasks.compile.jdk6.Jdk6JavaCompiler.createCompileTask(Jdk6JavaCompiler.java:57)

at org.gradle.api.internal.tasks.compile.jdk6.Jdk6JavaCompiler.execute(Jdk6JavaCompiler.java:44)

at org.gradle.api.internal.tasks.compile.jdk6.Jdk6JavaCompiler.execute(Jdk6JavaCompiler.java:38)

at org.gradle.api.internal.tasks.compile.NormalizingJavaCompiler.delegateAndHandleErrors(NormalizingJavaCompiler.java:96)

at org.gradle.api.internal.tasks.compile.NormalizingJavaCompiler.execute(NormalizingJavaCompiler.java:49)

at org.gradle.api.internal.tasks.compile.NormalizingJavaCompiler.execute(NormalizingJavaCompiler.java:35)

at org.gradle.api.internal.tasks.compile.DelegatingJavaCompiler.execute(DelegatingJavaCompiler.java:29)

at org.gradle.api.internal.tasks.compile.DelegatingJavaCompiler.execute(DelegatingJavaCompiler.java:20)

at org.gradle.api.internal.tasks.compile.IncrementalJavaCompilerSupport.execute(IncrementalJavaCompilerSupport.java:33)

at org.gradle.api.internal.tasks.compile.IncrementalJavaCompilerSupport.execute(IncrementalJavaCompilerSupport.java:24)

at org.gradle.api.tasks.compile.Compile.compile(Compile.java:67)

at org.gradle.internal.reflect.JavaMethod.invoke(JavaMethod.java:63)

at org.gradle.api.internal.project.taskfactory.AnnotationProcessingTaskFactory$StandardTaskAction.doExecute(AnnotationProcessingTaskFactory.java:219)

at org.gradle.api.internal.project.taskfactory.AnnotationProcessingTaskFactory$StandardTaskAction.execute(AnnotationProcessingTaskFactory.java:212)

at org.gradle.api.internal.project.taskfactory.AnnotationProcessingTaskFactory$StandardTaskAction.execute(AnnotationProcessingTaskFactory.java:201)

at org.gradle.api.internal.AbstractTask$TaskActionWrapper.execute(AbstractTask.java:533)

at org.gradle.api.internal.AbstractTask$TaskActionWrapper.execute(AbstractTask.java:516)

at org.gradle.api.internal.tasks.execution.ExecuteActionsTaskExecuter.executeAction(ExecuteActionsTaskExecuter.java:80)

at org.gradle.api.internal.tasks.execution.ExecuteActionsTaskExecuter.executeActions(ExecuteActionsTaskExecuter.java:61)

... 52 more

 

 

 

 

Thanks in advance for any help :)

Sorry for mistakes, English is not my mother tongue

Link to comment
Share on other sites

Join the conversation

You can post now and register later. If you have an account, sign in now to post with your account.
Note: Your post will require moderator approval before it will be visible.

Guest
Unfortunately, your content contains terms that we do not allow. Please edit your content to remove the highlighted words below.
Reply to this topic...

×   Pasted as rich text.   Restore formatting

  Only 75 emoji are allowed.

×   Your link has been automatically embedded.   Display as a link instead

×   Your previous content has been restored.   Clear editor

×   You cannot paste images directly. Upload or insert images from URL.



×
×
  • Create New...

Important Information

By using this site, you agree to our Terms of Use.