Jump to content

gradlew build failing?


EscapeMC

Recommended Posts

Ok, I know I just posted something, but I am now trying to get a built version of my mod. I have done ./gradlew build (I use a mac) after cd (mod location), and I have done this many times before. But for some reason I get this error in terminal:

Roberts-Macbook-Pro:TeamMadness Mod 1.8 school$ ./gradlew build

FAILURE: Build failed with an exception.

* Where:
Build file '/Users/school/Extras/TeamMadness Mod 1.8/build.gradle' line: 20

* What went wrong:
An exception occurred applying plugin request [id: 'net.minecraftforge.gradle.forge', version: '2.0.2']
> Failed to apply plugin [id 'net.minecraftforge.gradle.forge']
   > java.lang.IllegalStateException: Expected BEGIN_OBJECT but was STRING at line 1 column 1

* Try:
Run with --stacktrace option to get the stack trace. Run with --info or --debug option to get more log output.

BUILD FAILED

Total time: 2.802 secs

 

What might this be? Please note, I am also on school wifi that has sites blocked. Might that be the cause of this problem.

I Love To Help People. Unless They Are The Kind Of People Who Just Doesn't Know Anything. Those People Need Some Serious Help. This Could Help But......

https://www.youtube.com/watch?v=6t0GlXWx_PY

 

ThingsMod Git: https://github.com/EscapeMC/Things-Mod-1.10.2

 

TeamMadness Mod Git: https://github.com/EscapeMC/TeamMadness-Mod-1.10.2

 

If I somehow help you, please click the "Thank You" button. If I am a total waste of time, please click the "Applaud" button.

Link to comment
Share on other sites

Roberts-Macbook-Pro:TeamMadness Mod 1.8 school$ ./gradlew build --stacktrace

FAILURE: Build failed with an exception.

* Where:
Build file '/Users/school/Extras/TeamMadness Mod 1.8/build.gradle' line: 20

* What went wrong:
An exception occurred applying plugin request [id: 'net.minecraftforge.gradle.forge', version: '2.0.2']
> Failed to apply plugin [id 'net.minecraftforge.gradle.forge']
   > java.lang.IllegalStateException: Expected BEGIN_OBJECT but was STRING at line 1 column 1

* Try:
Run with --info or --debug option to get more log output.

* Exception is:
org.gradle.api.plugins.InvalidPluginException: An exception occurred applying plugin request [id: 'net.minecraftforge.gradle.forge', version: '2.0.2']
at org.gradle.plugin.use.internal.DefaultPluginRequestApplicator.applyPlugin(DefaultPluginRequestApplicator.java:166)
at org.gradle.plugin.use.internal.DefaultPluginRequestApplicator.applyPlugins(DefaultPluginRequestApplicator.java:123)
at org.gradle.configuration.DefaultScriptPluginFactory$ScriptPluginImpl.apply(DefaultScriptPluginFactory.java:127)
at org.gradle.configuration.project.BuildScriptProcessor.execute(BuildScriptProcessor.java:38)
at org.gradle.configuration.project.BuildScriptProcessor.execute(BuildScriptProcessor.java:25)
at org.gradle.configuration.project.ConfigureActionsProjectEvaluator.evaluate(ConfigureActionsProjectEvaluator.java:34)
at org.gradle.configuration.project.LifecycleProjectEvaluator.evaluate(LifecycleProjectEvaluator.java:55)
at org.gradle.api.internal.project.AbstractProject.evaluate(AbstractProject.java:491)
at org.gradle.api.internal.project.AbstractProject.evaluate(AbstractProject.java:89)
at org.gradle.execution.TaskPathProjectEvaluator.configureHierarchy(TaskPathProjectEvaluator.java:42)
at org.gradle.configuration.DefaultBuildConfigurer.configure(DefaultBuildConfigurer.java:35)
at org.gradle.initialization.DefaultGradleLauncher$2.run(DefaultGradleLauncher.java:126)
at org.gradle.internal.Factories$1.create(Factories.java:22)
at org.gradle.internal.progress.DefaultBuildOperationExecutor.run(DefaultBuildOperationExecutor.java:90)
at org.gradle.internal.progress.DefaultBuildOperationExecutor.run(DefaultBuildOperationExecutor.java:52)
at org.gradle.initialization.DefaultGradleLauncher.doBuildStages(DefaultGradleLauncher.java:123)
at org.gradle.initialization.DefaultGradleLauncher.access$200(DefaultGradleLauncher.java:33)
at org.gradle.initialization.DefaultGradleLauncher$1.create(DefaultGradleLauncher.java:100)
at org.gradle.initialization.DefaultGradleLauncher$1.create(DefaultGradleLauncher.java:94)
at org.gradle.internal.progress.DefaultBuildOperationExecutor.run(DefaultBuildOperationExecutor.java:90)
at org.gradle.internal.progress.DefaultBuildOperationExecutor.run(DefaultBuildOperationExecutor.java:62)
at org.gradle.initialization.DefaultGradleLauncher.doBuild(DefaultGradleLauncher.java:94)
at org.gradle.initialization.DefaultGradleLauncher.run(DefaultGradleLauncher.java:83)
at org.gradle.launcher.exec.InProcessBuildActionExecuter$DefaultBuildController.run(InProcessBuildActionExecuter.java:94)
at org.gradle.tooling.internal.provider.ExecuteBuildActionRunner.run(ExecuteBuildActionRunner.java:28)
at org.gradle.launcher.exec.ChainingBuildActionRunner.run(ChainingBuildActionRunner.java:35)
at org.gradle.launcher.exec.InProcessBuildActionExecuter.execute(InProcessBuildActionExecuter.java:43)
at org.gradle.launcher.exec.InProcessBuildActionExecuter.execute(InProcessBuildActionExecuter.java:28)
at org.gradle.launcher.exec.ContinuousBuildActionExecuter.execute(ContinuousBuildActionExecuter.java:77)
at org.gradle.launcher.exec.ContinuousBuildActionExecuter.execute(ContinuousBuildActionExecuter.java:47)
at org.gradle.launcher.exec.DaemonUsageSuggestingBuildActionExecuter.execute(DaemonUsageSuggestingBuildActionExecuter.java:51)
at org.gradle.launcher.exec.DaemonUsageSuggestingBuildActionExecuter.execute(DaemonUsageSuggestingBuildActionExecuter.java:28)
at org.gradle.launcher.cli.RunBuildAction.run(RunBuildAction.java:43)
at org.gradle.internal.Actions$RunnableActionAdapter.execute(Actions.java:170)
at org.gradle.launcher.cli.CommandLineActionFactory$ParseAndBuildAction.execute(CommandLineActionFactory.java:237)
at org.gradle.launcher.cli.CommandLineActionFactory$ParseAndBuildAction.execute(CommandLineActionFactory.java:210)
at org.gradle.launcher.cli.JavaRuntimeValidationAction.execute(JavaRuntimeValidationAction.java:35)
at org.gradle.launcher.cli.JavaRuntimeValidationAction.execute(JavaRuntimeValidationAction.java:24)
at org.gradle.launcher.cli.CommandLineActionFactory$WithLogging.execute(CommandLineActionFactory.java:206)
at org.gradle.launcher.cli.CommandLineActionFactory$WithLogging.execute(CommandLineActionFactory.java:169)
at org.gradle.launcher.cli.ExceptionReportingAction.execute(ExceptionReportingAction.java:33)
at org.gradle.launcher.cli.ExceptionReportingAction.execute(ExceptionReportingAction.java:22)
at org.gradle.launcher.Main.doAction(Main.java:33)
at org.gradle.launcher.bootstrap.EntryPoint.run(EntryPoint.java:45)
at org.gradle.launcher.bootstrap.ProcessBootstrap.runNoExit(ProcessBootstrap.java:54)
at org.gradle.launcher.bootstrap.ProcessBootstrap.run(ProcessBootstrap.java:35)
at org.gradle.launcher.GradleMain.main(GradleMain.java:23)
at org.gradle.wrapper.BootstrapMainStarter.start(BootstrapMainStarter.java:30)
at org.gradle.wrapper.WrapperExecutor.execute(WrapperExecutor.java:127)
at org.gradle.wrapper.GradleWrapperMain.main(GradleWrapperMain.java:61)
Caused by: org.gradle.api.internal.plugins.PluginApplicationException: Failed to apply plugin [id 'net.minecraftforge.gradle.forge']
at org.gradle.api.internal.plugins.DefaultPluginManager.doApply(DefaultPluginManager.java:160)
at org.gradle.api.internal.plugins.DefaultPluginManager.apply(DefaultPluginManager.java:112)
at org.gradle.plugin.use.internal.DefaultPluginRequestApplicator$5.run(DefaultPluginRequestApplicator.java:125)
at org.gradle.plugin.use.internal.DefaultPluginRequestApplicator.applyPlugin(DefaultPluginRequestApplicator.java:154)
... 49 more
Caused by: com.google.gson.JsonSyntaxException: java.lang.IllegalStateException: Expected BEGIN_OBJECT but was STRING at line 1 column 1
at com.google.gson.Gson.fromJson(Gson.java:815)
at com.google.gson.Gson.fromJson(Gson.java:768)
at com.google.gson.Gson.fromJson(Gson.java:717)
at net.minecraftforge.gradle.common.BasePlugin.setVersionInfoJson(BasePlugin.java:202)
at net.minecraftforge.gradle.common.BasePlugin.apply(BasePlugin.java:165)
at net.minecraftforge.gradle.common.BasePlugin.apply(BasePlugin.java:85)
at org.gradle.api.internal.plugins.ImperativeOnlyPluginApplicator.applyImperative(ImperativeOnlyPluginApplicator.java:35)
at org.gradle.api.internal.plugins.RuleBasedPluginApplicator.applyImperative(RuleBasedPluginApplicator.java:43)
at org.gradle.api.internal.plugins.DefaultPluginManager.doApply(DefaultPluginManager.java:144)
... 52 more
Caused by: java.lang.IllegalStateException: Expected BEGIN_OBJECT but was STRING at line 1 column 1
at com.google.gson.stream.JsonReader.beginObject(JsonReader.java:374)
at com.google.gson.internal.bind.MapTypeAdapterFactory$Adapter.read(MapTypeAdapterFactory.java:183)
at com.google.gson.internal.bind.MapTypeAdapterFactory$Adapter.read(MapTypeAdapterFactory.java:145)
at com.google.gson.Gson.fromJson(Gson.java:803)
... 60 more


BUILD FAILED

Total time: 3.603 secs

 

there

I Love To Help People. Unless They Are The Kind Of People Who Just Doesn't Know Anything. Those People Need Some Serious Help. This Could Help But......

https://www.youtube.com/watch?v=6t0GlXWx_PY

 

ThingsMod Git: https://github.com/EscapeMC/Things-Mod-1.10.2

 

TeamMadness Mod Git: https://github.com/EscapeMC/TeamMadness-Mod-1.10.2

 

If I somehow help you, please click the "Thank You" button. If I am a total waste of time, please click the "Applaud" button.

Link to comment
Share on other sites

It seems like indeed your network is blocking ForgeGradle from accessing the forge server.

 

Ok, thank you for telling me this.

I will run the build later at my house.

Thanks!

I Love To Help People. Unless They Are The Kind Of People Who Just Doesn't Know Anything. Those People Need Some Serious Help. This Could Help But......

https://www.youtube.com/watch?v=6t0GlXWx_PY

 

ThingsMod Git: https://github.com/EscapeMC/Things-Mod-1.10.2

 

TeamMadness Mod Git: https://github.com/EscapeMC/TeamMadness-Mod-1.10.2

 

If I somehow help you, please click the "Thank You" button. If I am a total waste of time, please click the "Applaud" button.

Link to comment
Share on other sites

Join the conversation

You can post now and register later. If you have an account, sign in now to post with your account.
Note: Your post will require moderator approval before it will be visible.

Guest
Unfortunately, your content contains terms that we do not allow. Please edit your content to remove the highlighted words below.
Reply to this topic...

×   Pasted as rich text.   Restore formatting

  Only 75 emoji are allowed.

×   Your link has been automatically embedded.   Display as a link instead

×   Your previous content has been restored.   Clear editor

×   You cannot paste images directly. Upload or insert images from URL.



×
×
  • Create New...

Important Information

By using this site, you agree to our Terms of Use.