Jump to content
Search In
  • More options...
Find results that contain...
Find results in...

Invalid patcher dependency: de.oceanlabs.mcp:mcp_config:1.15.2-20200515.085601@zip


Recommended Posts

When running this in the terminal in IntelliJ IDEA:

gradlew genIntellijRuns --stacktrace --debug --scan

 

I get this error. Please can someone help me with this issue as I am a novice when it comes to modding and if more information is needed please tell me as I'm happy to give more.

Sorry if this problem is trivial and simple to solve, I am just inexperienced.
 

15:47:01.448 [ERROR] [org.gradle.internal.buildevents.BuildExceptionReporter]
15:47:01.450 [ERROR] [org.gradle.internal.buildevents.BuildExceptionReporter] FAILURE: Build failed with an exception.
15:47:01.450 [ERROR] [org.gradle.internal.buildevents.BuildExceptionReporter]
15:47:01.451 [ERROR] [org.gradle.internal.buildevents.BuildExceptionReporter] * What went wrong:
15:47:01.452 [ERROR] [org.gradle.internal.buildevents.BuildExceptionReporter] A problem occurred configuring root project 'TutorialMod'.
15:47:01.453 [ERROR] [org.gradle.internal.buildevents.BuildExceptionReporter] > Invalid patcher dependency: de.oceanlabs.mcp:mcp_config:1.15.2-20200515.085601@zip
15:47:01.454 [ERROR] [org.gradle.internal.buildevents.BuildExceptionReporter]
15:47:01.454 [ERROR] [org.gradle.internal.buildevents.BuildExceptionReporter] * Try:
15:47:01.454 [ERROR] [org.gradle.internal.buildevents.BuildExceptionReporter]  Run with --scan to get full insights.
15:47:01.455 [ERROR] [org.gradle.internal.buildevents.BuildExceptionReporter]
15:47:01.456 [ERROR] [org.gradle.internal.buildevents.BuildExceptionReporter] * Exception is:
15:47:01.461 [ERROR] [org.gradle.internal.buildevents.BuildExceptionReporter] org.gradle.api.ProjectConfigurationException: A problem occurred configuring root project 'TutorialMod'.
15:47:01.461 [ERROR] [org.gradle.internal.buildevents.BuildExceptionReporter]   at org.gradle.configuration.project.LifecycleProjectEvaluator.wrapException(LifecycleProjectEvaluator.java:79)
15:47:01.462 [ERROR] [org.gradle.internal.buildevents.BuildExceptionReporter]   at org.gradle.configuration.project.LifecycleProjectEvaluator.addConfigurationFailure(LifecycleProjectEvaluator.java:73)
15:47:01.462 [ERROR] [org.gradle.internal.buildevents.BuildExceptionReporter]   at org.gradle.configuration.project.LifecycleProjectEvaluator.access$400(LifecycleProjectEvaluator.java:54)
15:47:01.462 [ERROR] [org.gradle.internal.buildevents.BuildExceptionReporter]   at org.gradle.configuration.project.LifecycleProjectEvaluator$NotifyAfterEvaluate.run(LifecycleProjectEvaluator.java:200)
15:47:01.462 [ERROR] [org.gradle.internal.buildevents.BuildExceptionReporter]   at org.gradle.internal.operations.DefaultBuildOperationExecutor$RunnableBuildOperationWorker.execute(DefaultBuildOperationExecutor.java:301)
15:47:01.463 [ERROR] [org.gradle.internal.buildevents.BuildExceptionReporter]   at org.gradle.internal.operations.DefaultBuildOperationExecutor$RunnableBuildOperationWorker.execute(DefaultBuildOperationExecutor.java:293)
15:47:01.463 [ERROR] [org.gradle.internal.buildevents.BuildExceptionReporter]   at org.gradle.internal.operations.DefaultBuildOperationExecutor.execute(DefaultBuildOperationExecutor.java:175)
15:47:01.463 [ERROR] [org.gradle.internal.buildevents.BuildExceptionReporter]   at org.gradle.internal.operations.DefaultBuildOperationExecutor.run(DefaultBuildOperationExecutor.java:91)
15:47:01.463 [ERROR] [org.gradle.internal.buildevents.BuildExceptionReporter]   at org.gradle.internal.operations.DelegatingBuildOperationExecutor.run(DelegatingBuildOperationExecutor.java:31)
15:47:01.464 [ERROR] [org.gradle.internal.buildevents.BuildExceptionReporter]   at org.gradle.configuration.project.LifecycleProjectEvaluator$EvaluateProject.run(LifecycleProjectEvaluator.java:110)
15:47:01.464 [ERROR] [org.gradle.internal.buildevents.BuildExceptionReporter]   at org.gradle.internal.operations.DefaultBuildOperationExecutor$RunnableBuildOperationWorker.execute(DefaultBuildOperationExecutor.java:301)
15:47:01.464 [ERROR] [org.gradle.internal.buildevents.BuildExceptionReporter]   at org.gradle.internal.operations.DefaultBuildOperationExecutor$RunnableBuildOperationWorker.execute(DefaultBuildOperationExecutor.java:293)
15:47:01.464 [ERROR] [org.gradle.internal.buildevents.BuildExceptionReporter]   at org.gradle.internal.operations.DefaultBuildOperationExecutor.execute(DefaultBuildOperationExecutor.java:175)
15:47:01.465 [ERROR] [org.gradle.internal.buildevents.BuildExceptionReporter]   at org.gradle.internal.operations.DefaultBuildOperationExecutor.run(DefaultBuildOperationExecutor.java:91)
15:47:01.465 [ERROR] [org.gradle.internal.buildevents.BuildExceptionReporter]   at org.gradle.internal.operations.DelegatingBuildOperationExecutor.run(DelegatingBuildOperationExecutor.java:31)
15:47:01.465 [ERROR] [org.gradle.internal.buildevents.BuildExceptionReporter]   at org.gradle.configuration.project.LifecycleProjectEvaluator.evaluate(LifecycleProjectEvaluator.java:68)
15:47:01.465 [ERROR] [org.gradle.internal.buildevents.BuildExceptionReporter]   at org.gradle.api.internal.project.DefaultProject.evaluate(DefaultProject.java:687)
15:47:01.465 [ERROR] [org.gradle.internal.buildevents.BuildExceptionReporter]   at org.gradle.api.internal.project.DefaultProject.evaluate(DefaultProject.java:140)
15:47:01.466 [ERROR] [org.gradle.internal.buildevents.BuildExceptionReporter]   at org.gradle.execution.TaskPathProjectEvaluator.configure(TaskPathProjectEvaluator.java:35)
15:47:01.466 [ERROR] [org.gradle.internal.buildevents.BuildExceptionReporter]   at org.gradle.execution.TaskPathProjectEvaluator.configureHierarchy(TaskPathProjectEvaluator.java:60)
15:47:01.466 [ERROR] [org.gradle.internal.buildevents.BuildExceptionReporter]   at org.gradle.configuration.DefaultBuildConfigurer.configure(DefaultBuildConfigurer.java:41)
15:47:01.467 [ERROR] [org.gradle.internal.buildevents.BuildExceptionReporter]   at org.gradle.initialization.DefaultGradleLauncher$ConfigureBuild.run(DefaultGradleLauncher.java:274)
15:47:01.467 [ERROR] [org.gradle.internal.buildevents.BuildExceptionReporter]   at org.gradle.internal.operations.DefaultBuildOperationExecutor$RunnableBuildOperationWorker.execute(DefaultBuildOperationExecutor.java:301)
15:47:01.467 [ERROR] [org.gradle.internal.buildevents.BuildExceptionReporter]   at org.gradle.internal.operations.DefaultBuildOperationExecutor$RunnableBuildOperationWorker.execute(DefaultBuildOperationExecutor.java:293)
15:47:01.468 [ERROR] [org.gradle.internal.buildevents.BuildExceptionReporter]   at org.gradle.internal.operations.DefaultBuildOperationExecutor.execute(DefaultBuildOperationExecutor.java:175)
15:47:01.468 [ERROR] [org.gradle.internal.buildevents.BuildExceptionReporter]   at org.gradle.internal.operations.DefaultBuildOperationExecutor.run(DefaultBuildOperationExecutor.java:91)
15:47:01.469 [ERROR] [org.gradle.internal.buildevents.BuildExceptionReporter]   at org.gradle.internal.operations.DelegatingBuildOperationExecutor.run(DelegatingBuildOperationExecutor.java:31)
15:47:01.469 [ERROR] [org.gradle.internal.buildevents.BuildExceptionReporter]   at org.gradle.initialization.DefaultGradleLauncher.configureBuild(DefaultGradleLauncher.java:182)
15:47:01.469 [ERROR] [org.gradle.internal.buildevents.BuildExceptionReporter]   at org.gradle.initialization.DefaultGradleLauncher.doBuildStages(DefaultGradleLauncher.java:141)
15:47:01.469 [ERROR] [org.gradle.internal.buildevents.BuildExceptionReporter]   at org.gradle.initialization.DefaultGradleLauncher.executeTasks(DefaultGradleLauncher.java:124)
15:47:01.470 [ERROR] [org.gradle.internal.buildevents.BuildExceptionReporter]   at org.gradle.internal.invocation.GradleBuildController$1.call(GradleBuildController.java:77)
15:47:01.472 [ERROR] [org.gradle.internal.buildevents.BuildExceptionReporter]   at org.gradle.internal.invocation.GradleBuildController$1.call(GradleBuildController.java:74)
15:47:01.473 [ERROR] [org.gradle.internal.buildevents.BuildExceptionReporter]   at org.gradle.internal.work.DefaultWorkerLeaseService.withLocks(DefaultWorkerLeaseService.java:154)
15:47:01.473 [ERROR] [org.gradle.internal.buildevents.BuildExceptionReporter]   at org.gradle.internal.work.StopShieldingWorkerLeaseService.withLocks(StopShieldingWorkerLeaseService.java:38)
15:47:01.473 [ERROR] [org.gradle.internal.buildevents.BuildExceptionReporter]   at org.gradle.internal.invocation.GradleBuildController.doBuild(GradleBuildController.java:96)
15:47:01.474 [ERROR] [org.gradle.internal.buildevents.BuildExceptionReporter]   at org.gradle.internal.invocation.GradleBuildController.run(GradleBuildController.java:74)
15:47:01.474 [ERROR] [org.gradle.internal.buildevents.BuildExceptionReporter]   at org.gradle.tooling.internal.provider.ExecuteBuildActionRunner.run(ExecuteBuildActionRunner.java:28)
15:47:01.474 [ERROR] [org.gradle.internal.buildevents.BuildExceptionReporter]   at org.gradle.launcher.exec.ChainingBuildActionRunner.run(ChainingBuildActionRunner.java:35)
15:47:01.474 [ERROR] [org.gradle.internal.buildevents.BuildExceptionReporter]   at org.gradle.tooling.internal.provider.ValidatingBuildActionRunner.run(ValidatingBuildActionRunner.java:32)
15:47:01.475 [ERROR] [org.gradle.internal.buildevents.BuildExceptionReporter]   at org.gradle.launcher.exec.RunAsBuildOperationBuildActionRunner$3.run(RunAsBuildOperationBuildActionRunner.java:50)
15:47:01.475 [ERROR] [org.gradle.internal.buildevents.BuildExceptionReporter]   at org.gradle.internal.operations.DefaultBuildOperationExecutor$RunnableBuildOperationWorker.execute(DefaultBuildOperationExecutor.java:301)
15:47:01.475 [ERROR] [org.gradle.internal.buildevents.BuildExceptionReporter]   at org.gradle.internal.operations.DefaultBuildOperationExecutor$RunnableBuildOperationWorker.execute(DefaultBuildOperationExecutor.java:293)
15:47:01.475 [ERROR] [org.gradle.internal.buildevents.BuildExceptionReporter]   at org.gradle.internal.operations.DefaultBuildOperationExecutor.execute(DefaultBuildOperationExecutor.java:175)
15:47:01.475 [ERROR] [org.gradle.internal.buildevents.BuildExceptionReporter]   at org.gradle.internal.operations.DefaultBuildOperationExecutor.run(DefaultBuildOperationExecutor.java:91)
15:47:01.476 [ERROR] [org.gradle.internal.buildevents.BuildExceptionReporter]   at org.gradle.internal.operations.DelegatingBuildOperationExecutor.run(DelegatingBuildOperationExecutor.java:31)
15:47:01.476 [ERROR] [org.gradle.internal.buildevents.BuildExceptionReporter]   at org.gradle.launcher.exec.RunAsBuildOperationBuildActionRunner.run(RunAsBuildOperationBuildActionRunner.java:45)
15:47:01.476 [ERROR] [org.gradle.internal.buildevents.BuildExceptionReporter]   at org.gradle.tooling.internal.provider.SubscribableBuildActionRunner.run(SubscribableBuildActionRunner.java:51)
15:47:01.478 [ERROR] [org.gradle.internal.buildevents.BuildExceptionReporter]   at org.gradle.launcher.exec.InProcessBuildActionExecuter$1.transform(InProcessBuildActionExecuter.java:47)
15:47:01.479 [ERROR] [org.gradle.internal.buildevents.BuildExceptionReporter]   at org.gradle.launcher.exec.InProcessBuildActionExecuter$1.transform(InProcessBuildActionExecuter.java:44)
15:47:01.479 [ERROR] [org.gradle.internal.buildevents.BuildExceptionReporter]   at org.gradle.composite.internal.DefaultRootBuildState.run(DefaultRootBuildState.java:79)
15:47:01.479 [ERROR] [org.gradle.internal.buildevents.BuildExceptionReporter]   at org.gradle.launcher.exec.InProcessBuildActionExecuter.execute(InProcessBuildActionExecuter.java:44)
15:47:01.479 [ERROR] [org.gradle.internal.buildevents.BuildExceptionReporter]   at org.gradle.launcher.exec.InProcessBuildActionExecuter.execute(InProcessBuildActionExecuter.java:30)
15:47:01.480 [ERROR] [org.gradle.internal.buildevents.BuildExceptionReporter]   at org.gradle.launcher.exec.BuildTreeScopeBuildActionExecuter.execute(BuildTreeScopeBuildActionExecuter.java:39)
15:47:01.480 [ERROR] [org.gradle.internal.buildevents.BuildExceptionReporter]   at org.gradle.launcher.exec.BuildTreeScopeBuildActionExecuter.execute(BuildTreeScopeBuildActionExecuter.java:25)
15:47:01.480 [ERROR] [org.gradle.internal.buildevents.BuildExceptionReporter]   at org.gradle.tooling.internal.provider.ContinuousBuildActionExecuter.execute(ContinuousBuildActionExecuter.java:80)
15:47:01.480 [ERROR] [org.gradle.internal.buildevents.BuildExceptionReporter]   at org.gradle.tooling.internal.provider.ContinuousBuildActionExecuter.execute(ContinuousBuildActionExecuter.java:53)
15:47:01.481 [ERROR] [org.gradle.internal.buildevents.BuildExceptionReporter]   at org.gradle.tooling.internal.provider.ServicesSetupBuildActionExecuter.execute(ServicesSetupBuildActionExecuter.java:62)
15:47:01.482 [ERROR] [org.gradle.internal.buildevents.BuildExceptionReporter]   at org.gradle.tooling.internal.provider.ServicesSetupBuildActionExecuter.execute(ServicesSetupBuildActionExecuter.java:34)
15:47:01.482 [ERROR] [org.gradle.internal.buildevents.BuildExceptionReporter]   at org.gradle.tooling.internal.provider.GradleThreadBuildActionExecuter.execute(GradleThreadBuildActionExecuter.java:36)
15:47:01.483 [ERROR] [org.gradle.internal.buildevents.BuildExceptionReporter]   at org.gradle.tooling.internal.provider.GradleThreadBuildActionExecuter.execute(GradleThreadBuildActionExecuter.java:25)
15:47:01.483 [ERROR] [org.gradle.internal.buildevents.BuildExceptionReporter]   at org.gradle.tooling.internal.provider.ParallelismConfigurationBuildActionExecuter.execute(ParallelismConfigurationBuildActionExecuter.java:43)
15:47:01.483 [ERROR] [org.gradle.internal.buildevents.BuildExceptionReporter]   at org.gradle.tooling.internal.provider.ParallelismConfigurationBuildActionExecuter.execute(ParallelismConfigurationBuildActionExecuter.java:29)
15:47:01.483 [ERROR] [org.gradle.internal.buildevents.BuildExceptionReporter]   at org.gradle.tooling.internal.provider.StartParamsValidatingActionExecuter.execute(StartParamsValidatingActionExecuter.java:59)
15:47:01.483 [ERROR] [org.gradle.internal.buildevents.BuildExceptionReporter]   at org.gradle.tooling.internal.provider.StartParamsValidatingActionExecuter.execute(StartParamsValidatingActionExecuter.java:31)
15:47:01.484 [ERROR] [org.gradle.internal.buildevents.BuildExceptionReporter]   at org.gradle.tooling.internal.provider.SessionFailureReportingActionExecuter.execute(SessionFailureReportingActionExecuter.java:59)
15:47:01.484 [ERROR] [org.gradle.internal.buildevents.BuildExceptionReporter]   at org.gradle.tooling.internal.provider.SessionFailureReportingActionExecuter.execute(SessionFailureReportingActionExecuter.java:44)
15:47:01.484 [ERROR] [org.gradle.internal.buildevents.BuildExceptionReporter]   at org.gradle.tooling.internal.provider.SetupLoggingActionExecuter.execute(SetupLoggingActionExecuter.java:46)
15:47:01.484 [ERROR] [org.gradle.internal.buildevents.BuildExceptionReporter]   at org.gradle.tooling.internal.provider.SetupLoggingActionExecuter.execute(SetupLoggingActionExecuter.java:30)
15:47:01.484 [ERROR] [org.gradle.internal.buildevents.BuildExceptionReporter]   at org.gradle.launcher.daemon.server.exec.ExecuteBuild.doBuild(ExecuteBuild.java:67)
15:47:01.485 [ERROR] [org.gradle.internal.buildevents.BuildExceptionReporter]   at org.gradle.launcher.daemon.server.exec.BuildCommandOnly.execute(BuildCommandOnly.java:36)
15:47:01.485 [ERROR] [org.gradle.internal.buildevents.BuildExceptionReporter]   at org.gradle.launcher.daemon.server.api.DaemonCommandExecution.proceed(DaemonCommandExecution.java:122)
15:47:01.485 [ERROR] [org.gradle.internal.buildevents.BuildExceptionReporter]   at org.gradle.launcher.daemon.server.exec.WatchForDisconnection.execute(WatchForDisconnection.java:37)
15:47:01.486 [ERROR] [org.gradle.internal.buildevents.BuildExceptionReporter]   at org.gradle.launcher.daemon.server.api.DaemonCommandExecution.proceed(DaemonCommandExecution.java:122)
15:47:01.486 [ERROR] [org.gradle.internal.buildevents.BuildExceptionReporter]   at org.gradle.launcher.daemon.server.exec.ResetDeprecationLogger.execute(ResetDeprecationLogger.java:26)
15:47:01.486 [ERROR] [org.gradle.internal.buildevents.BuildExceptionReporter]   at org.gradle.launcher.daemon.server.api.DaemonCommandExecution.proceed(DaemonCommandExecution.java:122)
15:47:01.486 [ERROR] [org.gradle.internal.buildevents.BuildExceptionReporter]   at org.gradle.launcher.daemon.server.exec.RequestStopIfSingleUsedDaemon.execute(RequestStopIfSingleUsedDaemon.java:34)
15:47:01.488 [ERROR] [org.gradle.internal.buildevents.BuildExceptionReporter]   at org.gradle.launcher.daemon.server.api.DaemonCommandExecution.proceed(DaemonCommandExecution.java:122)
15:47:01.489 [ERROR] [org.gradle.internal.buildevents.BuildExceptionReporter]   at org.gradle.launcher.daemon.server.exec.ForwardClientInput$2.call(ForwardClientInput.java:74)
15:47:01.489 [ERROR] [org.gradle.internal.buildevents.BuildExceptionReporter]   at org.gradle.launcher.daemon.server.exec.ForwardClientInput$2.call(ForwardClientInput.java:72)
15:47:01.489 [ERROR] [org.gradle.internal.buildevents.BuildExceptionReporter]   at org.gradle.util.Swapper.swap(Swapper.java:38)
15:47:01.489 [ERROR] [org.gradle.internal.buildevents.BuildExceptionReporter]   at org.gradle.launcher.daemon.server.exec.ForwardClientInput.execute(ForwardClientInput.java:72)
15:47:01.490 [ERROR] [org.gradle.internal.buildevents.BuildExceptionReporter]   at org.gradle.launcher.daemon.server.api.DaemonCommandExecution.proceed(DaemonCommandExecution.java:122)
15:47:01.490 [ERROR] [org.gradle.internal.buildevents.BuildExceptionReporter]   at org.gradle.launcher.daemon.server.exec.LogAndCheckHealth.execute(LogAndCheckHealth.java:50)
15:47:01.490 [ERROR] [org.gradle.internal.buildevents.BuildExceptionReporter]   at org.gradle.launcher.daemon.server.api.DaemonCommandExecution.proceed(DaemonCommandExecution.java:122)
15:47:01.490 [ERROR] [org.gradle.internal.buildevents.BuildExceptionReporter]   at org.gradle.launcher.daemon.server.exec.LogToClient.doBuild(LogToClient.java:62)
15:47:01.490 [ERROR] [org.gradle.internal.buildevents.BuildExceptionReporter]   at org.gradle.launcher.daemon.server.exec.BuildCommandOnly.execute(BuildCommandOnly.java:36)
15:47:01.490 [ERROR] [org.gradle.internal.buildevents.BuildExceptionReporter]   at org.gradle.launcher.daemon.server.api.DaemonCommandExecution.proceed(DaemonCommandExecution.java:122)
15:47:01.491 [ERROR] [org.gradle.internal.buildevents.BuildExceptionReporter]   at org.gradle.launcher.daemon.server.exec.EstablishBuildEnvironment.doBuild(EstablishBuildEnvironment.java:81)
15:47:01.491 [ERROR] [org.gradle.internal.buildevents.BuildExceptionReporter]   at org.gradle.launcher.daemon.server.exec.BuildCommandOnly.execute(BuildCommandOnly.java:36)
15:47:01.491 [ERROR] [org.gradle.internal.buildevents.BuildExceptionReporter]   at org.gradle.launcher.daemon.server.api.DaemonCommandExecution.proceed(DaemonCommandExecution.java:122)
15:47:01.491 [ERROR] [org.gradle.internal.buildevents.BuildExceptionReporter]   at org.gradle.launcher.daemon.server.exec.StartBuildOrRespondWithBusy$1.run(StartBuildOrRespondWithBusy.java:50)
15:47:01.491 [ERROR] [org.gradle.internal.buildevents.BuildExceptionReporter]   at org.gradle.launcher.daemon.server.DaemonStateCoordinator$1.run(DaemonStateCoordinator.java:295)
15:47:01.492 [ERROR] [org.gradle.internal.buildevents.BuildExceptionReporter]   at org.gradle.internal.concurrent.ExecutorPolicy$CatchAndRecordFailures.onExecute(ExecutorPolicy.java:63)
15:47:01.492 [ERROR] [org.gradle.internal.buildevents.BuildExceptionReporter]   at org.gradle.internal.concurrent.ManagedExecutorImpl$1.run(ManagedExecutorImpl.java:46)
15:47:01.492 [ERROR] [org.gradle.internal.buildevents.BuildExceptionReporter]   at org.gradle.internal.concurrent.ThreadFactoryImpl$ManagedThreadRunnable.run(ThreadFactoryImpl.java:55)
15:47:01.492 [ERROR] [org.gradle.internal.buildevents.BuildExceptionReporter] Caused by: java.lang.RuntimeException: Invalid patcher dependency: de.oceanlabs.mcp:mcp_config:1.15.2-20200515.085601@zip
15:47:01.492 [ERROR] [org.gradle.internal.buildevents.BuildExceptionReporter]   at net.minecraftforge.gradle.userdev.MinecraftUserRepo$MCP.<init>(MinecraftUserRepo.java:1527)
15:47:01.492 [ERROR] [org.gradle.internal.buildevents.BuildExceptionReporter]   at net.minecraftforge.gradle.userdev.MinecraftUserRepo$MCP.<init>(MinecraftUserRepo.java:1473)
15:47:01.493 [ERROR] [org.gradle.internal.buildevents.BuildExceptionReporter]   at net.minecraftforge.gradle.userdev.MinecraftUserRepo.getParents(MinecraftUserRepo.java:364)
15:47:01.493 [ERROR] [org.gradle.internal.buildevents.BuildExceptionReporter]   at net.minecraftforge.gradle.userdev.MinecraftUserRepo.validate(MinecraftUserRepo.java:174)
15:47:01.493 [ERROR] [org.gradle.internal.buildevents.BuildExceptionReporter]   at net.minecraftforge.gradle.userdev.UserDevPlugin.lambda$apply$18(UserDevPlugin.java:286)
15:47:01.493 [ERROR] [org.gradle.internal.buildevents.BuildExceptionReporter]   at org.gradle.configuration.internal.DefaultListenerBuildOperationDecorator$BuildOperationEmittingAction$1$1.run(DefaultListenerBuildOperationDecorator.
java:157)
15:47:01.493 [ERROR] [org.gradle.internal.buildevents.BuildExceptionReporter]   at org.gradle.configuration.internal.DefaultUserCodeApplicationContext.reapply(DefaultUserCodeApplicationContext.java:58)
15:47:01.494 [ERROR] [org.gradle.internal.buildevents.BuildExceptionReporter]   at org.gradle.configuration.internal.DefaultListenerBuildOperationDecorator$BuildOperationEmittingAction$1.run(DefaultListenerBuildOperationDecorator.ja
va:154)
15:47:01.494 [ERROR] [org.gradle.internal.buildevents.BuildExceptionReporter]   at org.gradle.internal.operations.DefaultBuildOperationExecutor$RunnableBuildOperationWorker.execute(DefaultBuildOperationExecutor.java:301)
15:47:01.494 [ERROR] [org.gradle.internal.buildevents.BuildExceptionReporter]   at org.gradle.internal.operations.DefaultBuildOperationExecutor$RunnableBuildOperationWorker.execute(DefaultBuildOperationExecutor.java:293)
15:47:01.495 [ERROR] [org.gradle.internal.buildevents.BuildExceptionReporter]   at org.gradle.internal.operations.DefaultBuildOperationExecutor.execute(DefaultBuildOperationExecutor.java:175)
15:47:01.495 [ERROR] [org.gradle.internal.buildevents.BuildExceptionReporter]   at org.gradle.internal.operations.DefaultBuildOperationExecutor.run(DefaultBuildOperationExecutor.java:91)
15:47:01.495 [ERROR] [org.gradle.internal.buildevents.BuildExceptionReporter]   at org.gradle.configuration.internal.DefaultListenerBuildOperationDecorator$BuildOperationEmittingAction.execute(DefaultListenerBuildOperationDecorator.
java:151)
15:47:01.496 [ERROR] [org.gradle.internal.buildevents.BuildExceptionReporter]   at org.gradle.internal.event.BroadcastDispatch$ActionInvocationHandler.dispatch(BroadcastDispatch.java:91)
15:47:01.497 [ERROR] [org.gradle.internal.buildevents.BuildExceptionReporter]   at org.gradle.internal.event.BroadcastDispatch$ActionInvocationHandler.dispatch(BroadcastDispatch.java:80)
15:47:01.498 [ERROR] [org.gradle.internal.buildevents.BuildExceptionReporter]   at org.gradle.internal.event.AbstractBroadcastDispatch.dispatch(AbstractBroadcastDispatch.java:42)
15:47:01.498 [ERROR] [org.gradle.internal.buildevents.BuildExceptionReporter]   at org.gradle.internal.event.BroadcastDispatch$SingletonDispatch.dispatch(BroadcastDispatch.java:230)
15:47:01.499 [ERROR] [org.gradle.internal.buildevents.BuildExceptionReporter]   at org.gradle.internal.event.BroadcastDispatch$SingletonDispatch.dispatch(BroadcastDispatch.java:149)
15:47:01.499 [ERROR] [org.gradle.internal.buildevents.BuildExceptionReporter]   at org.gradle.internal.event.AbstractBroadcastDispatch.dispatch(AbstractBroadcastDispatch.java:58)
15:47:01.500 [ERROR] [org.gradle.internal.buildevents.BuildExceptionReporter]   at org.gradle.internal.event.BroadcastDispatch$CompositeDispatch.dispatch(BroadcastDispatch.java:324)
15:47:01.500 [ERROR] [org.gradle.internal.buildevents.BuildExceptionReporter]   at org.gradle.internal.event.BroadcastDispatch$CompositeDispatch.dispatch(BroadcastDispatch.java:234)
15:47:01.500 [ERROR] [org.gradle.internal.buildevents.BuildExceptionReporter]   at org.gradle.internal.event.ListenerBroadcast.dispatch(ListenerBroadcast.java:140)
15:47:01.500 [ERROR] [org.gradle.internal.buildevents.BuildExceptionReporter]   at org.gradle.internal.event.ListenerBroadcast.dispatch(ListenerBroadcast.java:37)
15:47:01.500 [ERROR] [org.gradle.internal.buildevents.BuildExceptionReporter]   at org.gradle.internal.dispatch.ProxyDispatchAdapter$DispatchingInvocationHandler.invoke(ProxyDispatchAdapter.java:93)
15:47:01.500 [ERROR] [org.gradle.internal.buildevents.BuildExceptionReporter]   at com.sun.proxy.$Proxy28.afterEvaluate(Unknown Source)
15:47:01.501 [ERROR] [org.gradle.internal.buildevents.BuildExceptionReporter]   at org.gradle.configuration.project.LifecycleProjectEvaluator$NotifyAfterEvaluate$1.execute(LifecycleProjectEvaluator.java:187)
15:47:01.501 [ERROR] [org.gradle.internal.buildevents.BuildExceptionReporter]   at org.gradle.configuration.project.LifecycleProjectEvaluator$NotifyAfterEvaluate$1.execute(LifecycleProjectEvaluator.java:184)
15:47:01.501 [ERROR] [org.gradle.internal.buildevents.BuildExceptionReporter]   at org.gradle.api.internal.project.DefaultProject.stepEvaluationListener(DefaultProject.java:1418)
15:47:01.501 [ERROR] [org.gradle.internal.buildevents.BuildExceptionReporter]   at org.gradle.configuration.project.LifecycleProjectEvaluator$NotifyAfterEvaluate.run(LifecycleProjectEvaluator.java:193)
15:47:01.501 [ERROR] [org.gradle.internal.buildevents.BuildExceptionReporter]   ... 91 more
15:47:01.501 [ERROR] [org.gradle.internal.buildevents.BuildExceptionReporter] Caused by: java.util.zip.ZipException: error in opening zip file
15:47:01.502 [ERROR] [org.gradle.internal.buildevents.BuildExceptionReporter]   at net.minecraftforge.gradle.common.util.Utils.getZipData(Utils.java:315)
15:47:01.502 [ERROR] [org.gradle.internal.buildevents.BuildExceptionReporter]   at net.minecraftforge.gradle.mcp.util.MCPWrapper.<init>(MCPWrapper.java:54)
15:47:01.502 [ERROR] [org.gradle.internal.buildevents.BuildExceptionReporter]   at net.minecraftforge.gradle.mcp.util.MCPWrapper.<init>(MCPWrapper.java:47)
15:47:01.502 [ERROR] [org.gradle.internal.buildevents.BuildExceptionReporter]   at net.minecraftforge.gradle.userdev.MinecraftUserRepo$MCP$1.<init>(MinecraftUserRepo.java:1481)
15:47:01.503 [ERROR] [org.gradle.internal.buildevents.BuildExceptionReporter]   at net.minecraftforge.gradle.userdev.MinecraftUserRepo$MCP.<init>(MinecraftUserRepo.java:1481)
15:47:01.503 [ERROR] [org.gradle.internal.buildevents.BuildExceptionReporter]   ... 119 more
15:47:01.503 [ERROR] [org.gradle.internal.buildevents.BuildExceptionReporter]
15:47:01.503 [ERROR] [org.gradle.internal.buildevents.BuildExceptionReporter]
15:47:01.504 [ERROR] [org.gradle.internal.buildevents.BuildExceptionReporter] * Get more help at https://help.gradle.org
15:47:01.504 [WARN] [org.gradle.internal.featurelifecycle.LoggingDeprecatedFeatureHandler]
Deprecated Gradle features were used in this build, making it incompatible with Gradle 5.0.
Use '--warning-mode all' to show the individual deprecation warnings.
See https://docs.gradle.org/4.10.3/userguide/command_line_interface.html#sec:command_line_warnings
15:47:01.506 [ERROR] [org.gradle.internal.buildevents.BuildResultLogger]
15:47:01.506 [ERROR] [org.gradle.internal.buildevents.BuildResultLogger] BUILD FAILED in 24s
15:47:01.863 [QUIET] [com.gradle.scan.plugin.BuildScanPlugin]


 

Edited by Lord_DBT
Link to post
Share on other sites

I have tried selecting  gradle on the right side bar then selected

Tasks>fg_runs>genIntellijRuns

but my mod still doesn't run

 

I got this after selecting Run 'runClient'

 

#
# A fatal error has been detected by the Java Runtime Environment:
#
#  EXCEPTION_ACCESS_VIOLATION (0xc0000005) at pc=0x0000000000000000, pid=18340, tid=0x0000000000000908
#
# JRE version: Java(TM) SE Runtime Environment (8.0_251-b08) (build 1.8.0_251-b08)
# Java VM: Java HotSpot(TM) 64-Bit Server VM (25.251-b08 mixed mode windows-amd64 compressed oops)
# Problematic frame:
# C  0x0000000000000000
#
# Failed to write core dump. Minidumps are not enabled by default on client versions of Windows
#
# An error report file with more information is saved as:
# C:\Users\myname\Desktop\Coding-Scripting\MyMinecraftModding\TutorialMod\run\hs_err_pid18340.log
#
# If you would like to submit a bug report, please visit:
#   http://bugreport.java.com/bugreport/crash.jsp
# The crash happened outside the Java Virtual Machine in native code.
# See problematic frame for where to report the bug.
#

Process finished with exit code 1

 

Edited by Lord_DBT
Link to post
Share on other sites

The first one is caused by an invalid jar file in your gradle cache. Easiest (but brute force) method is to just delete your gradle cache.

2nd exception is... very strange. Please post this file:

C:\Users\titre\Desktop\Coding-Scripting\MyMinecraftModding\TutorialMod\run\hs_err_pid18340.log

Link to post
Share on other sites
3 hours ago, diesieben07 said:

The first one is caused by an invalid jar file in your gradle cache. Easiest (but brute force) method is to just delete your gradle cache.

2nd exception is... very strange. Please post this file:

C:\Users\titre\Desktop\Coding-Scripting\MyMinecraftModding\TutorialMod\run\hs_err_pid18340.log

Thank you for responding :)

this is the contents of the hs_err_pid18340.log file:

#
# A fatal error has been detected by the Java Runtime Environment:
#
#  EXCEPTION_ACCESS_VIOLATION (0xc0000005) at pc=0x0000000000000000, pid=18340, tid=0x0000000000000908
#
# JRE version: Java(TM) SE Runtime Environment (8.0_251-b08) (build 1.8.0_251-b08)
# Java VM: Java HotSpot(TM) 64-Bit Server VM (25.251-b08 mixed mode windows-amd64 compressed oops)
# Problematic frame:
# C  0x0000000000000000
#
# Failed to write core dump. Minidumps are not enabled by default on client versions of Windows
#
# If you would like to submit a bug report, please visit:
#   http://bugreport.java.com/bugreport/crash.jsp
# The crash happened outside the Java Virtual Machine in native code.
# See problematic frame for where to report the bug.
#

---------------  T H R E A D  ---------------

Current thread (0x000000000282a800):  JavaThread "main" [_thread_in_native, id=2312, stack(0x0000000002720000,0x0000000002820000)]

siginfo: ExceptionCode=0xc0000005, ExceptionInformation=0x0000000000000008 0x0000000000000000

Registers:
RAX=0x000000001cdfe380, RBX=0x000000001ce21d50, RCX=0x00000000027fe6c0, RDX=0x00000000027fe6cc
RSP=0x00000000027fe688, RBP=0x00000000027fe790, RSI=0x0000000000000000, RDI=0x0000000000000001
R8 =0x00000000027fe6dc, R9 =0x0000000000000001, R10=0x0000000000008000, R11=0x00000000027fe680
R12=0x00000000027febd0, R13=0x00000000ffffffff, R14=0x00000000027ff140, R15=0x000000001ce21d50
RIP=0x0000000000000000, EFLAGS=0x0000000000010246

Top of Stack: (sp=0x00000000027fe688)
0x00000000027fe688:   00007fff96cb227d 000000001ce21d50
0x00000000027fe698:   00000000027fe630 0000000000000000
0x00000000027fe6a8:   0000000000000001 00007fff98172601
0x00000000027fe6b8:   00007fff000000ff 0000000000000000
0x00000000027fe6c8:   000000009800e178 00000000027fed90
0x00000000027fe6d8:   00000000027fe880 00000000009646f0
0x00000000027fe6e8:   0000000000000000 0000000000000000
0x00000000027fe6f8:   0000000000000000 0000000000000001
0x00000000027fe708:   00000000005a0000 00000000005a02a8
0x00000000027fe718:   00007fff98f11940 00000000008e2db0
0x00000000027fe728:   00000000005a0c00 0000000000000000
0x00000000027fe738:   0000000000000000 00000000009646f0
0x00000000027fe748:   0000000000000017 0000000000000016
0x00000000027fe758:   0000000000000001 0000000000000002
0x00000000027fe768:   00007fff9800da49 00000000027fe880
0x00000000027fe778:   0000000000000040 00000000027fe880 

Instructions: (pc=0x0000000000000000)
0xffffffffffffffe0:   


Register to memory mapping:

RAX=0x000000001cdfe380 is an unknown value
RBX=0x000000001ce21d50 is an unknown value
RCX=0x00000000027fe6c0 is pointing into the stack for thread: 0x000000000282a800
RDX=0x00000000027fe6cc is pointing into the stack for thread: 0x000000000282a800
RSP=0x00000000027fe688 is pointing into the stack for thread: 0x000000000282a800
RBP=0x00000000027fe790 is pointing into the stack for thread: 0x000000000282a800
RSI=0x0000000000000000 is an unknown value
RDI=0x0000000000000001 is an unknown value
R8 =0x00000000027fe6dc is pointing into the stack for thread: 0x000000000282a800
R9 =0x0000000000000001 is an unknown value
R10=0x0000000000008000 is an unknown value
R11=0x00000000027fe680 is pointing into the stack for thread: 0x000000000282a800
R12=0x00000000027febd0 is pointing into the stack for thread: 0x000000000282a800
R13=0x00000000ffffffff is an unallocated location in the heap
R14=0x00000000027ff140 is pointing into the stack for thread: 0x000000000282a800
R15=0x000000001ce21d50 is an unknown value


Stack: [0x0000000002720000,0x0000000002820000],  sp=0x00000000027fe688,  free space=889k
Native frames: (J=compiled Java code, j=interpreted, Vv=VM code, C=native code)

Java frames: (J=compiled Java code, j=interpreted, Vv=VM code)
j  org.lwjgl.system.JNI.invokePPPP(IIJJJJ)J+0
j  org.lwjgl.glfw.GLFW.nglfwCreateWindow(IIJJJ)J+14
j  org.lwjgl.glfw.GLFW.glfwCreateWindow(IILjava/lang/CharSequence;JJ)J+37
j  net.minecraftforge.fml.loading.progress.ClientVisualization.initWindow()V+124
j  net.minecraftforge.fml.loading.progress.ClientVisualization.start()Ljava/lang/Runnable;+1
j  net.minecraftforge.fml.loading.progress.EarlyProgressVisualization.accept(Lnet/minecraftforge/api/distmarker/Dist;)Ljava/lang/Runnable;+46
j  net.minecraftforge.fml.loading.FMLLoader.setupLaunchHandler(Lcpw/mods/modlauncher/api/IEnvironment;Ljava/util/Map;)V+214
j  net.minecraftforge.fml.loading.FMLServiceProvider.initialize(Lcpw/mods/modlauncher/api/IEnvironment;)V+190
j  cpw.mods.modlauncher.TransformationServiceDecorator.onInitialize(Lcpw/mods/modlauncher/api/IEnvironment;)V+39
j  cpw.mods.modlauncher.TransformationServicesHandler.lambda$initialiseTransformationServices$7(Lcpw/mods/modlauncher/Environment;Lcpw/mods/modlauncher/TransformationServiceDecorator;)V+2
j  cpw.mods.modlauncher.TransformationServicesHandler$$Lambda$98.accept(Ljava/lang/Object;)V+8
j  java.util.HashMap$Values.forEach(Ljava/util/function/Consumer;)V+69
j  cpw.mods.modlauncher.TransformationServicesHandler.initialiseTransformationServices(Lcpw/mods/modlauncher/Environment;)V+28
j  cpw.mods.modlauncher.TransformationServicesHandler.initializeTransformationServices(Lcpw/mods/modlauncher/ArgumentHandler;Lcpw/mods/modlauncher/Environment;Lcpw/mods/modlauncher/NameMappingServiceHandler;)Ljava/util/List;+17
j  cpw.mods.modlauncher.Launcher.run([Ljava/lang/String;)V+33
j  cpw.mods.modlauncher.Launcher.main([Ljava/lang/String;)V+37
j  net.minecraftforge.userdev.LaunchTesting.main([Ljava/lang/String;)V+422
v  ~StubRoutines::call_stub

---------------  P R O C E S S  ---------------

Java Threads: ( => current thread )
  0x00000000197e3800 JavaThread "Thread-2" daemon [_thread_in_native, id=18644, stack(0x000000001b740000,0x000000001b840000)]
  0x000000001a278800 JavaThread "Thread-1" daemon [_thread_blocked, id=18084, stack(0x000000001b640000,0x000000001b740000)]
  0x00000000197e2000 JavaThread "ForkJoinPool.commonPool-worker-1" daemon [_thread_blocked, id=21408, stack(0x000000001b540000,0x000000001b640000)]
  0x0000000018c2e800 JavaThread "Service Thread" daemon [_thread_blocked, id=1388, stack(0x0000000019830000,0x0000000019930000)]
  0x0000000018be0000 JavaThread "C1 CompilerThread2" daemon [_thread_blocked, id=21220, stack(0x0000000018f30000,0x0000000019030000)]
  0x0000000018bdf000 JavaThread "C2 CompilerThread1" daemon [_thread_blocked, id=8572, stack(0x0000000018e30000,0x0000000018f30000)]
  0x0000000018bdb000 JavaThread "C2 CompilerThread0" daemon [_thread_blocked, id=4300, stack(0x0000000018d30000,0x0000000018e30000)]
  0x0000000018ba3800 JavaThread "Monitor Ctrl-Break" daemon [_thread_in_native, id=19120, stack(0x0000000018c30000,0x0000000018d30000)]
  0x00000000171ef800 JavaThread "Attach Listener" daemon [_thread_blocked, id=19640, stack(0x0000000018730000,0x0000000018830000)]
  0x00000000171ee000 JavaThread "Signal Dispatcher" daemon [_thread_blocked, id=18356, stack(0x0000000018630000,0x0000000018730000)]
  0x00000000171ca000 JavaThread "Finalizer" daemon [_thread_blocked, id=12452, stack(0x0000000018430000,0x0000000018530000)]
  0x00000000171c9000 JavaThread "Reference Handler" daemon [_thread_blocked, id=11796, stack(0x0000000018330000,0x0000000018430000)]
=>0x000000000282a800 JavaThread "main" [_thread_in_native, id=2312, stack(0x0000000002720000,0x0000000002820000)]

Other Threads:
  0x00000000171a7000 VMThread [stack: 0x0000000018230000,0x0000000018330000] [id=19636]
  0x00000000190a6000 WatcherThread [stack: 0x0000000019930000,0x0000000019a30000] [id=19364]

VM state:not at safepoint (normal execution)

VM Mutex/Monitor currently owned by a thread: None

heap address: 0x0000000088a00000, size: 1910 MB, Compressed Oops mode: 32-bit
Narrow klass base: 0x0000000000000000, Narrow klass shift: 3
Compressed class space size: 1073741824 Address: 0x0000000100000000

Heap:
 PSYoungGen      total 35840K, used 15296K [0x00000000d8380000, 0x00000000dab80000, 0x0000000100000000)
  eden space 30720K, 33% used [0x00000000d8380000,0x00000000d8d73ff0,0x00000000da180000)
  from space 5120K, 99% used [0x00000000da180000,0x00000000da67c0c0,0x00000000da680000)
  to   space 5120K, 0% used [0x00000000da680000,0x00000000da680000,0x00000000dab80000)
 ParOldGen       total 81920K, used 3979K [0x0000000088a00000, 0x000000008da00000, 0x00000000d8380000)
  object space 81920K, 4% used [0x0000000088a00000,0x0000000088de2d28,0x000000008da00000)
 Metaspace       used 19022K, capacity 19624K, committed 19968K, reserved 1067008K
  class space    used 2294K, capacity 2474K, committed 2560K, reserved 1048576K

Card table byte_map: [0x0000000011e90000,0x0000000012250000] byte_map_base: 0x0000000011a4b000

Marking Bits: (ParMarkBitMap*) 0x000000006b41af90
 Begin Bits: [0x00000000128d0000, 0x00000000146a8000)
 End Bits:   [0x00000000146a8000, 0x0000000016480000)

Polling page: 0x0000000000840000

CodeCache: size=245760Kb used=6667Kb max_used=6667Kb free=239092Kb
 bounds [0x0000000002ad0000, 0x0000000003160000, 0x0000000011ad0000]
 total_blobs=2864 nmethods=1971 adapters=806
 compilation: enabled

Compilation events (10 events):
Event: 6.509 Thread 0x0000000018be0000 1967       3       sun.reflect.UnsafeStaticFieldAccessorImpl::<init> (17 bytes)
Event: 6.509 Thread 0x0000000018be0000 nmethod 1967 0x0000000003153f50 code [0x00000000031540c0, 0x0000000003154338]
Event: 6.509 Thread 0x0000000018be0000 1968       3       sun.reflect.UnsafeQualifiedStaticFieldAccessorImpl::<init> (11 bytes)
Event: 6.509 Thread 0x0000000018be0000 nmethod 1968 0x0000000003154410 code [0x0000000003154580, 0x0000000003154878]
Event: 6.512 Thread 0x0000000018be0000 1969       3       java.lang.Integer::toUnsignedLong (7 bytes)
Event: 6.512 Thread 0x0000000018be0000 nmethod 1969 0x0000000003154990 code [0x0000000003154ae0, 0x0000000003154c30]
Event: 6.512 Thread 0x0000000018be0000 1970       3       org.lwjgl.system.MemoryUtil::encodeASCII (66 bytes)
Event: 6.513 Thread 0x0000000018be0000 nmethod 1970 0x0000000003154c90 code [0x0000000003154e20, 0x0000000003155218]
Event: 6.688 Thread 0x0000000018be0000 1971       3       java.util.concurrent.LinkedBlockingDeque::unlinkFirst (74 bytes)
Event: 6.689 Thread 0x0000000018be0000 nmethod 1971 0x0000000003155390 code [0x0000000003155540, 0x0000000003155aa8]

GC Heap History (6 events):
Event: 1.906 GC heap before
{Heap before GC invocations=1 (full 0):
 PSYoungGen      total 35840K, used 30720K [0x00000000d8380000, 0x00000000dab80000, 0x0000000100000000)
  eden space 30720K, 100% used [0x00000000d8380000,0x00000000da180000,0x00000000da180000)
  from space 5120K, 0% used [0x00000000da680000,0x00000000da680000,0x00000000dab80000)
  to   space 5120K, 0% used [0x00000000da180000,0x00000000da180000,0x00000000da680000)
 ParOldGen       total 81920K, used 0K [0x0000000088a00000, 0x000000008da00000, 0x00000000d8380000)
  object space 81920K, 0% used [0x0000000088a00000,0x0000000088a00000,0x000000008da00000)
 Metaspace       used 7192K, capacity 7328K, committed 7552K, reserved 1056768K
  class space    used 834K, capacity 888K, committed 896K, reserved 1048576K
Event: 1.916 GC heap after
Heap after GC invocations=1 (full 0):
 PSYoungGen      total 35840K, used 4374K [0x00000000d8380000, 0x00000000dab80000, 0x0000000100000000)
  eden space 30720K, 0% used [0x00000000d8380000,0x00000000d8380000,0x00000000da180000)
  from space 5120K, 85% used [0x00000000da180000,0x00000000da5c59b0,0x00000000da680000)
  to   space 5120K, 0% used [0x00000000da680000,0x00000000da680000,0x00000000dab80000)
 ParOldGen       total 81920K, used 8K [0x0000000088a00000, 0x000000008da00000, 0x00000000d8380000)
  object space 81920K, 0% used [0x0000000088a00000,0x0000000088a02000,0x000000008da00000)
 Metaspace       used 7192K, capacity 7328K, committed 7552K, reserved 1056768K
  class space    used 834K, capacity 888K, committed 896K, reserved 1048576K
}
Event: 2.924 GC heap before
{Heap before GC invocations=2 (full 0):
 PSYoungGen      total 35840K, used 35094K [0x00000000d8380000, 0x00000000dab80000, 0x0000000100000000)
  eden space 30720K, 100% used [0x00000000d8380000,0x00000000da180000,0x00000000da180000)
  from space 5120K, 85% used [0x00000000da180000,0x00000000da5c59b0,0x00000000da680000)
  to   space 5120K, 0% used [0x00000000da680000,0x00000000da680000,0x00000000dab80000)
 ParOldGen       total 81920K, used 8K [0x0000000088a00000, 0x000000008da00000, 0x00000000d8380000)
  object space 81920K, 0% used [0x0000000088a00000,0x0000000088a02000,0x000000008da00000)
 Metaspace       used 13372K, capacity 13566K, committed 13696K, reserved 1060864K
  class space    used 1575K, capacity 1652K, committed 1664K, reserved 1048576K
Event: 2.936 GC heap after
Heap after GC invocations=2 (full 0):
 PSYoungGen      total 35840K, used 5108K [0x00000000d8380000, 0x00000000dab80000, 0x0000000100000000)
  eden space 30720K, 0% used [0x00000000d8380000,0x00000000d8380000,0x00000000da180000)
  from space 5120K, 99% used [0x00000000da680000,0x00000000dab7d068,0x00000000dab80000)
  to   space 5120K, 0% used [0x00000000da180000,0x00000000da180000,0x00000000da680000)
 ParOldGen       total 81920K, used 958K [0x0000000088a00000, 0x000000008da00000, 0x00000000d8380000)
  object space 81920K, 1% used [0x0000000088a00000,0x0000000088aefa60,0x000000008da00000)
 Metaspace       used 13372K, capacity 13566K, committed 13696K, reserved 1060864K
  class space    used 1575K, capacity 1652K, committed 1664K, reserved 1048576K
}
Event: 6.007 GC heap before
{Heap before GC invocations=3 (full 0):
 PSYoungGen      total 35840K, used 35828K [0x00000000d8380000, 0x00000000dab80000, 0x0000000100000000)
  eden space 30720K, 100% used [0x00000000d8380000,0x00000000da180000,0x00000000da180000)
  from space 5120K, 99% used [0x00000000da680000,0x00000000dab7d068,0x00000000dab80000)
  to   space 5120K, 0% used [0x00000000da180000,0x00000000da180000,0x00000000da680000)
 ParOldGen       total 81920K, used 958K [0x0000000088a00000, 0x000000008da00000, 0x00000000d8380000)
  object space 81920K, 1% used [0x0000000088a00000,0x0000000088aefa60,0x000000008da00000)
 Metaspace       used 17322K, capacity 17852K, committed 17920K, reserved 1064960K
  class space    used 2106K, capacity 2258K, committed 2304K, reserved 1048576K
Event: 6.023 GC heap after
Heap after GC invocations=3 (full 0):
 PSYoungGen      total 35840K, used 5104K [0x00000000d8380000, 0x00000000dab80000, 0x0000000100000000)
  eden space 30720K, 0% used [0x00000000d8380000,0x00000000d8380000,0x00000000da180000)
  from space 5120K, 99% used [0x00000000da180000,0x00000000da67c0c0,0x00000000da680000)
  to   space 5120K, 0% used [0x00000000da680000,0x00000000da680000,0x00000000dab80000)
 ParOldGen       total 81920K, used 3979K [0x0000000088a00000, 0x000000008da00000, 0x00000000d8380000)
  object space 81920K, 4% used [0x0000000088a00000,0x0000000088de2d28,0x000000008da00000)
 Metaspace       used 17322K, capacity 17852K, committed 17920K, reserved 1064960K
  class space    used 2106K, capacity 2258K, committed 2304K, reserved 1048576K
}

Deoptimization events (10 events):
Event: 3.484 Thread 0x000000000282a800 Uncommon trap: reason=unstable_if action=reinterpret pc=0x0000000002d3233c method=java.util.HashMap.putVal(ILjava/lang/Object;Ljava/lang/Object;ZZ)Ljava/lang/Object; @ 181
Event: 3.669 Thread 0x000000000282a800 Uncommon trap: reason=unstable_if action=reinterpret pc=0x0000000002dfa2fc method=java.lang.CharacterDataLatin1.isWhitespace(I)Z @ 14
Event: 3.709 Thread 0x000000000282a800 Uncommon trap: reason=bimorphic action=maybe_recompile pc=0x0000000002f2935c method=java.util.HashMap.putVal(ILjava/lang/Object;Ljava/lang/Object;ZZ)Ljava/lang/Object; @ 203
Event: 3.709 Thread 0x000000000282a800 Uncommon trap: reason=bimorphic action=maybe_recompile pc=0x0000000002f2935c method=java.util.HashMap.putVal(ILjava/lang/Object;Ljava/lang/Object;ZZ)Ljava/lang/Object; @ 203
Event: 3.710 Thread 0x000000000282a800 Uncommon trap: reason=bimorphic action=maybe_recompile pc=0x0000000002eff770 method=java.util.HashMap.putVal(ILjava/lang/Object;Ljava/lang/Object;ZZ)Ljava/lang/Object; @ 203
Event: 3.897 Thread 0x000000000282a800 Uncommon trap: reason=unstable_if action=reinterpret pc=0x0000000002ff8150 method=java.io.ByteArrayInputStream.read()I @ 8
Event: 5.001 Thread 0x000000000282a800 Uncommon trap: reason=unstable_if action=reinterpret pc=0x0000000003048db8 method=java.io.WinNTFileSystem.normalize(Ljava/lang/String;)Ljava/lang/String; @ 128
Event: 5.029 Thread 0x000000000282a800 Uncommon trap: reason=bimorphic action=maybe_recompile pc=0x0000000002f67334 method=java.net.URL.<init>(Ljava/net/URL;Ljava/lang/String;Ljava/net/URLStreamHandler;)V @ 504
Event: 6.352 Thread 0x000000000282a800 Uncommon trap: reason=unstable_if action=reinterpret pc=0x000000000305a8fc method=java.util.regex.Pattern$Curly.match(Ljava/util/regex/Matcher;ILjava/lang/CharSequence;)Z @ 45
Event: 6.352 Thread 0x000000000282a800 Uncommon trap: reason=unstable_if action=reinterpret pc=0x0000000002fcead0 method=java.util.regex.Pattern$BmpCharProperty.match(Ljava/util/regex/Matcher;ILjava/lang/CharSequence;)Z @ 34

Classes redefined (0 events):
No events

Internal exceptions (10 events):
Event: 6.439 Thread 0x000000000282a800 Exception <a 'java/security/PrivilegedActionException'> (0x00000000d8bca7e0) thrown at [C:\jenkins\workspace\8-2-build-windows-amd64-cygwin\jdk8u251\737\hotspot\src\share\vm\prims\jvm.cpp, line 1502]
Event: 6.439 Thread 0x000000000282a800 Exception <a 'java/security/PrivilegedActionException'> (0x00000000d8bcabd8) thrown at [C:\jenkins\workspace\8-2-build-windows-amd64-cygwin\jdk8u251\737\hotspot\src\share\vm\prims\jvm.cpp, line 1502]
Event: 6.453 Thread 0x000000000282a800 Exception <a 'java/security/PrivilegedActionException'> (0x00000000d8c0ba68) thrown at [C:\jenkins\workspace\8-2-build-windows-amd64-cygwin\jdk8u251\737\hotspot\src\share\vm\prims\jvm.cpp, line 1502]
Event: 6.453 Thread 0x000000000282a800 Exception <a 'java/security/PrivilegedActionException'> (0x00000000d8c0be60) thrown at [C:\jenkins\workspace\8-2-build-windows-amd64-cygwin\jdk8u251\737\hotspot\src\share\vm\prims\jvm.cpp, line 1502]
Event: 6.455 Thread 0x000000000282a800 Exception <a 'java/security/PrivilegedActionException'> (0x00000000d8c258e8) thrown at [C:\jenkins\workspace\8-2-build-windows-amd64-cygwin\jdk8u251\737\hotspot\src\share\vm\prims\jvm.cpp, line 1502]
Event: 6.455 Thread 0x000000000282a800 Exception <a 'java/security/PrivilegedActionException'> (0x00000000d8c25ce0) thrown at [C:\jenkins\workspace\8-2-build-windows-amd64-cygwin\jdk8u251\737\hotspot\src\share\vm\prims\jvm.cpp, line 1502]
Event: 6.470 Thread 0x000000000282a800 Exception <a 'java/security/PrivilegedActionException'> (0x00000000d8c57980) thrown at [C:\jenkins\workspace\8-2-build-windows-amd64-cygwin\jdk8u251\737\hotspot\src\share\vm\prims\jvm.cpp, line 1502]
Event: 6.470 Thread 0x000000000282a800 Exception <a 'java/security/PrivilegedActionException'> (0x00000000d8c57d78) thrown at [C:\jenkins\workspace\8-2-build-windows-amd64-cygwin\jdk8u251\737\hotspot\src\share\vm\prims\jvm.cpp, line 1502]
Event: 6.488 Thread 0x000000000282a800 Exception <a 'java/security/PrivilegedActionException'> (0x00000000d8ce86c8) thrown at [C:\jenkins\workspace\8-2-build-windows-amd64-cygwin\jdk8u251\737\hotspot\src\share\vm\prims\jvm.cpp, line 1502]
Event: 6.488 Thread 0x000000000282a800 Exception <a 'java/security/PrivilegedActionException'> (0x00000000d8ce8ac0) thrown at [C:\jenkins\workspace\8-2-build-windows-amd64-cygwin\jdk8u251\737\hotspot\src\share\vm\prims\jvm.cpp, line 1502]

Events (10 events):
Event: 6.486 loading class org/lwjgl/glfw/GLFWImage$Buffer
Event: 6.486 loading class org/lwjgl/glfw/GLFWImage$Buffer done
Event: 6.487 loading class org/lwjgl/system/StructBuffer
Event: 6.487 loading class org/lwjgl/system/StructBuffer done
Event: 6.507 loading class sun/reflect/UnsafeQualifiedStaticIntegerFieldAccessorImpl
Event: 6.508 loading class sun/reflect/UnsafeQualifiedStaticIntegerFieldAccessorImpl done
Event: 6.509 loading class org/lwjgl/glfw/GLFW$Functions
Event: 6.509 loading class org/lwjgl/glfw/GLFW$Functions done
Event: 6.632 loading class org/lwjgl/glfw/EventLoop$OffScreen
Event: 6.632 loading class org/lwjgl/glfw/EventLoop$OffScreen done


Dynamic libraries:
0x00007ff72e6a0000 - 0x00007ff72e6d7000 	C:\Program Files\Java\jdk1.8.0_251\bin\java.exe
0x00007ff816a00000 - 0x00007ff816bf0000 	C:\WINDOWS\SYSTEM32\ntdll.dll
0x00007ff815350000 - 0x00007ff815402000 	C:\WINDOWS\System32\KERNEL32.DLL
0x00007ff813ec0000 - 0x00007ff814164000 	C:\WINDOWS\System32\KERNELBASE.dll
0x00007ff816420000 - 0x00007ff8164c3000 	C:\WINDOWS\System32\ADVAPI32.dll
0x00007ff814ad0000 - 0x00007ff814b6e000 	C:\WINDOWS\System32\msvcrt.dll
0x00007ff814c40000 - 0x00007ff814cd7000 	C:\WINDOWS\System32\sechost.dll
0x00007ff815190000 - 0x00007ff8152b0000 	C:\WINDOWS\System32\RPCRT4.dll
0x00007ff816130000 - 0x00007ff8162c4000 	C:\WINDOWS\System32\USER32.dll
0x00007ff813990000 - 0x00007ff8139b1000 	C:\WINDOWS\System32\win32u.dll
0x00007ff815160000 - 0x00007ff815186000 	C:\WINDOWS\System32\GDI32.dll
0x00007ff813d20000 - 0x00007ff813eb4000 	C:\WINDOWS\System32\gdi32full.dll
0x00007ff8139c0000 - 0x00007ff813a5e000 	C:\WINDOWS\System32\msvcp_win.dll
0x00007ff813ad0000 - 0x00007ff813bca000 	C:\WINDOWS\System32\ucrtbase.dll
0x00007ff812d40000 - 0x00007ff812fc4000 	C:\WINDOWS\WinSxS\amd64_microsoft.windows.common-controls_6595b64144ccf1df_6.0.18362.836_none_e6c4b943130f18ed\COMCTL32.dll
0x00007ff814e20000 - 0x00007ff815156000 	C:\WINDOWS\System32\combase.dll
0x00007ff814220000 - 0x00007ff8142a0000 	C:\WINDOWS\System32\bcryptPrimitives.dll
0x00007ff815320000 - 0x00007ff81534e000 	C:\WINDOWS\System32\IMM32.DLL
0x000000006b4a0000 - 0x000000006b572000 	C:\Program Files\Java\jdk1.8.0_251\jre\bin\msvcr100.dll
0x000000006abf0000 - 0x000000006b49b000 	C:\Program Files\Java\jdk1.8.0_251\jre\bin\server\jvm.dll
0x00007ff814d50000 - 0x00007ff814d58000 	C:\WINDOWS\System32\PSAPI.DLL
0x00007ff807720000 - 0x00007ff80772a000 	C:\WINDOWS\SYSTEM32\VERSION.dll
0x00007fffffa50000 - 0x00007fffffa59000 	C:\WINDOWS\SYSTEM32\WSOCK32.dll
0x00007ff8152b0000 - 0x00007ff81531f000 	C:\WINDOWS\System32\WS2_32.dll
0x00007ff810d60000 - 0x00007ff810d84000 	C:\WINDOWS\SYSTEM32\WINMM.dll
0x00007ff810c00000 - 0x00007ff810c2d000 	C:\WINDOWS\SYSTEM32\winmmbase.dll
0x00007ff813a60000 - 0x00007ff813aaa000 	C:\WINDOWS\System32\cfgmgr32.dll
0x00007ff811d10000 - 0x00007ff811d1f000 	C:\Program Files\Java\jdk1.8.0_251\jre\bin\verify.dll
0x00007ff810e00000 - 0x00007ff810e29000 	C:\Program Files\Java\jdk1.8.0_251\jre\bin\java.dll
0x00007ff810db0000 - 0x00007ff810dd3000 	C:\Program Files\Java\jdk1.8.0_251\jre\bin\instrument.dll
0x00007ff810de0000 - 0x00007ff810df6000 	C:\Program Files\Java\jdk1.8.0_251\jre\bin\zip.dll
0x00007ff815570000 - 0x00007ff815c54000 	C:\WINDOWS\System32\SHELL32.dll
0x00007ff814d60000 - 0x00007ff814e09000 	C:\WINDOWS\System32\shcore.dll
0x00007ff8142d0000 - 0x00007ff814a4e000 	C:\WINDOWS\System32\windows.storage.dll
0x00007ff8138f0000 - 0x00007ff813913000 	C:\WINDOWS\System32\profapi.dll
0x00007ff813920000 - 0x00007ff81396a000 	C:\WINDOWS\System32\powrprof.dll
0x00007ff8138c0000 - 0x00007ff8138d0000 	C:\WINDOWS\System32\UMPDC.dll
0x00007ff816690000 - 0x00007ff8166e2000 	C:\WINDOWS\System32\shlwapi.dll
0x00007ff8138d0000 - 0x00007ff8138e1000 	C:\WINDOWS\System32\kernel.appcore.dll
0x00007ff813ab0000 - 0x00007ff813ac7000 	C:\WINDOWS\System32\cryptsp.dll
0x00007ff810d90000 - 0x00007ff810daa000 	C:\Program Files\JetBrains\IntelliJ IDEA Community Edition 2020.1.1\bin\breakgen64.dll
0x00007ff803550000 - 0x00007ff80356a000 	C:\Program Files\Java\jdk1.8.0_251\jre\bin\net.dll
0x00007ff812a50000 - 0x00007ff812ab7000 	C:\WINDOWS\system32\mswsock.dll
0x00007ff811870000 - 0x00007ff81187d000 	C:\Program Files\Java\jdk1.8.0_251\jre\bin\management.dll
0x00007fffe9dc0000 - 0x00007fffe9dd6000 	C:\WINDOWS\system32\napinsp.dll
0x00007fffe5930000 - 0x00007fffe594a000 	C:\WINDOWS\system32\pnrpnsp.dll
0x00007ff8127a0000 - 0x00007ff81286b000 	C:\WINDOWS\SYSTEM32\DNSAPI.dll
0x00007ff814e10000 - 0x00007ff814e18000 	C:\WINDOWS\System32\NSI.dll
0x00007ff812760000 - 0x00007ff81279a000 	C:\WINDOWS\SYSTEM32\IPHLPAPI.DLL
0x00007fffeec60000 - 0x00007fffeec6e000 	C:\WINDOWS\System32\winrnr.dll
0x00007ff80e0c0000 - 0x00007ff80e0dc000 	C:\WINDOWS\system32\NLAapi.dll
0x00007ffff18b0000 - 0x00007ffff18c5000 	C:\WINDOWS\system32\wshbth.dll
0x00007ff80a650000 - 0x00007ff80a65a000 	C:\Windows\System32\rasadhlp.dll
0x00007ff80cef0000 - 0x00007ff80cf67000 	C:\WINDOWS\System32\fwpuclnt.dll
0x00007ff8142a0000 - 0x00007ff8142c6000 	C:\WINDOWS\System32\bcrypt.dll
0x00007ffff47a0000 - 0x00007ffff47b2000 	C:\Program Files\Java\jdk1.8.0_251\jre\bin\nio.dll
0x00007ffff3ac0000 - 0x00007ffff3ae4000 	C:\Program Files\Java\jdk1.8.0_251\jre\bin\sunec.dll
0x00007ff80d8e0000 - 0x00007ff80d8f6000 	C:\WINDOWS\SYSTEM32\dhcpcsvc6.DLL
0x00007ff80d890000 - 0x00007ff80d8ac000 	C:\WINDOWS\SYSTEM32\dhcpcsvc.DLL
0x00007ff8125c0000 - 0x00007ff8125f3000 	C:\WINDOWS\system32\rsaenh.dll
0x00007ff8137b0000 - 0x00007ff8137d5000 	C:\WINDOWS\SYSTEM32\USERENV.dll
0x00007ff812c20000 - 0x00007ff812c2c000 	C:\WINDOWS\SYSTEM32\CRYPTBASE.dll
0x00007ff80b920000 - 0x00007ff80b992000 	C:\Users\titre\AppData\Local\Temp\lwjgltitre\3.2.2-build-10\lwjgl.dll
0x00007fffa3040000 - 0x00007fffa3291000 	C:\Users\titre\AppData\Local\Temp\lwjgltitre\3.2.2-build-10\jemalloc.dll
0x00007ff80b8c0000 - 0x00007ff80b91e000 	C:\Users\titre\AppData\Local\Temp\lwjgltitre\3.2.2-build-10\glfw.dll
0x00007ff810f30000 - 0x00007ff810fc9000 	C:\WINDOWS\system32\uxtheme.dll
0x00007ff80b870000 - 0x00007ff80b8b3000 	C:\WINDOWS\SYSTEM32\dinput8.dll
0x00007ffff3af0000 - 0x00007ffff3b01000 	C:\WINDOWS\SYSTEM32\xinput1_4.dll
0x00007ff813680000 - 0x00007ff8136aa000 	C:\WINDOWS\SYSTEM32\DEVOBJ.dll
0x00007ff811450000 - 0x00007ff81147d000 	C:\WINDOWS\SYSTEM32\dwmapi.dll
0x00007ff8093a0000 - 0x00007ff8094bb000 	C:\WINDOWS\SYSTEM32\inputhost.dll
0x00007ff80ed30000 - 0x00007ff80ee83000 	C:\WINDOWS\SYSTEM32\wintypes.dll
0x00007ff80f510000 - 0x00007ff80f600000 	C:\WINDOWS\SYSTEM32\PROPSYS.dll
0x00007ff814b70000 - 0x00007ff814c34000 	C:\WINDOWS\System32\OLEAUT32.dll
0x00007ff810780000 - 0x00007ff810854000 	C:\WINDOWS\SYSTEM32\CoreMessaging.dll
0x00007ff80d480000 - 0x00007ff80d7aa000 	C:\WINDOWS\SYSTEM32\CoreUIComponents.dll
0x00007ff8131a0000 - 0x00007ff8131d1000 	C:\WINDOWS\SYSTEM32\ntmarta.dll
0x00007ff8164d0000 - 0x00007ff816606000 	C:\WINDOWS\System32\MSCTF.dll
0x00007ff8117f0000 - 0x00007ff8117fe000 	C:\WINDOWS\SYSTEM32\HID.DLL
0x00007ff815c60000 - 0x00007ff8160d0000 	C:\WINDOWS\System32\SETUPAPI.DLL
0x00007ff814a50000 - 0x00007ff814aac000 	C:\WINDOWS\System32\WINTRUST.dll
0x00007ff813970000 - 0x00007ff813982000 	C:\WINDOWS\System32\MSASN1.dll
0x00007ff813bd0000 - 0x00007ff813d19000 	C:\WINDOWS\System32\CRYPT32.dll
0x00007fffdbe00000 - 0x00007fffdbf56000 	C:\WINDOWS\SYSTEM32\opengl32.dll
0x00007fffe3da0000 - 0x00007fffe3dcc000 	C:\WINDOWS\SYSTEM32\GLU32.dll
0x00007ff811ec0000 - 0x00007ff811ee0000 	C:\WINDOWS\SYSTEM32\dxcore.dll
0x00007ffff1bb0000 - 0x00007ffff1bd9000 	C:\WINDOWS\System32\DriverStore\FileRepository\u0354308.inf_amd64_48534036afa0f0d8\B354265\atig6pxx.dll
0x00007fff96260000 - 0x00007fff99326000 	C:\WINDOWS\System32\DriverStore\FileRepository\u0354308.inf_amd64_48534036afa0f0d8\B354265\atio6axx.dll
0x00007ff815410000 - 0x00007ff815567000 	C:\WINDOWS\System32\ole32.dll
0x00007fffdfd90000 - 0x00007fffdfdb3000 	C:\WINDOWS\SYSTEM32\dxva2.dll
0x00007ffff16e0000 - 0x00007ffff171a000 	C:\WINDOWS\System32\DriverStore\FileRepository\u0354308.inf_amd64_48534036afa0f0d8\B354265\atig6txx.dll
0x00007ff8131e0000 - 0x00007ff8133d4000 	C:\WINDOWS\SYSTEM32\dbghelp.dll

VM Arguments:
jvm_args: -Dforge.logging.console.level=debug -Dforge.logging.markers=SCAN,REGISTRIES,REGISTRYDUMP -XX:HeapDumpPath=MojangTricksIntelDriversForPerformance_javaw.exe_minecraft.exe.heapdump -Dos.name=Windows 10 -Dos.version=10.0 -javaagent:C:\Program Files\JetBrains\IntelliJ IDEA Community Edition 2020.1.1\lib\idea_rt.jar=62496:C:\Program Files\JetBrains\IntelliJ IDEA Community Edition 2020.1.1\bin -Dfile.encoding=UTF-8 
java_command: net.minecraftforge.userdev.LaunchTesting
java_class_path (initial): C:\Program Files\Java\jdk1.8.0_251\jre\lib\charsets.jar;C:\Program Files\Java\jdk1.8.0_251\jre\lib\deploy.jar;C:\Program Files\Java\jdk1.8.0_251\jre\lib\ext\access-bridge-64.jar;C:\Program Files\Java\jdk1.8.0_251\jre\lib\ext\cldrdata.jar;C:\Program Files\Java\jdk1.8.0_251\jre\lib\ext\dnsns.jar;C:\Program Files\Java\jdk1.8.0_251\jre\lib\ext\jaccess.jar;C:\Program Files\Java\jdk1.8.0_251\jre\lib\ext\jfxrt.jar;C:\Program Files\Java\jdk1.8.0_251\jre\lib\ext\localedata.jar;C:\Program Files\Java\jdk1.8.0_251\jre\lib\ext\nashorn.jar;C:\Program Files\Java\jdk1.8.0_251\jre\lib\ext\sunec.jar;C:\Program Files\Java\jdk1.8.0_251\jre\lib\ext\sunjce_provider.jar;C:\Program Files\Java\jdk1.8.0_251\jre\lib\ext\sunmscapi.jar;C:\Program Files\Java\jdk1.8.0_251\jre\lib\ext\sunpkcs11.jar;C:\Program Files\Java\jdk1.8.0_251\jre\lib\ext\zipfs.jar;C:\Program Files\Java\jdk1.8.0_251\jre\lib\javaws.jar;C:\Program Files\Java\jdk1.8.0_251\jre\lib\jce.jar;C:\Program Files\Java\jdk1.8.0_251\jre\lib\jfr.jar;C:\Program Files\Java\jdk1.8.0_251\jre\lib\jfxswt.jar;C:\Program Files\Java\jdk1.8.0_251\jre\lib\jsse.jar;C:\Program Files\Java\jdk1.8.0_251\jre\lib\management-agent.jar;C:\Program Files\Java\jdk1.8.0_251\jre\lib\plugin.jar;C:\Program Files\Java\jdk1.8.0_251\jre\lib\resources.jar;C:\Program Files\Java\jdk1.8.0_251\jre\lib\rt.jar;C:\Users\titre\Desktop\Coding-Scripting\MyMinecraftModding\TutorialMod\build\classes\java\main;C:\Users\titre\Desktop\Coding-Scripting\MyMinecraftModding\TutorialMod\build\resources\main;C:\Users\titre\Desktop\Coding-Scripting\MyMinecraftModding\TutorialMod\.gradle\caches\forge_gradle\minecraft_user_repo\net\minecraftforge\forge\1.15.2-31.2.0_mapped_snapshot_20200514-1.15.1\forge-1.15.2-31.2.0_mapped_snapshot_20200514-1.15.1-recomp.jar;C:\Users\titre\Desktop\Coding-Scripting\MyMinecraftModding\TutorialMod\.gradle\caches\forge_gradle\minecraft_user_repo\net\minecraftforge\forge\1.15.2-31.2.0_mapped_snapshot_20200514-1.15.1\forge-1.15.2-31.2.0
Launcher Type: SUN_STANDARD

Environment Variables:
JAVA_HOME=C:\Program Files\Java\jdk1.8.0_251
PATH=C:\Program Files (x86)\Common Files\Oracle\Java\javapath;C:\ProgramData\Oracle\Java\javapath;C:\WINDOWS\system32;C:\WINDOWS;C:\WINDOWS\System32\Wbem;C:\WINDOWS\System32\WindowsPowerShell\v1.0\;c:\Program Files (x86)\ATI Technologies\ATI.ACE\Core-Static;C:\WINDOWS\System32\OpenSSH\;C:\Program Files\nodejs\;C:\Program Files\Intel\WiFi\bin\;C:\Program Files\Common Files\Intel\WirelessCommon\;C:\Users\titre\AppData\Local\Programs\Python\Python38-32;C:\Program Files\Java\jdk1.8.0_251\bin;C:\Program Files (x86)\Java\jdk1.8.0_251\bin;C:\Program Files\Git\cmd;C:\Users\titre\AppData\Local\Programs\Python\Python38-32\Scripts;C:\Program Files\JetBrains\IntelliJ IDEA Community Edition 2020.1.1\bin;
USERNAME=titre
OS=Windows_NT
PROCESSOR_IDENTIFIER=AMD64 Family 21 Model 96 Stepping 1, AuthenticAMD



---------------  S Y S T E M  ---------------

OS: Windows 10.0 , 64 bit Build 18362 (10.0.18362.778)

CPU:total 4 (initial active 4) (4 cores per cpu, 1 threads per core) family 21 model 96 stepping 1, cmov, cx8, fxsr, mmx, sse, sse2, sse3, ssse3, sse4.1, sse4.2, popcnt, avx, avx2, aes, clmul, mmxext, 3dnowpref, lzcnt, sse4a, tsc, tscinvbit, tscinv, bmi1

Memory: 4k page, physical 7816456k(1025988k free), swap 15459848k(2704828k free)

vm_info: Java HotSpot(TM) 64-Bit Server VM (25.251-b08) for windows-amd64 JRE (1.8.0_251-b08), built on Mar 12 2020 06:31:49 by "" with MS VC++ 10.0 (VS2010)

time: Fri May 29 16:51:58 2020
timezone: GMT Summer Time
elapsed time: 6 seconds (0d 0h 0m 6s)

 

Link to post
Share on other sites
8 hours ago, diesieben07 said:

Seems like your graphics card drivers don't like FML's "early startup" window.

Put -Dfml.earlyprogresswindow=false into your JVM args.

Thank you so much :)I updated my graphic card driver as well and now it seems that I can run my mod. Thank you again, I appreciate your help

Link to post
Share on other sites
  • 1 month later...

17:20:38.053 [ERROR] [org.gradle.internal.buildevents.BuildExceptionReporter]
17:20:38.054 [ERROR] [org.gradle.internal.buildevents.BuildExceptionReporter] FAILURE: Build failed with an exception.
17:20:38.054 [ERROR] [org.gradle.internal.buildevents.BuildExceptionReporter]
17:20:38.054 [ERROR] [org.gradle.internal.buildevents.BuildExceptionReporter] * What went wrong:
17:20:38.055 [ERROR] [org.gradle.internal.buildevents.BuildExceptionReporter] A problem occurred configuring root project 'AutoMatica'.
17:20:38.055 [ERROR] [org.gradle.internal.buildevents.BuildExceptionReporter] > Invalid patcher dependency: net.minecraftforge:forge:1.15.2-31.2.0:userdev
17:20:38.055 [ERROR] [org.gradle.internal.buildevents.BuildExceptionReporter]
17:20:38.055 [ERROR] [org.gradle.internal.buildevents.BuildExceptionReporter] * Try:
17:20:38.055 [ERROR] [org.gradle.internal.buildevents.BuildExceptionReporter]  Run with --scan to get full insights.
17:20:38.056 [ERROR] [org.gradle.internal.buildevents.BuildExceptionReporter]
17:20:38.056 [ERROR] [org.gradle.internal.buildevents.BuildExceptionReporter] * Exception is:
17:20:38.057 [ERROR] [org.gradle.internal.buildevents.BuildExceptionReporter] org.gradle.api.ProjectConfigurationException: A problem occurred configuring root project 'AutoMatica'.
17:20:38.057 [ERROR] [org.gradle.internal.buildevents.BuildExceptionReporter]   at org.gradle.configuration.project.LifecycleProjectEvaluator.wrapException(LifecycleProjectEvaluator.java:79)
17:20:38.057 [ERROR] [org.gradle.internal.buildevents.BuildExceptionReporter]   at org.gradle.configuration.project.LifecycleProjectEvaluator.addConfigurationFailure(LifecycleProjectEvaluator.java:73)
17:20:38.058 [ERROR] [org.gradle.internal.buildevents.BuildExceptionReporter]   at org.gradle.configuration.project.LifecycleProjectEvaluator.access$400(LifecycleProjectEvaluator.java:54)
17:20:38.058 [ERROR] [org.gradle.internal.buildevents.BuildExceptionReporter]   at org.gradle.configuration.project.LifecycleProjectEvaluator$NotifyAfterEvaluate.run(LifecycleProjectEvaluator.java:200)
17:20:38.058 [ERROR] [org.gradle.internal.buildevents.BuildExceptionReporter]   at org.gradle.internal.operations.DefaultBuildOperationExecutor$RunnableBuildOperationWorker.execute(DefaultBuildOperationExecutor.java:301)
17:20:38.058 [ERROR] [org.gradle.internal.buildevents.BuildExceptionReporter]   at org.gradle.internal.operations.DefaultBuildOperationExecutor$RunnableBuildOperationWorker.execute(DefaultBuildOperationExecutor.java:293)
17:20:38.058 [ERROR] [org.gradle.internal.buildevents.BuildExceptionReporter]   at org.gradle.internal.operations.DefaultBuildOperationExecutor.execute(DefaultBuildOperationExecutor.java:175)
17:20:38.058 [ERROR] [org.gradle.internal.buildevents.BuildExceptionReporter]   at org.gradle.internal.operations.DefaultBuildOperationExecutor.run(DefaultBuildOperationExecutor.java:91)
17:20:38.058 [ERROR] [org.gradle.internal.buildevents.BuildExceptionReporter]   at org.gradle.internal.operations.DelegatingBuildOperationExecutor.run(DelegatingBuildOperationExecutor.java:31)
17:20:38.059 [ERROR] [org.gradle.internal.buildevents.BuildExceptionReporter]   at org.gradle.configuration.project.LifecycleProjectEvaluator$EvaluateProject.run(LifecycleProjectEvaluator.java:110)
17:20:38.059 [ERROR] [org.gradle.internal.buildevents.BuildExceptionReporter]   at org.gradle.internal.operations.DefaultBuildOperationExecutor$RunnableBuildOperationWorker.execute(DefaultBuildOperationExecutor.java:301)
17:20:38.059 [ERROR] [org.gradle.internal.buildevents.BuildExceptionReporter]   at org.gradle.internal.operations.DefaultBuildOperationExecutor$RunnableBuildOperationWorker.execute(DefaultBuildOperationExecutor.java:293)
17:20:38.059 [ERROR] [org.gradle.internal.buildevents.BuildExceptionReporter]   at org.gradle.internal.operations.DefaultBuildOperationExecutor.execute(DefaultBuildOperationExecutor.java:175)
17:20:38.059 [ERROR] [org.gradle.internal.buildevents.BuildExceptionReporter]   at org.gradle.internal.operations.DefaultBuildOperationExecutor.run(DefaultBuildOperationExecutor.java:91)
17:20:38.059 [ERROR] [org.gradle.internal.buildevents.BuildExceptionReporter]   at org.gradle.internal.operations.DelegatingBuildOperationExecutor.run(DelegatingBuildOperationExecutor.java:31)
17:20:38.059 [ERROR] [org.gradle.internal.buildevents.BuildExceptionReporter]   at org.gradle.configuration.project.LifecycleProjectEvaluator.evaluate(LifecycleProjectEvaluator.java:68)
17:20:38.060 [ERROR] [org.gradle.internal.buildevents.BuildExceptionReporter]   at org.gradle.api.internal.project.DefaultProject.evaluate(DefaultProject.java:687)
17:20:38.060 [ERROR] [org.gradle.internal.buildevents.BuildExceptionReporter]   at org.gradle.api.internal.project.DefaultProject.evaluate(DefaultProject.java:140)
17:20:38.060 [ERROR] [org.gradle.internal.buildevents.BuildExceptionReporter]   at org.gradle.execution.TaskPathProjectEvaluator.configure(TaskPathProjectEvaluator.java:35)
17:20:38.060 [ERROR] [org.gradle.internal.buildevents.BuildExceptionReporter]   at org.gradle.execution.TaskPathProjectEvaluator.configureHierarchy(TaskPathProjectEvaluator.java:60)
17:20:38.060 [ERROR] [org.gradle.internal.buildevents.BuildExceptionReporter]   at org.gradle.configuration.DefaultBuildConfigurer.configure(DefaultBuildConfigurer.java:41)
17:20:38.060 [ERROR] [org.gradle.internal.buildevents.BuildExceptionReporter]   at org.gradle.initialization.DefaultGradleLauncher$ConfigureBuild.run(DefaultGradleLauncher.java:274)
17:20:38.060 [ERROR] [org.gradle.internal.buildevents.BuildExceptionReporter]   at org.gradle.internal.operations.DefaultBuildOperationExecutor$RunnableBuildOperationWorker.execute(DefaultBuildOperationExecutor.java:301)
17:20:38.061 [ERROR] [org.gradle.internal.buildevents.BuildExceptionReporter]   at org.gradle.internal.operations.DefaultBuildOperationExecutor$RunnableBuildOperationWorker.execute(DefaultBuildOperationExecutor.java:293)
17:20:38.061 [ERROR] [org.gradle.internal.buildevents.BuildExceptionReporter]   at org.gradle.internal.operations.DefaultBuildOperationExecutor.execute(DefaultBuildOperationExecutor.java:175)
17:20:38.061 [ERROR] [org.gradle.internal.buildevents.BuildExceptionReporter]   at org.gradle.internal.operations.DefaultBuildOperationExecutor.run(DefaultBuildOperationExecutor.java:91)
17:20:38.061 [ERROR] [org.gradle.internal.buildevents.BuildExceptionReporter]   at org.gradle.internal.operations.DelegatingBuildOperationExecutor.run(DelegatingBuildOperationExecutor.java:31)
17:20:38.061 [ERROR] [org.gradle.internal.buildevents.BuildExceptionReporter]   at org.gradle.initialization.DefaultGradleLauncher.configureBuild(DefaultGradleLauncher.java:182)
17:20:38.061 [ERROR] [org.gradle.internal.buildevents.BuildExceptionReporter]   at org.gradle.initialization.DefaultGradleLauncher.doBuildStages(DefaultGradleLauncher.java:141)
17:20:38.062 [ERROR] [org.gradle.internal.buildevents.BuildExceptionReporter]   at org.gradle.initialization.DefaultGradleLauncher.executeTasks(DefaultGradleLauncher.java:124)
17:20:38.062 [ERROR] [org.gradle.internal.buildevents.BuildExceptionReporter]   at org.gradle.internal.invocation.GradleBuildController$1.call(GradleBuildController.java:77)
17:20:38.062 [ERROR] [org.gradle.internal.buildevents.BuildExceptionReporter]   at org.gradle.internal.invocation.GradleBuildController$1.call(GradleBuildController.java:74)
17:20:38.062 [ERROR] [org.gradle.internal.buildevents.BuildExceptionReporter]   at org.gradle.internal.work.DefaultWorkerLeaseService.withLocks(DefaultWorkerLeaseService.java:154)
17:20:38.062 [ERROR] [org.gradle.internal.buildevents.BuildExceptionReporter]   at org.gradle.internal.work.StopShieldingWorkerLeaseService.withLocks(StopShieldingWorkerLeaseService.java:38)
17:20:38.062 [ERROR] [org.gradle.internal.buildevents.BuildExceptionReporter]   at org.gradle.internal.invocation.GradleBuildController.doBuild(GradleBuildController.java:96)
17:20:38.063 [ERROR] [org.gradle.internal.buildevents.BuildExceptionReporter]   at org.gradle.internal.invocation.GradleBuildController.run(GradleBuildController.java:74)
17:20:38.063 [ERROR] [org.gradle.internal.buildevents.BuildExceptionReporter]   at org.gradle.tooling.internal.provider.ExecuteBuildActionRunner.run(ExecuteBuildActionRunner.java:28)
17:20:38.063 [ERROR] [org.gradle.internal.buildevents.BuildExceptionReporter]   at org.gradle.launcher.exec.ChainingBuildActionRunner.run(ChainingBuildActionRunner.java:35)
17:20:38.063 [ERROR] [org.gradle.internal.buildevents.BuildExceptionReporter]   at org.gradle.tooling.internal.provider.ValidatingBuildActionRunner.run(ValidatingBuildActionRunner.java:32)
17:20:38.063 [ERROR] [org.gradle.internal.buildevents.BuildExceptionReporter]   at org.gradle.launcher.exec.RunAsBuildOperationBuildActionRunner$3.run(RunAsBuildOperationBuildActionRunner.java:50)
17:20:38.063 [ERROR] [org.gradle.internal.buildevents.BuildExceptionReporter]   at org.gradle.internal.operations.DefaultBuildOperationExecutor$RunnableBuildOperationWorker.execute(DefaultBuildOperationExecutor.java:301)
17:20:38.064 [ERROR] [org.gradle.internal.buildevents.BuildExceptionReporter]   at org.gradle.internal.operations.DefaultBuildOperationExecutor$RunnableBuildOperationWorker.execute(DefaultBuildOperationExecutor.java:293)
17:20:38.064 [ERROR] [org.gradle.internal.buildevents.BuildExceptionReporter]   at org.gradle.internal.operations.DefaultBuildOperationExecutor.execute(DefaultBuildOperationExecutor.java:175)
17:20:38.064 [ERROR] [org.gradle.internal.buildevents.BuildExceptionReporter]   at org.gradle.internal.operations.DefaultBuildOperationExecutor.run(DefaultBuildOperationExecutor.java:91)
17:20:38.064 [ERROR] [org.gradle.internal.buildevents.BuildExceptionReporter]   at org.gradle.internal.operations.DelegatingBuildOperationExecutor.run(DelegatingBuildOperationExecutor.java:31)
17:20:38.064 [ERROR] [org.gradle.internal.buildevents.BuildExceptionReporter]   at org.gradle.launcher.exec.RunAsBuildOperationBuildActionRunner.run(RunAsBuildOperationBuildActionRunner.java:45)
17:20:38.065 [ERROR] [org.gradle.internal.buildevents.BuildExceptionReporter]   at org.gradle.tooling.internal.provider.SubscribableBuildActionRunner.run(SubscribableBuildActionRunner.java:51)
17:20:38.065 [ERROR] [org.gradle.internal.buildevents.BuildExceptionReporter]   at org.gradle.launcher.exec.InProcessBuildActionExecuter$1.transform(InProcessBuildActionExecuter.java:47)
17:20:38.065 [ERROR] [org.gradle.internal.buildevents.BuildExceptionReporter]   at org.gradle.launcher.exec.InProcessBuildActionExecuter$1.transform(InProcessBuildActionExecuter.java:44)
17:20:38.065 [ERROR] [org.gradle.internal.buildevents.BuildExceptionReporter]   at org.gradle.composite.internal.DefaultRootBuildState.run(DefaultRootBuildState.java:79)
17:20:38.065 [ERROR] [org.gradle.internal.buildevents.BuildExceptionReporter]   at org.gradle.launcher.exec.InProcessBuildActionExecuter.execute(InProcessBuildActionExecuter.java:44)
17:20:38.066 [ERROR] [org.gradle.internal.buildevents.BuildExceptionReporter]   at org.gradle.launcher.exec.InProcessBuildActionExecuter.execute(InProcessBuildActionExecuter.java:30)
17:20:38.066 [ERROR] [org.gradle.internal.buildevents.BuildExceptionReporter]   at org.gradle.launcher.exec.BuildTreeScopeBuildActionExecuter.execute(BuildTreeScopeBuildActionExecuter.java:39)
17:20:38.066 [ERROR] [org.gradle.internal.buildevents.BuildExceptionReporter]   at org.gradle.launcher.exec.BuildTreeScopeBuildActionExecuter.execute(BuildTreeScopeBuildActionExecuter.java:25)
17:20:38.066 [ERROR] [org.gradle.internal.buildevents.BuildExceptionReporter]   at org.gradle.tooling.internal.provider.ContinuousBuildActionExecuter.execute(ContinuousBuildActionExecuter.java:80)
17:20:38.067 [ERROR] [org.gradle.internal.buildevents.BuildExceptionReporter]   at org.gradle.tooling.internal.provider.ContinuousBuildActionExecuter.execute(ContinuousBuildActionExecuter.java:53)
17:20:38.067 [ERROR] [org.gradle.internal.buildevents.BuildExceptionReporter]   at org.gradle.tooling.internal.provider.ServicesSetupBuildActionExecuter.execute(ServicesSetupBuildActionExecuter.java:62)
17:20:38.067 [ERROR] [org.gradle.internal.buildevents.BuildExceptionReporter]   at org.gradle.tooling.internal.provider.ServicesSetupBuildActionExecuter.execute(ServicesSetupBuildActionExecuter.java:34)
17:20:38.067 [ERROR] [org.gradle.internal.buildevents.BuildExceptionReporter]   at org.gradle.tooling.internal.provider.GradleThreadBuildActionExecuter.execute(GradleThreadBuildActionExecuter.java:36)
17:20:38.067 [ERROR] [org.gradle.internal.buildevents.BuildExceptionReporter]   at org.gradle.tooling.internal.provider.GradleThreadBuildActionExecuter.execute(GradleThreadBuildActionExecuter.java:25)
17:20:38.067 [ERROR] [org.gradle.internal.buildevents.BuildExceptionReporter]   at org.gradle.tooling.internal.provider.ParallelismConfigurationBuildActionExecuter.execute(ParallelismConfigurationBuildActionExecuter.java:43)
17:20:38.068 [ERROR] [org.gradle.internal.buildevents.BuildExceptionReporter]   at org.gradle.tooling.internal.provider.ParallelismConfigurationBuildActionExecuter.execute(ParallelismConfigurationBuildActionExecuter.java:29)
17:20:38.068 [ERROR] [org.gradle.internal.buildevents.BuildExceptionReporter]   at org.gradle.tooling.internal.provider.StartParamsValidatingActionExecuter.execute(StartParamsValidatingActionExecuter.java:59)
17:20:38.068 [ERROR] [org.gradle.internal.buildevents.BuildExceptionReporter]   at org.gradle.tooling.internal.provider.StartParamsValidatingActionExecuter.execute(StartParamsValidatingActionExecuter.java:31)
17:20:38.068 [ERROR] [org.gradle.internal.buildevents.BuildExceptionReporter]   at org.gradle.tooling.internal.provider.SessionFailureReportingActionExecuter.execute(SessionFailureReportingActionExecuter.java:59)
17:20:38.068 [ERROR] [org.gradle.internal.buildevents.BuildExceptionReporter]   at org.gradle.tooling.internal.provider.SessionFailureReportingActionExecuter.execute(SessionFailureReportingActionExecuter.java:44)
17:20:38.068 [ERROR] [org.gradle.internal.buildevents.BuildExceptionReporter]   at org.gradle.tooling.internal.provider.SetupLoggingActionExecuter.execute(SetupLoggingActionExecuter.java:46)
17:20:38.068 [ERROR] [org.gradle.internal.buildevents.BuildExceptionReporter]   at org.gradle.tooling.internal.provider.SetupLoggingActionExecuter.execute(SetupLoggingActionExecuter.java:30)
17:20:38.068 [ERROR] [org.gradle.internal.buildevents.BuildExceptionReporter]   at org.gradle.launcher.daemon.server.exec.ExecuteBuild.doBuild(ExecuteBuild.java:67)
17:20:38.068 [ERROR] [org.gradle.internal.buildevents.BuildExceptionReporter]   at org.gradle.launcher.daemon.server.exec.BuildCommandOnly.execute(BuildCommandOnly.java:36)
17:20:38.069 [ERROR] [org.gradle.internal.buildevents.BuildExceptionReporter]   at org.gradle.launcher.daemon.server.api.DaemonCommandExecution.proceed(DaemonCommandExecution.java:122)
17:20:38.069 [ERROR] [org.gradle.internal.buildevents.BuildExceptionReporter]   at org.gradle.launcher.daemon.server.exec.WatchForDisconnection.execute(WatchForDisconnection.java:37)
17:20:38.069 [ERROR] [org.gradle.internal.buildevents.BuildExceptionReporter]   at org.gradle.launcher.daemon.server.api.DaemonCommandExecution.proceed(DaemonCommandExecution.java:122)
17:20:38.069 [ERROR] [org.gradle.internal.buildevents.BuildExceptionReporter]   at org.gradle.launcher.daemon.server.exec.ResetDeprecationLogger.execute(ResetDeprecationLogger.java:26)
17:20:38.069 [ERROR] [org.gradle.internal.buildevents.BuildExceptionReporter]   at org.gradle.launcher.daemon.server.api.DaemonCommandExecution.proceed(DaemonCommandExecution.java:122)
17:20:38.069 [ERROR] [org.gradle.internal.buildevents.BuildExceptionReporter]   at org.gradle.launcher.daemon.server.exec.RequestStopIfSingleUsedDaemon.execute(RequestStopIfSingleUsedDaemon.java:34)
17:20:38.069 [ERROR] [org.gradle.internal.buildevents.BuildExceptionReporter]   at org.gradle.launcher.daemon.server.api.DaemonCommandExecution.proceed(DaemonCommandExecution.java:122)
17:20:38.069 [ERROR] [org.gradle.internal.buildevents.BuildExceptionReporter]   at org.gradle.launcher.daemon.server.exec.ForwardClientInput$2.call(ForwardClientInput.java:74)
17:20:38.070 [ERROR] [org.gradle.internal.buildevents.BuildExceptionReporter]   at org.gradle.launcher.daemon.server.exec.ForwardClientInput$2.call(ForwardClientInput.java:72)
17:20:38.070 [ERROR] [org.gradle.internal.buildevents.BuildExceptionReporter]   at org.gradle.util.Swapper.swap(Swapper.java:38)
17:20:38.070 [ERROR] [org.gradle.internal.buildevents.BuildExceptionReporter]   at org.gradle.launcher.daemon.server.exec.ForwardClientInput.execute(ForwardClientInput.java:72)
17:20:38.070 [ERROR] [org.gradle.internal.buildevents.BuildExceptionReporter]   at org.gradle.launcher.daemon.server.api.DaemonCommandExecution.proceed(DaemonCommandExecution.java:122)
17:20:38.070 [ERROR] [org.gradle.internal.buildevents.BuildExceptionReporter]   at org.gradle.launcher.daemon.server.exec.LogAndCheckHealth.execute(LogAndCheckHealth.java:50)
17:20:38.070 [ERROR] [org.gradle.internal.buildevents.BuildExceptionReporter]   at org.gradle.launcher.daemon.server.api.DaemonCommandExecution.proceed(DaemonCommandExecution.java:122)
17:20:38.070 [ERROR] [org.gradle.internal.buildevents.BuildExceptionReporter]   at org.gradle.launcher.daemon.server.exec.LogToClient.doBuild(LogToClient.java:62)
17:20:38.070 [ERROR] [org.gradle.internal.buildevents.BuildExceptionReporter]   at org.gradle.launcher.daemon.server.exec.BuildCommandOnly.execute(BuildCommandOnly.java:36)
17:20:38.071 [ERROR] [org.gradle.internal.buildevents.BuildExceptionReporter]   at org.gradle.launcher.daemon.server.api.DaemonCommandExecution.proceed(DaemonCommandExecution.java:122)
17:20:38.071 [ERROR] [org.gradle.internal.buildevents.BuildExceptionReporter]   at org.gradle.launcher.daemon.server.exec.EstablishBuildEnvironment.doBuild(EstablishBuildEnvironment.java:81)
17:20:38.071 [ERROR] [org.gradle.internal.buildevents.BuildExceptionReporter]   at org.gradle.launcher.daemon.server.exec.BuildCommandOnly.execute(BuildCommandOnly.java:36)
17:20:38.071 [ERROR] [org.gradle.internal.buildevents.BuildExceptionReporter]   at org.gradle.launcher.daemon.server.api.DaemonCommandExecution.proceed(DaemonCommandExecution.java:122)
17:20:38.071 [ERROR] [org.gradle.internal.buildevents.BuildExceptionReporter]   at org.gradle.launcher.daemon.server.exec.StartBuildOrRespondWithBusy$1.run(StartBuildOrRespondWithBusy.java:50)
17:20:38.071 [ERROR] [org.gradle.internal.buildevents.BuildExceptionReporter]   at org.gradle.launcher.daemon.server.DaemonStateCoordinator$1.run(DaemonStateCoordinator.java:295)
17:20:38.071 [ERROR] [org.gradle.internal.buildevents.BuildExceptionReporter]   at org.gradle.internal.concurrent.ExecutorPolicy$CatchAndRecordFailures.onExecute(ExecutorPolicy.java:63)
17:20:38.072 [ERROR] [org.gradle.internal.buildevents.BuildExceptionReporter]   at org.gradle.internal.concurrent.ManagedExecutorImpl$1.run(ManagedExecutorImpl.java:46)
17:20:38.072 [ERROR] [org.gradle.internal.buildevents.BuildExceptionReporter]   at org.gradle.internal.concurrent.ThreadFactoryImpl$ManagedThreadRunnable.run(ThreadFactoryImpl.java:55)
17:20:38.072 [ERROR] [org.gradle.internal.buildevents.BuildExceptionReporter] Caused by: java.lang.RuntimeException: Invalid patcher dependency: net.minecraftforge:forge:1.15.2-31.2.0:userdev
17:20:38.072 [ERROR] [org.gradle.internal.buildevents.BuildExceptionReporter]   at net.minecraftforge.gradle.userdev.MinecraftUserRepo$Patcher.<init>(MinecraftUserRepo.java:1353)
17:20:38.072 [ERROR] [org.gradle.internal.buildevents.BuildExceptionReporter]   at net.minecraftforge.gradle.userdev.MinecraftUserRepo$Patcher.<init>(MinecraftUserRepo.java:1303)
17:20:38.072 [ERROR] [org.gradle.internal.buildevents.BuildExceptionReporter]   at net.minecraftforge.gradle.userdev.MinecraftUserRepo.getParents(MinecraftUserRepo.java:355)
17:20:38.072 [ERROR] [org.gradle.internal.buildevents.BuildExceptionReporter]   at net.minecraftforge.gradle.userdev.MinecraftUserRepo.validate(MinecraftUserRepo.java:175)
17:20:38.072 [ERROR] [org.gradle.internal.buildevents.BuildExceptionReporter]   at net.minecraftforge.gradle.userdev.UserDevPlugin.lambda$apply$18(UserDevPlugin.java:286)
17:20:38.073 [ERROR] [org.gradle.internal.buildevents.BuildExceptionReporter]   at org.gradle.configuration.internal.DefaultListenerBuildOperationDecorator$BuildOperationEmittingAction$1$1.run(DefaultListenerBuildOperationDecorator.java:157)
17:20:38.073 [ERROR] [org.gradle.internal.buildevents.BuildExceptionReporter]   at org.gradle.configuration.internal.DefaultUserCodeApplicationContext.reapply(DefaultUserCodeApplicationContext.java:58)
17:20:38.073 [ERROR] [org.gradle.internal.buildevents.BuildExceptionReporter]   at org.gradle.configuration.internal.DefaultListenerBuildOperationDecorator$BuildOperationEmittingAction$1.run(DefaultListenerBuildOperationDecorator.java:154)
17:20:38.073 [ERROR] [org.gradle.internal.buildevents.BuildExceptionReporter]   at org.gradle.internal.operations.DefaultBuildOperationExecutor$RunnableBuildOperationWorker.execute(DefaultBuildOperationExecutor.java:301)
17:20:38.073 [ERROR] [org.gradle.internal.buildevents.BuildExceptionReporter]   at org.gradle.internal.operations.DefaultBuildOperationExecutor$RunnableBuildOperationWorker.execute(DefaultBuildOperationExecutor.java:293)
17:20:38.073 [ERROR] [org.gradle.internal.buildevents.BuildExceptionReporter]   at org.gradle.internal.operations.DefaultBuildOperationExecutor.execute(DefaultBuildOperationExecutor.java:175)
17:20:38.073 [ERROR] [org.gradle.internal.buildevents.BuildExceptionReporter]   at org.gradle.internal.operations.DefaultBuildOperationExecutor.run(DefaultBuildOperationExecutor.java:91)
17:20:38.074 [ERROR] [org.gradle.internal.buildevents.BuildExceptionReporter]   at org.gradle.configuration.internal.DefaultListenerBuildOperationDecorator$BuildOperationEmittingAction.execute(DefaultListenerBuildOperationDecorator.java:151)
17:20:38.074 [ERROR] [org.gradle.internal.buildevents.BuildExceptionReporter]   at org.gradle.internal.event.BroadcastDispatch$ActionInvocationHandler.dispatch(BroadcastDispatch.java:91)
17:20:38.074 [ERROR] [org.gradle.internal.buildevents.BuildExceptionReporter]   at org.gradle.internal.event.BroadcastDispatch$ActionInvocationHandler.dispatch(BroadcastDispatch.java:80)
17:20:38.074 [ERROR] [org.gradle.internal.buildevents.BuildExceptionReporter]   at org.gradle.internal.event.AbstractBroadcastDispatch.dispatch(AbstractBroadcastDispatch.java:42)
17:20:38.074 [ERROR] [org.gradle.internal.buildevents.BuildExceptionReporter]   at org.gradle.internal.event.BroadcastDispatch$SingletonDispatch.dispatch(BroadcastDispatch.java:230)
17:20:38.074 [ERROR] [org.gradle.internal.buildevents.BuildExceptionReporter]   at org.gradle.internal.event.BroadcastDispatch$SingletonDispatch.dispatch(BroadcastDispatch.java:149)
17:20:38.074 [ERROR] [org.gradle.internal.buildevents.BuildExceptionReporter]   at org.gradle.internal.event.AbstractBroadcastDispatch.dispatch(AbstractBroadcastDispatch.java:58)
17:20:38.074 [ERROR] [org.gradle.internal.buildevents.BuildExceptionReporter]   at org.gradle.internal.event.BroadcastDispatch$CompositeDispatch.dispatch(BroadcastDispatch.java:324)
17:20:38.075 [ERROR] [org.gradle.internal.buildevents.BuildExceptionReporter]   at org.gradle.internal.event.BroadcastDispatch$CompositeDispatch.dispatch(BroadcastDispatch.java:234)
17:20:38.075 [ERROR] [org.gradle.internal.buildevents.BuildExceptionReporter]   at org.gradle.internal.event.ListenerBroadcast.dispatch(ListenerBroadcast.java:140)
17:20:38.075 [ERROR] [org.gradle.internal.buildevents.BuildExceptionReporter]   at org.gradle.internal.event.ListenerBroadcast.dispatch(ListenerBroadcast.java:37)
17:20:38.075 [ERROR] [org.gradle.internal.buildevents.BuildExceptionReporter]   at org.gradle.internal.dispatch.ProxyDispatchAdapter$DispatchingInvocationHandler.invoke(ProxyDispatchAdapter.java:93)
17:20:38.075 [ERROR] [org.gradle.internal.buildevents.BuildExceptionReporter]   at com.sun.proxy.$Proxy28.afterEvaluate(Unknown Source)
17:20:38.075 [ERROR] [org.gradle.internal.buildevents.BuildExceptionReporter]   at org.gradle.configuration.project.LifecycleProjectEvaluator$NotifyAfterEvaluate$1.execute(LifecycleProjectEvaluator.java:187)
17:20:38.075 [ERROR] [org.gradle.internal.buildevents.BuildExceptionReporter]   at org.gradle.configuration.project.LifecycleProjectEvaluator$NotifyAfterEvaluate$1.execute(LifecycleProjectEvaluator.java:184)
17:20:38.076 [ERROR] [org.gradle.internal.buildevents.BuildExceptionReporter]   at org.gradle.api.internal.project.DefaultProject.stepEvaluationListener(DefaultProject.java:1418)
17:20:38.076 [ERROR] [org.gradle.internal.buildevents.BuildExceptionReporter]   at org.gradle.configuration.project.LifecycleProjectEvaluator$NotifyAfterEvaluate.run(LifecycleProjectEvaluator.java:193)
17:20:38.076 [ERROR] [org.gradle.internal.buildevents.BuildExceptionReporter]   ... 91 more
17:20:38.076 [ERROR] [org.gradle.internal.buildevents.BuildExceptionReporter] Caused by: java.util.zip.ZipException: error in opening zip file
17:20:38.076 [ERROR] [org.gradle.internal.buildevents.BuildExceptionReporter]   at net.minecraftforge.gradle.common.util.Utils.getZipData(Utils.java:315)
17:20:38.076 [ERROR] [org.gradle.internal.buildevents.BuildExceptionReporter]   at net.minecraftforge.gradle.userdev.MinecraftUserRepo$Patcher.<init>(MinecraftUserRepo.java:1321)
17:20:38.076 [ERROR] [org.gradle.internal.buildevents.BuildExceptionReporter]   ... 119 more
17:20:38.076 [ERROR] [org.gradle.internal.buildevents.BuildExceptionReporter]
17:20:38.077 [ERROR] [org.gradle.internal.buildevents.BuildExceptionReporter]
17:20:38.077 [ERROR] [org.gradle.internal.buildevents.BuildExceptionReporter] * Get more help at https://help.gradle.org
17:20:38.077 [WARN] [org.gradle.internal.featurelifecycle.LoggingDeprecatedFeatureHandler]
Deprecated Gradle features were used in this build, making it incompatible with Gradle 5.0.
Use '--warning-mode all' to show the individual deprecation warnings.
See https://docs.gradle.org/4.10.3/userguide/command_line_interface.html#sec:command_line_warnings
17:20:38.078 [ERROR] [org.gradle.internal.buildevents.BuildResultLogger]
17:20:38.079 [ERROR] [org.gradle.internal.buildevents.BuildResultLogger] BUILD FAILED in 8s
17:20:38.099 [QUIET] [com.gradle.scan.plugin.BuildScanPlugin]
Publishing a build scan to scans.gradle.com requires accepting the Gradle Terms of Service defined at https://gradle.com/terms-of-service. Do you accept these terms? [yes, no]
    

 

Link to post
Share on other sites

Join the conversation

You can post now and register later. If you have an account, sign in now to post with your account.

Guest
Reply to this topic...

×   Pasted as rich text.   Restore formatting

  Only 75 emoji are allowed.

×   Your link has been automatically embedded.   Display as a link instead

×   Your previous content has been restored.   Clear editor

×   You cannot paste images directly. Upload or insert images from URL.



  • Recently Browsing

    No registered users viewing this page.

  • Posts

    • when i joing the server to my friend i get this error.Minecraft 1.16.5.Mods is identical. latest.log
    • so i got custom signs to work if i use a vanilla wood type. when i try and add my own wood type i get an error upon loading a world that states that theres missing registered blocks when there present   @Mod(NetherFarming.MOD_ID) public class ModWoodTypes { public static final String MOD_ID = "netherfarming"; public static final WoodType BLOODBARK = WoodType.create(new ResourceLocation(MOD_ID, "signs").toString()); private void clientSetup(final FMLClientSetupEvent event) { ClientRegistry.bindTileEntityRenderer(ModTileEntitites.SIGN_TILE_ENTITIES.get(), SignTileEntityRenderer::new); event.enqueueWork(() -> { Atlases.addWoodType(BLOODBARK); }); } private void commonSetup(final FMLCommonSetupEvent event) { event.enqueueWork(() -> WoodType.register(BLOODBARK)); } } full project code (minus the custom woodtype code https://github.com/TamsynnImogen/NetherFarming
    • I'm using Geckolib and I was strugglig while trying to make this work. My code: public class ExampleEntity extends CreatureEntity implements IAnimatable { private AnimationFactory factory = new AnimationFactory(this); public ExampleEntity(EntityType<? extends CreatureEntity> type, World worldIn) { super(type, worldIn); this.ignoreFrustumCheck = true; // TODO Auto-generated constructor stub } public static AttributeModifierMap.MutableAttribute setAttributes() { return CreatureEntity.func_233666_p_().createMutableAttribute(Attributes.MAX_HEALTH, 20.0f) .createMutableAttribute(Attributes.MOVEMENT_SPEED, 0.2f); } @Override protected void registerGoals() { super.registerGoals(); this.goalSelector.addGoal(0, new SwimGoal(this)); this.goalSelector.addGoal(1, new PanicGoal(this, 3.45d)); this.goalSelector.addGoal(2, new LookRandomlyGoal(this)); this.goalSelector.addGoal(3, new LookAtGoal(this, PlayerEntity.class, 8.0f)); this.goalSelector.addGoal(4, new WaterAvoidingRandomWalkingGoal(this, 0.2d, 1000f)); } @Override protected int getExperiencePoints(PlayerEntity player) { // TODO Auto-generated method stub return 10; } @Override protected SoundEvent getDeathSound() { // TODO Auto-generated method stub return SoundEvents.ENTITY_HOGLIN_DEATH; } public boolean isPanic() { return this.goalSelector.getRunningGoals().anyMatch(goal -> goal.getGoal().getClass() == PanicGoal.class); } private <E extends IAnimatable> PlayState predicate(AnimationEvent<E> event) { if(isPanic()) { event.getController().setAnimation(new AnimationBuilder().addAnimation("animation.example.panic", true)); return PlayState.CONTINUE; } if (this.prevPosX == this.getPosX() && this.prevPosY == this.getPosY() && this.prevPosZ == this.getPosZ()) { event.getController().setAnimation(new AnimationBuilder().addAnimation("animation.example.nod", true)); return PlayState.CONTINUE; } else { event.getController().setAnimation(new AnimationBuilder().addAnimation("animation.example.walk", true)); return PlayState.CONTINUE; } } @Override public void registerControllers(AnimationData data) { data.addAnimationController(new AnimationController(this, "controller", 0, this::predicate)); } @Override public AnimationFactory getFactory() { return this.factory; } }  
    • yes if you store the value in a static final field? yes this is basic java
  • Topics

  • Who's Online (See full list)

×
×
  • Create New...

Important Information

By using this site, you agree to our Privacy Policy.