Jump to content
Search In
  • More options...
Find results that contain...
Find results in...

MadCat

Members
  • Posts

    2
  • Joined

  • Last visited

MadCat's Achievements

Tree Puncher

Tree Puncher (2/8)

0

Reputation

  1. I am trying to make the entire world only one block wide, and I think i found how to do it. the chunk generation is located in a class named Chunk under net.minecraft.world.chunk, and the snipet i think i need to change looks like this: public Chunk(World worldIn, ChunkPrimer primer, int x, int z) { this(worldIn, x, z); int i = 256; boolean flag = worldIn.provider.hasSkyLight(); for (int j = 0; j < 16; ++j) { for (int k = 0; k < 16; ++k) { for (int l = 0; l < 256; ++l) { IBlockState iblockstate = primer.getBlockState(j, l, k); if (iblockstate.getMaterial() != Material.AIR) { int i1 = l >> 4; if (this.storageArrays[i1] == NULL_BLOCK_STORAGE) { this.storageArrays[i1] = new ExtendedBlockStorage(i1 << 4, flag); } this.storageArrays[i1].set(j, l & 15, k, iblockstate); } } } } } that is the original, and i think that by changing either the j or k limit on their respective for loop will make chunks only load 1 block wide in that direction, which is my goal. so, something like this: public Chunk(World worldIn, ChunkPrimer primer, int x, int z) { this(worldIn, x, z); int i = 256; boolean flag = worldIn.provider.hasSkyLight(); for (int j = 0; j < 1; ++j) { for (int k = 0; k < 16; ++k) { for (int l = 0; l < 256; ++l) { IBlockState iblockstate = primer.getBlockState(j, l, k); if (iblockstate.getMaterial() != Material.AIR) { int i1 = l >> 4; if (this.storageArrays[i1] == NULL_BLOCK_STORAGE) { this.storageArrays[i1] = new ExtendedBlockStorage(i1 << 4, flag); } this.storageArrays[i1].set(j, l & 15, k, iblockstate); } } } } } however, it will not let me directly edit the class, and i am having trouble figuring out how i could change this value. any help? (using forge 1.12.2)
  2. Im trying to create a mod for the first time, and when following the tutorial i found i tried to do .\gradlew tasks and got a whole lot of mumbo jumbo and then a big BUILD FAILED. after a bit of searching online im still unable to find an answer so i am turning to you guys. Please help! PS C:\Users\John\eclipse-workspace\forge-1.7.10-10.13.4.1614-1.7.10-src> .\gradlew tasks FAILURE: Build failed with an exception. * What went wrong: A problem occurred configuring root project 'forge-1.7.10-10.13.4.1614-1.7.10-src'. > Could not resolve all dependencies for configuration ':classpath'. > Could not resolve net.md-5:SpecialSource:1.7.3. Required by: :forge-1.7.10-10.13.4.1614-1.7.10-src:unspecified > net.minecraftforge.gradle:ForgeGradle:1.2-SNAPSHOT > Could not GET 'http://repo1.maven.org/maven2/net/md-5/SpecialSource/1.7.3/SpecialSource-1.7.3.pom'. Received status code 501 from server: HTTPS Required > Could not resolve org.apache.httpcomponents:httpclient:4.3.3. Required by: :forge-1.7.10-10.13.4.1614-1.7.10-src:unspecified > net.minecraftforge.gradle:ForgeGradle:1.2-SNAPSHOT > Could not GET 'http://repo1.maven.org/maven2/org/apache/httpcomponents/httpclient/4.3.3/httpclient-4.3.3.pom'. Received status code 501 from server: HTTPS Required > Could not resolve org.apache.httpcomponents:httpmime:4.3.3. Required by: :forge-1.7.10-10.13.4.1614-1.7.10-src:unspecified > net.minecraftforge.gradle:ForgeGradle:1.2-SNAPSHOT > Could not GET 'http://repo1.maven.org/maven2/org/apache/httpcomponents/httpmime/4.3.3/httpmime-4.3.3.pom'. Received status code 501 from server: HTTPS Required > Could not resolve com.github.abrarsyed.jastyle:jAstyle:1.2. Required by: :forge-1.7.10-10.13.4.1614-1.7.10-src:unspecified > net.minecraftforge.gradle:ForgeGradle:1.2-SNAPSHOT > Could not GET 'http://repo1.maven.org/maven2/com/github/abrarsyed/jastyle/jAstyle/1.2/jAstyle-1.2.pom'. Received status code 501 from server: HTTPS Required > Could not resolve net.sf.trove4j:trove4j:2.1.0. Required by: :forge-1.7.10-10.13.4.1614-1.7.10-src:unspecified > net.minecraftforge.gradle:ForgeGradle:1.2-SNAPSHOT > Could not GET 'http://repo1.maven.org/maven2/net/sf/trove4j/trove4j/2.1.0/trove4j-2.1.0.pom'. Received status code 501 from server: HTTPS Required > Could not resolve com.google.code.gson:gson:2.2.4. Required by: :forge-1.7.10-10.13.4.1614-1.7.10-src:unspecified > net.minecraftforge.gradle:ForgeGradle:1.2-SNAPSHOT :forge-1.7.10-10.13.4.1614-1.7.10-src:unspecified > net.minecraftforge.gradle:ForgeGradle:1.2-SNAPSHOT > de.oceanlabs.mcp:RetroGuard:3.6.6 :forge-1.7.10-10.13.4.1614-1.7.10-src:unspecified > net.minecraftforge.gradle:ForgeGradle:1.2-SNAPSHOT > de.oceanlabs.mcp:mcinjector:3.2-SNAPSHOT > Could not GET 'http://repo1.maven.org/maven2/com/google/code/gson/gson/2.2.4/gson-2.2.4.pom'. Received status code 501 from server: HTTPS Required > Could not resolve com.google.guava:guava:18.0. Required by: :forge-1.7.10-10.13.4.1614-1.7.10-src:unspecified > net.minecraftforge.gradle:ForgeGradle:1.2-SNAPSHOT :forge-1.7.10-10.13.4.1614-1.7.10-src:unspecified > net.minecraftforge.gradle:ForgeGradle:1.2-SNAPSHOT > net.minecraftforge.srg2source:Srg2Source:3.2-SNAPSHOT > Could not GET 'http://repo1.maven.org/maven2/com/google/guava/guava/18.0/guava-18.0.pom'. Received status code 501 from server: HTTPS Required > Could not resolve org.ow2.asm:asm-debug-all:5.0.3. Required by: :forge-1.7.10-10.13.4.1614-1.7.10-src:unspecified > net.minecraftforge.gradle:ForgeGradle:1.2-SNAPSHOT :forge-1.7.10-10.13.4.1614-1.7.10-src:unspecified > net.minecraftforge.gradle:ForgeGradle:1.2-SNAPSHOT > net.minecraftforge.srg2source:Srg2Source:3.2-SNAPSHOT > Could not GET 'http://repo1.maven.org/maven2/org/ow2/asm/asm-debug-all/5.0.3/asm-debug-all-5.0.3.pom'. Received status code 501 from server: HTTPS Required > Could not resolve com.github.tony19:named-regexp:0.2.3. Required by: :forge-1.7.10-10.13.4.1614-1.7.10-src:unspecified > net.minecraftforge.gradle:ForgeGradle:1.2-SNAPSHOT > Could not GET 'http://repo1.maven.org/maven2/com/github/tony19/named-regexp/0.2.3/named-regexp-0.2.3.pom'. Received status code 501 from server: HTTPS Required > Could not resolve com.cloudbees:diff4j:1.1. Required by: :forge-1.7.10-10.13.4.1614-1.7.10-src:unspecified > net.minecraftforge.gradle:ForgeGradle:1.2-SNAPSHOT > Could not GET 'http://repo1.maven.org/maven2/com/cloudbees/diff4j/1.1/diff4j-1.1.pom'. Received status code 501 from server: HTTPS Required > Could not resolve net.sf.jopt-simple:jopt-simple:4.6. Required by: :forge-1.7.10-10.13.4.1614-1.7.10-src:unspecified > net.minecraftforge.gradle:ForgeGradle:1.2-SNAPSHOT > de.oceanlabs.mcp:RetroGuard:3.6.6 :forge-1.7.10-10.13.4.1614-1.7.10-src:unspecified > net.minecraftforge.gradle:ForgeGradle:1.2-SNAPSHOT > de.oceanlabs.mcp:mcinjector:3.2-SNAPSHOT > Could not GET 'http://repo1.maven.org/maven2/net/sf/jopt-simple/jopt-simple/4.6/jopt-simple-4.6.pom'. Received status code 501 from server: HTTPS Required > Could not resolve org.eclipse.core:jobs:3.5.300-v20130429-1813. Required by: :forge-1.7.10-10.13.4.1614-1.7.10-src:unspecified > net.minecraftforge.gradle:ForgeGradle:1.2-SNAPSHOT > net.minecraftforge.srg2source:Srg2Source:3.2-SNAPSHOT > Could not GET 'http://repo1.maven.org/maven2/org/eclipse/core/jobs/3.5.300-v20130429-1813/jobs-3.5.300-v20130429-1813.pom'. Received status code 501 from server: HTTPS Required > Could not resolve org.eclipse:osgi:3.9.1-v20130814-1242. Required by: :forge-1.7.10-10.13.4.1614-1.7.10-src:unspecified > net.minecraftforge.gradle:ForgeGradle:1.2-SNAPSHOT > net.minecraftforge.srg2source:Srg2Source:3.2-SNAPSHOT > Could not GET 'http://repo1.maven.org/maven2/org/eclipse/osgi/3.9.1-v20130814-1242/osgi-3.9.1-v20130814-1242.pom'. Received status code 501 from server: HTTPS Required > Could not resolve org.eclipse.core:contenttype:3.4.200-v20130326-1255. Required by: :forge-1.7.10-10.13.4.1614-1.7.10-src:unspecified > net.minecraftforge.gradle:ForgeGradle:1.2-SNAPSHOT > net.minecraftforge.srg2source:Srg2Source:3.2-SNAPSHOT > Could not GET 'http://repo1.maven.org/maven2/org/eclipse/core/contenttype/3.4.200-v20130326-1255/contenttype-3.4.200-v20130326-1255.pom'. Received status code 501 from server: HTTPS Required > Could not resolve org.eclipse.core:resources:3.2.1-R32x_v20060914. Required by: :forge-1.7.10-10.13.4.1614-1.7.10-src:unspecified > net.minecraftforge.gradle:ForgeGradle:1.2-SNAPSHOT > net.minecraftforge.srg2source:Srg2Source:3.2-SNAPSHOT > Could not GET 'http://repo1.maven.org/maven2/org/eclipse/core/resources/3.2.1-R32x_v20060914/resources-3.2.1-R32x_v20060914.pom'. Received status code 501 from server: HTTPS Required > Could not resolve org.eclipse.equinox:common:3.6.200-v20130402-1505. Required by: :forge-1.7.10-10.13.4.1614-1.7.10-src:unspecified > net.minecraftforge.gradle:ForgeGradle:1.2-SNAPSHOT > net.minecraftforge.srg2source:Srg2Source:3.2-SNAPSHOT > Could not GET 'http://repo1.maven.org/maven2/org/eclipse/equinox/common/3.6.200-v20130402-1505/common-3.6.200-v20130402-1505.pom'. Received status code 501 from server: HTTPS Required > Could not resolve org.eclipse.text:org.eclipse.text:3.5.101. Required by: :forge-1.7.10-10.13.4.1614-1.7.10-src:unspecified > net.minecraftforge.gradle:ForgeGradle:1.2-SNAPSHOT > net.minecraftforge.srg2source:Srg2Source:3.2-SNAPSHOT > Could not GET 'http://repo1.maven.org/maven2/org/eclipse/text/org.eclipse.text/3.5.101/org.eclipse.text-3.5.101.pom'. Received status code 501 from server: HTTPS Required > Could not resolve org.eclipse.jgit:org.eclipse.jgit:3.2.0.201312181205-r. Required by: :forge-1.7.10-10.13.4.1614-1.7.10-src:unspecified > net.minecraftforge.gradle:ForgeGradle:1.2-SNAPSHOT > net.minecraftforge.srg2source:Srg2Source:3.2-SNAPSHOT > Could not GET 'http://repo1.maven.org/maven2/org/eclipse/jgit/org.eclipse.jgit/3.2.0.201312181205-r/org.eclipse.jgit-3.2.0.201312181205-r.pom'. Received status code 501 from server: HTTPS Required > Could not resolve org.eclipse.equinox:preferences:3.5.100-v20130422-1538. Required by: :forge-1.7.10-10.13.4.1614-1.7.10-src:unspecified > net.minecraftforge.gradle:ForgeGradle:1.2-SNAPSHOT > net.minecraftforge.srg2source:Srg2Source:3.2-SNAPSHOT > Could not GET 'http://repo1.maven.org/maven2/org/eclipse/equinox/preferences/3.5.100-v20130422-1538/preferences-3.5.100-v20130422-1538.pom'. Received status code 501 from server: HTTPS Required > Could not resolve net.sf.jopt-simple:jopt-simple:4.6. Required by: :forge-1.7.10-10.13.4.1614-1.7.10-src:unspecified > net.minecraftforge.gradle:ForgeGradle:1.2-SNAPSHOT > net.minecraftforge.srg2source:Srg2Source:3.2-SNAPSHOT > Could not GET 'http://repo1.maven.org/maven2/net/sf/jopt-simple/jopt-simple/4.6/jopt-simple-4.6.pom'. Received status code 501 from server: HTTPS Required > Could not resolve org.eclipse.core:runtime:3.9.0-v20130326-1255. Required by: :forge-1.7.10-10.13.4.1614-1.7.10-src:unspecified > net.minecraftforge.gradle:ForgeGradle:1.2-SNAPSHOT > net.minecraftforge.srg2source:Srg2Source:3.2-SNAPSHOT > Could not GET 'http://repo1.maven.org/maven2/org/eclipse/core/runtime/3.9.0-v20130326-1255/runtime-3.9.0-v20130326-1255.pom'. Received status code 501 from server: HTTPS Required > Could not resolve org.ow2.asm:asm-debug-all:5.0.3. Required by: :forge-1.7.10-10.13.4.1614-1.7.10-src:unspecified > net.minecraftforge.gradle:ForgeGradle:1.2-SNAPSHOT > de.oceanlabs.mcp:mcinjector:3.2-SNAPSHOT > Could not GET 'http://repo1.maven.org/maven2/org/ow2/asm/asm-debug-all/5.0.3/asm-debug-all-5.0.3.pom'. Received status code 501 from server: HTTPS Required * Try: Run with --stacktrace option to get the stack trace. Run with --info or --debug option to get more log output. BUILD FAILED Total time: 7.57 secs heres the same code with --stacktrace PS C:\Users\John\eclipse-workspace\forge-1.7.10-10.13.4.1614-1.7.10-src> .\gradlew tasks --stacktrace FAILURE: Build failed with an exception. * What went wrong: A problem occurred configuring root project 'forge-1.7.10-10.13.4.1614-1.7.10-src'. > Could not resolve all dependencies for configuration ':classpath'. > Could not resolve net.md-5:SpecialSource:1.7.3. Required by: :forge-1.7.10-10.13.4.1614-1.7.10-src:unspecified > net.minecraftforge.gradle:ForgeGradle:1.2-SNAPSHOT > Could not GET 'http://repo1.maven.org/maven2/net/md-5/SpecialSource/1.7.3/SpecialSource-1.7.3.pom'. Received status code 501 from server: HTTPS Required > Could not resolve org.apache.httpcomponents:httpclient:4.3.3. Required by: :forge-1.7.10-10.13.4.1614-1.7.10-src:unspecified > net.minecraftforge.gradle:ForgeGradle:1.2-SNAPSHOT > Could not GET 'http://repo1.maven.org/maven2/org/apache/httpcomponents/httpclient/4.3.3/httpclient-4.3.3.pom'. Received status code 501 from server: HTTPS Required > Could not resolve org.apache.httpcomponents:httpmime:4.3.3. Required by: :forge-1.7.10-10.13.4.1614-1.7.10-src:unspecified > net.minecraftforge.gradle:ForgeGradle:1.2-SNAPSHOT > Could not GET 'http://repo1.maven.org/maven2/org/apache/httpcomponents/httpmime/4.3.3/httpmime-4.3.3.pom'. Received status code 501 from server: HTTPS Required > Could not resolve com.github.abrarsyed.jastyle:jAstyle:1.2. Required by: :forge-1.7.10-10.13.4.1614-1.7.10-src:unspecified > net.minecraftforge.gradle:ForgeGradle:1.2-SNAPSHOT > Could not GET 'http://repo1.maven.org/maven2/com/github/abrarsyed/jastyle/jAstyle/1.2/jAstyle-1.2.pom'. Received status code 501 from server: HTTPS Required > Could not resolve net.sf.trove4j:trove4j:2.1.0. Required by: :forge-1.7.10-10.13.4.1614-1.7.10-src:unspecified > net.minecraftforge.gradle:ForgeGradle:1.2-SNAPSHOT > Could not GET 'http://repo1.maven.org/maven2/net/sf/trove4j/trove4j/2.1.0/trove4j-2.1.0.pom'. Received status code 501 from server: HTTPS Required > Could not resolve com.google.code.gson:gson:2.2.4. Required by: :forge-1.7.10-10.13.4.1614-1.7.10-src:unspecified > net.minecraftforge.gradle:ForgeGradle:1.2-SNAPSHOT :forge-1.7.10-10.13.4.1614-1.7.10-src:unspecified > net.minecraftforge.gradle:ForgeGradle:1.2-SNAPSHOT > de.oceanlabs.mcp:RetroGuard:3.6.6 :forge-1.7.10-10.13.4.1614-1.7.10-src:unspecified > net.minecraftforge.gradle:ForgeGradle:1.2-SNAPSHOT > de.oceanlabs.mcp:mcinjector:3.2-SNAPSHOT > Could not GET 'http://repo1.maven.org/maven2/com/google/code/gson/gson/2.2.4/gson-2.2.4.pom'. Received status code 501 from server: HTTPS Required > Could not resolve com.google.guava:guava:18.0. Required by: :forge-1.7.10-10.13.4.1614-1.7.10-src:unspecified > net.minecraftforge.gradle:ForgeGradle:1.2-SNAPSHOT :forge-1.7.10-10.13.4.1614-1.7.10-src:unspecified > net.minecraftforge.gradle:ForgeGradle:1.2-SNAPSHOT > net.minecraftforge.srg2source:Srg2Source:3.2-SNAPSHOT > Could not GET 'http://repo1.maven.org/maven2/com/google/guava/guava/18.0/guava-18.0.pom'. Received status code 501 from server: HTTPS Required > Could not resolve org.ow2.asm:asm-debug-all:5.0.3. Required by: :forge-1.7.10-10.13.4.1614-1.7.10-src:unspecified > net.minecraftforge.gradle:ForgeGradle:1.2-SNAPSHOT :forge-1.7.10-10.13.4.1614-1.7.10-src:unspecified > net.minecraftforge.gradle:ForgeGradle:1.2-SNAPSHOT > net.minecraftforge.srg2source:Srg2Source:3.2-SNAPSHOT > Could not GET 'http://repo1.maven.org/maven2/org/ow2/asm/asm-debug-all/5.0.3/asm-debug-all-5.0.3.pom'. Received status code 501 from server: HTTPS Required > Could not resolve com.github.tony19:named-regexp:0.2.3. Required by: :forge-1.7.10-10.13.4.1614-1.7.10-src:unspecified > net.minecraftforge.gradle:ForgeGradle:1.2-SNAPSHOT > Could not GET 'http://repo1.maven.org/maven2/com/github/tony19/named-regexp/0.2.3/named-regexp-0.2.3.pom'. Received status code 501 from server: HTTPS Required > Could not resolve com.cloudbees:diff4j:1.1. Required by: :forge-1.7.10-10.13.4.1614-1.7.10-src:unspecified > net.minecraftforge.gradle:ForgeGradle:1.2-SNAPSHOT > Could not GET 'http://repo1.maven.org/maven2/com/cloudbees/diff4j/1.1/diff4j-1.1.pom'. Received status code 501 from server: HTTPS Required > Could not resolve net.sf.jopt-simple:jopt-simple:4.6. Required by: :forge-1.7.10-10.13.4.1614-1.7.10-src:unspecified > net.minecraftforge.gradle:ForgeGradle:1.2-SNAPSHOT > de.oceanlabs.mcp:RetroGuard:3.6.6 :forge-1.7.10-10.13.4.1614-1.7.10-src:unspecified > net.minecraftforge.gradle:ForgeGradle:1.2-SNAPSHOT > de.oceanlabs.mcp:mcinjector:3.2-SNAPSHOT > Could not GET 'http://repo1.maven.org/maven2/net/sf/jopt-simple/jopt-simple/4.6/jopt-simple-4.6.pom'. Received status code 501 from server: HTTPS Required > Could not resolve org.eclipse.core:jobs:3.5.300-v20130429-1813. Required by: :forge-1.7.10-10.13.4.1614-1.7.10-src:unspecified > net.minecraftforge.gradle:ForgeGradle:1.2-SNAPSHOT > net.minecraftforge.srg2source:Srg2Source:3.2-SNAPSHOT > Could not GET 'http://repo1.maven.org/maven2/org/eclipse/core/jobs/3.5.300-v20130429-1813/jobs-3.5.300-v20130429-1813.pom'. Received status code 501 from server: HTTPS Required > Could not resolve org.eclipse:osgi:3.9.1-v20130814-1242. Required by: :forge-1.7.10-10.13.4.1614-1.7.10-src:unspecified > net.minecraftforge.gradle:ForgeGradle:1.2-SNAPSHOT > net.minecraftforge.srg2source:Srg2Source:3.2-SNAPSHOT > Could not GET 'http://repo1.maven.org/maven2/org/eclipse/osgi/3.9.1-v20130814-1242/osgi-3.9.1-v20130814-1242.pom'. Received status code 501 from server: HTTPS Required > Could not resolve org.eclipse.core:contenttype:3.4.200-v20130326-1255. Required by: :forge-1.7.10-10.13.4.1614-1.7.10-src:unspecified > net.minecraftforge.gradle:ForgeGradle:1.2-SNAPSHOT > net.minecraftforge.srg2source:Srg2Source:3.2-SNAPSHOT > Could not GET 'http://repo1.maven.org/maven2/org/eclipse/core/contenttype/3.4.200-v20130326-1255/contenttype-3.4.200-v20130326-1255.pom'. Received status code 501 from server: HTTPS Required > Could not resolve org.eclipse.core:resources:3.2.1-R32x_v20060914. Required by: :forge-1.7.10-10.13.4.1614-1.7.10-src:unspecified > net.minecraftforge.gradle:ForgeGradle:1.2-SNAPSHOT > net.minecraftforge.srg2source:Srg2Source:3.2-SNAPSHOT > Could not GET 'http://repo1.maven.org/maven2/org/eclipse/core/resources/3.2.1-R32x_v20060914/resources-3.2.1-R32x_v20060914.pom'. Received status code 501 from server: HTTPS Required > Could not resolve org.eclipse.equinox:common:3.6.200-v20130402-1505. Required by: :forge-1.7.10-10.13.4.1614-1.7.10-src:unspecified > net.minecraftforge.gradle:ForgeGradle:1.2-SNAPSHOT > net.minecraftforge.srg2source:Srg2Source:3.2-SNAPSHOT > Could not GET 'http://repo1.maven.org/maven2/org/eclipse/equinox/common/3.6.200-v20130402-1505/common-3.6.200-v20130402-1505.pom'. Received status code 501 from server: HTTPS Required > Could not resolve org.eclipse.text:org.eclipse.text:3.5.101. Required by: :forge-1.7.10-10.13.4.1614-1.7.10-src:unspecified > net.minecraftforge.gradle:ForgeGradle:1.2-SNAPSHOT > net.minecraftforge.srg2source:Srg2Source:3.2-SNAPSHOT > Could not GET 'http://repo1.maven.org/maven2/org/eclipse/text/org.eclipse.text/3.5.101/org.eclipse.text-3.5.101.pom'. Received status code 501 from server: HTTPS Required > Could not resolve org.eclipse.jgit:org.eclipse.jgit:3.2.0.201312181205-r. Required by: :forge-1.7.10-10.13.4.1614-1.7.10-src:unspecified > net.minecraftforge.gradle:ForgeGradle:1.2-SNAPSHOT > net.minecraftforge.srg2source:Srg2Source:3.2-SNAPSHOT > Could not GET 'http://repo1.maven.org/maven2/org/eclipse/jgit/org.eclipse.jgit/3.2.0.201312181205-r/org.eclipse.jgit-3.2.0.201312181205-r.pom'. Received status code 501 from server: HTTPS Required > Could not resolve org.eclipse.equinox:preferences:3.5.100-v20130422-1538. Required by: :forge-1.7.10-10.13.4.1614-1.7.10-src:unspecified > net.minecraftforge.gradle:ForgeGradle:1.2-SNAPSHOT > net.minecraftforge.srg2source:Srg2Source:3.2-SNAPSHOT > Could not GET 'http://repo1.maven.org/maven2/org/eclipse/equinox/preferences/3.5.100-v20130422-1538/preferences-3.5.100-v20130422-1538.pom'. Received status code 501 from server: HTTPS Required > Could not resolve net.sf.jopt-simple:jopt-simple:4.6. Required by: :forge-1.7.10-10.13.4.1614-1.7.10-src:unspecified > net.minecraftforge.gradle:ForgeGradle:1.2-SNAPSHOT > net.minecraftforge.srg2source:Srg2Source:3.2-SNAPSHOT > Could not GET 'http://repo1.maven.org/maven2/net/sf/jopt-simple/jopt-simple/4.6/jopt-simple-4.6.pom'. Received status code 501 from server: HTTPS Required > Could not resolve org.eclipse.core:runtime:3.9.0-v20130326-1255. Required by: :forge-1.7.10-10.13.4.1614-1.7.10-src:unspecified > net.minecraftforge.gradle:ForgeGradle:1.2-SNAPSHOT > net.minecraftforge.srg2source:Srg2Source:3.2-SNAPSHOT > Could not GET 'http://repo1.maven.org/maven2/org/eclipse/core/runtime/3.9.0-v20130326-1255/runtime-3.9.0-v20130326-1255.pom'. Received status code 501 from server: HTTPS Required > Could not resolve org.ow2.asm:asm-debug-all:5.0.3. Required by: :forge-1.7.10-10.13.4.1614-1.7.10-src:unspecified > net.minecraftforge.gradle:ForgeGradle:1.2-SNAPSHOT > de.oceanlabs.mcp:mcinjector:3.2-SNAPSHOT > Could not GET 'http://repo1.maven.org/maven2/org/ow2/asm/asm-debug-all/5.0.3/asm-debug-all-5.0.3.pom'. Received status code 501 from server: HTTPS Required * Try: Run with --info or --debug option to get more log output. * Exception is: org.gradle.api.ProjectConfigurationException: A problem occurred configuring root project 'forge-1.7.10-10.13.4.1614-1.7.10-src'. at org.gradle.configuration.project.LifecycleProjectEvaluator.addConfigurationFailure(LifecycleProjectEvaluator.java:79) at org.gradle.configuration.project.LifecycleProjectEvaluator.evaluate(LifecycleProjectEvaluator.java:57) at org.gradle.api.internal.project.AbstractProject.evaluate(AbstractProject.java:470) at org.gradle.api.internal.project.AbstractProject.evaluate(AbstractProject.java:79) at org.gradle.configuration.DefaultBuildConfigurer.configure(DefaultBuildConfigurer.java:31) at org.gradle.initialization.DefaultGradleLauncher.doBuildStages(DefaultGradleLauncher.java:128) at org.gradle.initialization.DefaultGradleLauncher.doBuild(DefaultGradleLauncher.java:105) at org.gradle.initialization.DefaultGradleLauncher.run(DefaultGradleLauncher.java:85) at org.gradle.launcher.exec.InProcessBuildActionExecuter$DefaultBuildController.run(InProcessBuildActionExecuter.java:81) at org.gradle.launcher.cli.ExecuteBuildAction.run(ExecuteBuildAction.java:33) at org.gradle.launcher.cli.ExecuteBuildAction.run(ExecuteBuildAction.java:24) at org.gradle.launcher.exec.InProcessBuildActionExecuter.execute(InProcessBuildActionExecuter.java:39) at org.gradle.launcher.exec.InProcessBuildActionExecuter.execute(InProcessBuildActionExecuter.java:29) at org.gradle.launcher.cli.RunBuildAction.run(RunBuildAction.java:50) at org.gradle.internal.Actions$RunnableActionAdapter.execute(Actions.java:171) at org.gradle.launcher.cli.CommandLineActionFactory$ParseAndBuildAction.execute(CommandLineActionFactory.java:237) at org.gradle.launcher.cli.CommandLineActionFactory$ParseAndBuildAction.execute(CommandLineActionFactory.java:210) at org.gradle.launcher.cli.JavaRuntimeValidationAction.execute(JavaRuntimeValidationAction.java:35) at org.gradle.launcher.cli.JavaRuntimeValidationAction.execute(JavaRuntimeValidationAction.java:24) at org.gradle.launcher.cli.CommandLineActionFactory$WithLogging.execute(CommandLineActionFactory.java:206) at org.gradle.launcher.cli.CommandLineActionFactory$WithLogging.execute(CommandLineActionFactory.java:169) at org.gradle.launcher.cli.ExceptionReportingAction.execute(ExceptionReportingAction.java:33) at org.gradle.launcher.cli.ExceptionReportingAction.execute(ExceptionReportingAction.java:22) at org.gradle.launcher.Main.doAction(Main.java:33) at org.gradle.launcher.bootstrap.EntryPoint.run(EntryPoint.java:45) at org.gradle.launcher.bootstrap.ProcessBootstrap.runNoExit(ProcessBootstrap.java:54) at org.gradle.launcher.bootstrap.ProcessBootstrap.run(ProcessBootstrap.java:35) at org.gradle.launcher.GradleMain.main(GradleMain.java:23) at org.gradle.wrapper.BootstrapMainStarter.start(BootstrapMainStarter.java:30) at org.gradle.wrapper.WrapperExecutor.execute(WrapperExecutor.java:127) at org.gradle.wrapper.GradleWrapperMain.main(GradleWrapperMain.java:56) Caused by: org.gradle.api.artifacts.ResolveException: Could not resolve all dependencies for configuration ':classpath'. at org.gradle.api.internal.artifacts.ivyservice.DefaultLenientConfiguration.rethrowFailure(DefaultLenientConfiguration.java:52) at org.gradle.api.internal.artifacts.ivyservice.DefaultResolvedConfiguration.rethrowFailure(DefaultResolvedConfiguration.java:36) at org.gradle.api.internal.artifacts.ivyservice.SelfResolvingDependencyResolver$FilesAggregatingResolvedConfiguration.rethrowFailure(SelfResolvingDependencyResolver.java:110) at org.gradle.api.internal.artifacts.ivyservice.ErrorHandlingArtifactDependencyResolver$ErrorHandlingResolvedConfiguration.rethrowFailure(ErrorHandlingArtifactDependencyResolver.java:180) at org.gradle.api.internal.artifacts.configurations.DefaultConfiguration$ConfigurationFileCollection.getFiles(DefaultConfiguration.java:428) at org.gradle.api.internal.artifacts.configurations.DefaultConfiguration.getFiles(DefaultConfiguration.java:202) at org.gradle.api.internal.artifacts.configurations.DefaultConfiguration_Decorated.getFiles(Unknown Source) at org.gradle.configuration.DefaultScriptPluginFactory$ScriptPluginImpl.apply(DefaultScriptPluginFactory.java:136) at org.gradle.configuration.project.BuildScriptProcessor.execute(BuildScriptProcessor.java:39) at org.gradle.configuration.project.BuildScriptProcessor.execute(BuildScriptProcessor.java:26) at org.gradle.configuration.project.ConfigureActionsProjectEvaluator.evaluate(ConfigureActionsProjectEvaluator.java:34) at org.gradle.configuration.project.LifecycleProjectEvaluator.evaluate(LifecycleProjectEvaluator.java:55) ... 29 more Caused by: org.gradle.api.internal.artifacts.ivyservice.ModuleVersionResolveException: Could not resolve net.md-5:SpecialSource:1.7.3. Required by: :forge-1.7.10-10.13.4.1614-1.7.10-src:unspecified > net.minecraftforge.gradle:ForgeGradle:1.2-SNAPSHOT at org.gradle.api.internal.artifacts.ivyservice.ivyresolve.RepositoryChainDependencyResolver.resolve(RepositoryChainDependencyResolver.java:77) at org.gradle.api.internal.artifacts.ivyservice.clientmodule.ClientModuleResolver.resolve(ClientModuleResolver.java:45) at org.gradle.api.internal.artifacts.ivyservice.projectmodule.ProjectDependencyResolver.resolve(ProjectDependencyResolver.java:49) at org.gradle.api.internal.artifacts.ivyservice.ivyresolve.LazyDependencyToModuleResolver$AbstractVersionResolveResult.resolve(LazyDependencyToModuleResolver.java:69) at org.gradle.api.internal.artifacts.ivyservice.resolveengine.graph.DependencyGraphBuilder$ModuleVersionResolveState.resolve(DependencyGraphBuilder.java:543) at org.gradle.api.internal.artifacts.ivyservice.resolveengine.graph.DependencyGraphBuilder$ModuleVersionResolveState.getMetaData(DependencyGraphBuilder.java:554) at org.gradle.api.internal.artifacts.ivyservice.resolveengine.graph.DependencyGraphBuilder$DependencyEdge.calculateTargetConfigurations(DependencyGraphBuilder.java:255) at org.gradle.api.internal.artifacts.ivyservice.resolveengine.graph.DependencyGraphBuilder$DependencyEdge.attachToTargetConfigurations(DependencyGraphBuilder.java:229) at org.gradle.api.internal.artifacts.ivyservice.resolveengine.graph.DependencyGraphBuilder.traverseGraph(DependencyGraphBuilder.java:142) at org.gradle.api.internal.artifacts.ivyservice.resolveengine.graph.DependencyGraphBuilder.resolveDependencyGraph(DependencyGraphBuilder.java:82) at org.gradle.api.internal.artifacts.ivyservice.resolveengine.graph.DependencyGraphBuilder.resolve(DependencyGraphBuilder.java:74) at org.gradle.api.internal.artifacts.ivyservice.resolveengine.DefaultDependencyResolver$1.execute(DefaultDependencyResolver.java:120) at org.gradle.api.internal.artifacts.ivyservice.resolveengine.DefaultDependencyResolver$1.execute(DefaultDependencyResolver.java:86) at org.gradle.internal.Transformers$3.transform(Transformers.java:131) at org.gradle.api.internal.artifacts.ivyservice.DefaultIvyContextManager.withIvy(DefaultIvyContextManager.java:61) at org.gradle.api.internal.artifacts.ivyservice.DefaultIvyContextManager.withIvy(DefaultIvyContextManager.java:39) at org.gradle.api.internal.artifacts.ivyservice.resolveengine.DefaultDependencyResolver.resolve(DefaultDependencyResolver.java:86) at org.gradle.api.internal.artifacts.ivyservice.CacheLockingArtifactDependencyResolver$1.run(CacheLockingArtifactDependencyResolver.java:42) at org.gradle.internal.Factories$1.create(Factories.java:22) at org.gradle.cache.internal.DefaultCacheAccess.useCache(DefaultCacheAccess.java:187) at org.gradle.cache.internal.DefaultCacheAccess.useCache(DefaultCacheAccess.java:175) at org.gradle.cache.internal.DefaultPersistentDirectoryStore.useCache(DefaultPersistentDirectoryStore.java:106) at org.gradle.cache.internal.DefaultCacheFactory$ReferenceTrackingCache.useCache(DefaultCacheFactory.java:187) at org.gradle.api.internal.artifacts.ivyservice.DefaultCacheLockingManager.useCache(DefaultCacheLockingManager.java:63) at org.gradle.api.internal.artifacts.ivyservice.CacheLockingArtifactDependencyResolver.resolve(CacheLockingArtifactDependencyResolver.java:40) at org.gradle.api.internal.artifacts.ivyservice.SelfResolvingDependencyResolver.resolve(SelfResolvingDependencyResolver.java:45) at org.gradle.api.internal.artifacts.ivyservice.ShortcircuitEmptyConfigsArtifactDependencyResolver.resolve(ShortcircuitEmptyConfigsArtifactDependencyResolver.java:55) at org.gradle.api.internal.artifacts.ivyservice.ErrorHandlingArtifactDependencyResolver.resolve(ErrorHandlingArtifactDependencyResolver.java:47) at org.gradle.api.internal.artifacts.ivyservice.DefaultConfigurationResolver.resolve(DefaultConfigurationResolver.java:46) at org.gradle.api.internal.artifacts.configurations.DefaultConfiguration.resolveNow(DefaultConfiguration.java:240) at org.gradle.api.internal.artifacts.configurations.DefaultConfiguration.getResolvedConfiguration(DefaultConfiguration.java:230) at org.gradle.api.internal.artifacts.configurations.DefaultConfiguration_Decorated.getResolvedConfiguration(Unknown Source) at org.gradle.api.internal.artifacts.configurations.DefaultConfiguration$ConfigurationFileCollection.getFiles(DefaultConfiguration.java:426) ... 36 more Caused by: org.gradle.api.UncheckedIOException: Could not GET 'http://repo1.maven.org/maven2/net/md-5/SpecialSource/1.7.3/SpecialSource-1.7.3.pom'. Received status code 501 from server: HTTPS Required at org.gradle.internal.resource.transport.http.HttpClientHelper.processResponse(HttpClientHelper.java:121) at org.gradle.internal.resource.transport.http.HttpClientHelper.performGet(HttpClientHelper.java:70) at org.gradle.internal.resource.transport.http.HttpResourceAccessor.getResource(HttpResourceAccessor.java:53) at org.gradle.internal.resource.transport.http.HttpResourceAccessor.getResource(HttpResourceAccessor.java:36) at org.gradle.internal.resource.transfer.ProgressLoggingExternalResourceAccessor.getResource(ProgressLoggingExternalResourceAccessor.java:39) at org.gradle.internal.resource.transfer.DefaultCacheAwareExternalResourceAccessor.getResource(DefaultCacheAwareExternalResourceAccessor.java:72) at org.gradle.api.internal.artifacts.repositories.resolver.DefaultExternalResourceArtifactResolver.downloadStaticResource(DefaultExternalResourceArtifactResolver.java:91) at org.gradle.api.internal.artifacts.repositories.resolver.DefaultExternalResourceArtifactResolver.resolveMetaDataArtifact(DefaultExternalResourceArtifactResolver.java:57) at org.gradle.api.internal.artifacts.repositories.resolver.ExternalResourceResolver.parseMetaDataFromArtifact(ExternalResourceResolver.java:164) at org.gradle.api.internal.artifacts.repositories.resolver.ExternalResourceResolver.resolveStaticDependency(ExternalResourceResolver.java:144) at org.gradle.api.internal.artifacts.repositories.resolver.MavenResolver.doResolveComponentMetaData(MavenResolver.java:76) at org.gradle.api.internal.artifacts.repositories.resolver.ExternalResourceResolver$RemoteRepositoryAccess.resolveComponentMetaData(ExternalResourceResolver.java:396) at org.gradle.api.internal.artifacts.ivyservice.ivyresolve.CacheLockReleasingModuleComponentsRepository$LockReleasingRepositoryAccess$2.run(CacheLockReleasingModuleComponentsRepository.java:63) at org.gradle.internal.Factories$1.create(Factories.java:22) at org.gradle.cache.internal.DefaultCacheAccess.longRunningOperation(DefaultCacheAccess.java:237) at org.gradle.cache.internal.DefaultCacheAccess.longRunningOperation(DefaultCacheAccess.java:308) at org.gradle.cache.internal.DefaultPersistentDirectoryStore.longRunningOperation(DefaultPersistentDirectoryStore.java:114) at org.gradle.cache.internal.DefaultCacheFactory$ReferenceTrackingCache.longRunningOperation(DefaultCacheFactory.java:179) at org.gradle.api.internal.artifacts.ivyservice.DefaultCacheLockingManager.longRunningOperation(DefaultCacheLockingManager.java:55) at org.gradle.api.internal.artifacts.ivyservice.ivyresolve.CacheLockReleasingModuleComponentsRepository$LockReleasingRepositoryAccess.resolveComponentMetaData(CacheLockReleasingModuleComponentsRepository.java:61) at org.gradle.api.internal.artifacts.ivyservice.ivyresolve.CachingModuleComponentRepository$ResolveAndCacheRepositoryAccess.resolveComponentMetaData(CachingModuleComponentRepository.java:282) at org.gradle.api.internal.artifacts.ivyservice.ivyresolve.BaseModuleComponentRepositoryAccess.resolveComponentMetaData(BaseModuleComponentRepositoryAccess.java:37) at org.gradle.api.internal.artifacts.ivyservice.ivyresolve.memcache.InMemoryCachedModuleComponentRepository$CachedAccess.resolveComponentMetaData(InMemoryCachedModuleComponentRepository.java:67) at org.gradle.api.internal.artifacts.ivyservice.ivyresolve.RepositoryChainDependencyResolver$StaticVersionRepositoryResolveState.process(RepositoryChainDependencyResolver.java:205) at org.gradle.api.internal.artifacts.ivyservice.ivyresolve.RepositoryChainDependencyResolver$RepositoryResolveState.resolve(RepositoryChainDependencyResolver.java:180) at org.gradle.api.internal.artifacts.ivyservice.ivyresolve.RepositoryChainDependencyResolver.findLatestModule(RepositoryChainDependencyResolver.java:121) at org.gradle.api.internal.artifacts.ivyservice.ivyresolve.RepositoryChainDependencyResolver.findLatestModule(RepositoryChainDependencyResolver.java:97) at org.gradle.api.internal.artifacts.ivyservice.ivyresolve.RepositoryChainDependencyResolver.resolve(RepositoryChainDependencyResolver.java:66) ... 68 more BUILD FAILED Total time: 9.222 secs please help!
×
×
  • Create New...

Important Information

By using this site, you agree to our Terms of Use.