Jump to content
Search In
  • More options...
Find results that contain...
Find results in...

Gradle build failure couldn't copy mcmod.info


Kaufko
 Share

Recommended Posts

Posted (edited)

 

I'm trying to make a 1.8.9 forge mod, but when I build I get an exception:

This mapping 'stable_20' was designed for MC 1.8.8! Use at your own peril.
WARNING: You are using an unsupported version of ForgeGradle.
Please consider upgrading to ForgeGradle 5 and helping in the efforts to get old versions working on the modern toolchain.
See https://gist.github.com/TheCurle/fe7ad3ede188cbdd15c235cc75d52d4a for more info on contributing.
#################################################
         ForgeGradle 2.1.3-g6a7c715
  https://github.com/MinecraftForge/ForgeGradle
#################################################
               Powered by MCP unknown
             http://modcoderpack.com
         by: Searge, ProfMobius, Fesh0r,
         R4wk, ZeuX, IngisKahn, bspkrs
#################################################
:deobfCompileDummyTask
:deobfProvidedDummyTask
:sourceApiJava UP-TO-DATE
:compileApiJava UP-TO-DATE
:processApiResources UP-TO-DATE
:apiClasses UP-TO-DATE
:sourceMainJava UP-TO-DATE
:compileJava
warning: [options] bootstrap class path not set in conjunction with -source 1.6
1 warning
:processResources FAILED

FAILURE: Build failed with an exception.

* What went wrong:
Execution failed for task ':processResources'.
> Could not copy file 'C:\Users\#####\OneDrive\Plocha\mcmod\src\main\resources\mcmod.info' to 'C:\Users\#####\OneDrive\Plocha\mcmod\build\resources\main\mcmod.info'.

* Try:
Run with --info or --debug option to get more log output.

* Exception is:
org.gradle.api.tasks.TaskExecutionException: Execution failed for task ':processResources'.
        at org.gradle.api.internal.tasks.execution.ExecuteActionsTaskExecuter.executeActions(ExecuteActionsTaskExecuter.java:69)
        at org.gradle.api.internal.tasks.execution.ExecuteActionsTaskExecuter.execute(ExecuteActionsTaskExecuter.java:46)
        at org.gradle.api.internal.tasks.execution.PostExecutionAnalysisTaskExecuter.execute(PostExecutionAnalysisTaskExecuter.java:35)
        at org.gradle.api.internal.tasks.execution.SkipUpToDateTaskExecuter.execute(SkipUpToDateTaskExecuter.java:64)
        at org.gradle.api.internal.tasks.execution.ValidatingTaskExecuter.execute(ValidatingTaskExecuter.java:58)
        at org.gradle.api.internal.tasks.execution.SkipEmptySourceFilesTaskExecuter.execute(SkipEmptySourceFilesTaskExecuter.java:52)
        at org.gradle.api.internal.tasks.execution.SkipTaskWithNoActionsExecuter.execute(SkipTaskWithNoActionsExecuter.java:52)
        at org.gradle.api.internal.tasks.execution.SkipOnlyIfTaskExecuter.execute(SkipOnlyIfTaskExecuter.java:53)
        at org.gradle.api.internal.tasks.execution.ExecuteAtMostOnceTaskExecuter.execute(ExecuteAtMostOnceTaskExecuter.java:43)
        at org.gradle.execution.taskgraph.DefaultTaskGraphExecuter$EventFiringTaskWorker.execute(DefaultTaskGraphExecuter.java:203)
        at org.gradle.execution.taskgraph.DefaultTaskGraphExecuter$EventFiringTaskWorker.execute(DefaultTaskGraphExecuter.java:185)
        at org.gradle.execution.taskgraph.AbstractTaskPlanExecutor$TaskExecutorWorker.processTask(AbstractTaskPlanExecutor.java:62)
        at org.gradle.execution.taskgraph.AbstractTaskPlanExecutor$TaskExecutorWorker.run(AbstractTaskPlanExecutor.java:50)
        at org.gradle.execution.taskgraph.DefaultTaskPlanExecutor.process(DefaultTaskPlanExecutor.java:25)
        at org.gradle.execution.taskgraph.DefaultTaskGraphExecuter.execute(DefaultTaskGraphExecuter.java:110)
        at org.gradle.execution.SelectedTaskExecutionAction.execute(SelectedTaskExecutionAction.java:37)
        at org.gradle.execution.DefaultBuildExecuter.execute(DefaultBuildExecuter.java:37)
        at org.gradle.execution.DefaultBuildExecuter.access$000(DefaultBuildExecuter.java:23)
        at org.gradle.execution.DefaultBuildExecuter$1.proceed(DefaultBuildExecuter.java:43)
        at org.gradle.execution.DryRunBuildExecutionAction.execute(DryRunBuildExecutionAction.java:32)
        at org.gradle.execution.DefaultBuildExecuter.execute(DefaultBuildExecuter.java:37)
        at org.gradle.execution.DefaultBuildExecuter.execute(DefaultBuildExecuter.java:30)
        at org.gradle.initialization.DefaultGradleLauncher$4.run(DefaultGradleLauncher.java:155)
        at org.gradle.internal.Factories$1.create(Factories.java:22)
        at org.gradle.internal.progress.DefaultBuildOperationExecutor.run(DefaultBuildOperationExecutor.java:90)
        at org.gradle.internal.progress.DefaultBuildOperationExecutor.run(DefaultBuildOperationExecutor.java:52)
        at org.gradle.initialization.DefaultGradleLauncher.doBuildStages(DefaultGradleLauncher.java:152)
        at org.gradle.initialization.DefaultGradleLauncher.access$200(DefaultGradleLauncher.java:33)
        at org.gradle.initialization.DefaultGradleLauncher$1.create(DefaultGradleLauncher.java:100)
        at org.gradle.initialization.DefaultGradleLauncher$1.create(DefaultGradleLauncher.java:94)
        at org.gradle.internal.progress.DefaultBuildOperationExecutor.run(DefaultBuildOperationExecutor.java:90)
        at org.gradle.internal.progress.DefaultBuildOperationExecutor.run(DefaultBuildOperationExecutor.java:62)
        at org.gradle.initialization.DefaultGradleLauncher.doBuild(DefaultGradleLauncher.java:94)
        at org.gradle.initialization.DefaultGradleLauncher.run(DefaultGradleLauncher.java:83)
        at org.gradle.launcher.exec.InProcessBuildActionExecuter$DefaultBuildController.run(InProcessBuildActionExecuter.java:94)
        at org.gradle.tooling.internal.provider.ExecuteBuildActionRunner.run(ExecuteBuildActionRunner.java:28)
        at org.gradle.launcher.exec.ChainingBuildActionRunner.run(ChainingBuildActionRunner.java:35)
        at org.gradle.launcher.exec.InProcessBuildActionExecuter.execute(InProcessBuildActionExecuter.java:43)
        at org.gradle.launcher.exec.InProcessBuildActionExecuter.execute(InProcessBuildActionExecuter.java:28)
        at org.gradle.launcher.exec.ContinuousBuildActionExecuter.execute(ContinuousBuildActionExecuter.java:77)
        at org.gradle.launcher.exec.ContinuousBuildActionExecuter.execute(ContinuousBuildActionExecuter.java:47)
        at org.gradle.launcher.exec.DaemonUsageSuggestingBuildActionExecuter.execute(DaemonUsageSuggestingBuildActionExecuter.java:51)
        at org.gradle.launcher.exec.DaemonUsageSuggestingBuildActionExecuter.execute(DaemonUsageSuggestingBuildActionExecuter.java:28)
        at org.gradle.launcher.cli.RunBuildAction.run(RunBuildAction.java:43)
        at org.gradle.internal.Actions$RunnableActionAdapter.execute(Actions.java:170)
        at org.gradle.launcher.cli.CommandLineActionFactory$ParseAndBuildAction.execute(CommandLineActionFactory.java:237)
        at org.gradle.launcher.cli.CommandLineActionFactory$ParseAndBuildAction.execute(CommandLineActionFactory.java:210)
        at org.gradle.launcher.cli.JavaRuntimeValidationAction.execute(JavaRuntimeValidationAction.java:35)
        at org.gradle.launcher.cli.JavaRuntimeValidationAction.execute(JavaRuntimeValidationAction.java:24)
        at org.gradle.launcher.cli.CommandLineActionFactory$WithLogging.execute(CommandLineActionFactory.java:206)
        at org.gradle.launcher.cli.CommandLineActionFactory$WithLogging.execute(CommandLineActionFactory.java:169)
        at org.gradle.launcher.cli.ExceptionReportingAction.execute(ExceptionReportingAction.java:33)
        at org.gradle.launcher.cli.ExceptionReportingAction.execute(ExceptionReportingAction.java:22)
        at org.gradle.launcher.Main.doAction(Main.java:33)
        at org.gradle.launcher.bootstrap.EntryPoint.run(EntryPoint.java:45)
        at org.gradle.launcher.bootstrap.ProcessBootstrap.runNoExit(ProcessBootstrap.java:54)
        at org.gradle.launcher.bootstrap.ProcessBootstrap.run(ProcessBootstrap.java:35)
        at org.gradle.launcher.GradleMain.main(GradleMain.java:23)
        at org.gradle.wrapper.BootstrapMainStarter.start(BootstrapMainStarter.java:30)
        at org.gradle.wrapper.WrapperExecutor.execute(WrapperExecutor.java:127)
        at org.gradle.wrapper.GradleWrapperMain.main(GradleWrapperMain.java:61)
Caused by: org.gradle.api.GradleException: Could not copy file 'C:\Users\#####\OneDrive\Plocha\mcmod\src\main\resources\mcmod.info' to 'C:\Users\#####\OneDrive\Plocha\mcmod\build\resources\main\mcmod.info'.
        at org.gradle.api.internal.file.AbstractFileTreeElement.copyTo(AbstractFileTreeElement.java:79)
        at org.gradle.api.internal.file.copy.DefaultFileCopyDetails.copyTo(DefaultFileCopyDetails.java:102)
        at org.gradle.api.internal.file.copy.FileCopyAction$FileCopyDetailsInternalAction.processFile(FileCopyAction.java:44)
        at org.gradle.api.internal.file.copy.NormalizingCopyActionDecorator$1$1.processFile(NormalizingCopyActionDecorator.java:65)
        at org.gradle.api.internal.file.copy.DuplicateHandlingCopyActionDecorator$1$1.processFile(DuplicateHandlingCopyActionDecorator.java:60)
        at org.gradle.api.internal.file.copy.CopyFileVisitorImpl.processFile(CopyFileVisitorImpl.java:60)
        at org.gradle.api.internal.file.copy.CopyFileVisitorImpl.visitFile(CopyFileVisitorImpl.java:44)
        at org.gradle.api.internal.file.collections.DirectoryFileTree.walkDir(DirectoryFileTree.java:154)
        at org.gradle.api.internal.file.collections.DirectoryFileTree.visitFrom(DirectoryFileTree.java:122)
        at org.gradle.api.internal.file.collections.DirectoryFileTree.visit(DirectoryFileTree.java:112)
        at org.gradle.api.internal.file.collections.FileTreeAdapter.visit(FileTreeAdapter.java:108)
        at org.gradle.api.internal.file.CompositeFileTree.visit(CompositeFileTree.java:55)
        at org.gradle.api.internal.file.copy.CopySpecActionImpl.execute(CopySpecActionImpl.java:37)
        at org.gradle.api.internal.file.copy.CopySpecActionImpl.execute(CopySpecActionImpl.java:24)
        at org.gradle.api.internal.file.copy.DefaultCopySpec$DefaultCopySpecResolver.walk(DefaultCopySpec.java:498)
        at org.gradle.api.internal.file.copy.DefaultCopySpec$DefaultCopySpecResolver.walk(DefaultCopySpec.java:500)
        at org.gradle.api.internal.file.copy.DefaultCopySpec$DefaultCopySpecResolver.walk(DefaultCopySpec.java:500)
        at org.gradle.api.internal.file.copy.DefaultCopySpec.walk(DefaultCopySpec.java:322)
        at org.gradle.api.internal.file.copy.DelegatingCopySpecInternal.walk(DelegatingCopySpecInternal.java:206)
        at org.gradle.api.internal.file.copy.CopySpecBackedCopyActionProcessingStream.process(CopySpecBackedCopyActionProcessingStream.java:36)
        at org.gradle.api.internal.file.copy.DuplicateHandlingCopyActionDecorator$1.process(DuplicateHandlingCopyActionDecorator.java:44)
        at org.gradle.api.internal.file.copy.NormalizingCopyActionDecorator$1.process(NormalizingCopyActionDecorator.java:56)
        at org.gradle.api.internal.file.copy.FileCopyAction.execute(FileCopyAction.java:35)
        at org.gradle.api.internal.file.copy.NormalizingCopyActionDecorator.execute(NormalizingCopyActionDecorator.java:52)
        at org.gradle.api.internal.file.copy.DuplicateHandlingCopyActionDecorator.execute(DuplicateHandlingCopyActionDecorator.java:42)
        at org.gradle.api.internal.file.copy.CopyActionExecuter.execute(CopyActionExecuter.java:38)
        at org.gradle.api.tasks.AbstractCopyTask.copy(AbstractCopyTask.java:83)
        at org.gradle.language.jvm.tasks.ProcessResources.copy(ProcessResources.java:33)
        at org.gradle.internal.reflect.JavaMethod.invoke(JavaMethod.java:75)
        at org.gradle.api.internal.project.taskfactory.AnnotationProcessingTaskFactory$StandardTaskAction.doExecute(AnnotationProcessingTaskFactory.java:226)
        at org.gradle.api.internal.project.taskfactory.AnnotationProcessingTaskFactory$StandardTaskAction.execute(AnnotationProcessingTaskFactory.java:219)
        at org.gradle.api.internal.project.taskfactory.AnnotationProcessingTaskFactory$StandardTaskAction.execute(AnnotationProcessingTaskFactory.java:208)
        at org.gradle.api.internal.AbstractTask$TaskActionWrapper.execute(AbstractTask.java:585)
        at org.gradle.api.internal.AbstractTask$TaskActionWrapper.execute(AbstractTask.java:568)
        at org.gradle.api.internal.tasks.execution.ExecuteActionsTaskExecuter.executeAction(ExecuteActionsTaskExecuter.java:80)
        at org.gradle.api.internal.tasks.execution.ExecuteActionsTaskExecuter.executeActions(ExecuteActionsTaskExecuter.java:61)
        ... 60 more
Caused by: groovy.lang.GroovyRuntimeException: Failed to parse template script (your template may contain an error or be trying to use expressions not currently supported): startup failed:
SimpleTemplateScript1.groovy: 6: unexpected token: 0 @ line 6, column 24.
     \"version\": \"${1.0.0}\",
                          ^

1 error

        at org.gradle.api.internal.file.copy.FilterChain$3.transform(FilterChain.java:90)
        at org.gradle.api.internal.file.copy.FilterChain$3.transform(FilterChain.java:84)
        at org.gradle.api.internal.ChainingTransformer.transform(ChainingTransformer.java:37)
        at org.gradle.api.internal.file.copy.FilterChain.transform(FilterChain.java:39)
        at org.gradle.api.internal.file.copy.FilterChain.transform(FilterChain.java:46)
        at org.gradle.api.internal.file.copy.DefaultFileCopyDetails.open(DefaultFileCopyDetails.java:86)
        at org.gradle.api.internal.file.AbstractFileTreeElement.copyTo(AbstractFileTreeElement.java:56)
        at org.gradle.api.internal.file.copy.DefaultFileCopyDetails.copyTo(DefaultFileCopyDetails.java:94)
        at org.gradle.api.internal.file.AbstractFileTreeElement.copyFile(AbstractFileTreeElement.java:93)
        at org.gradle.api.internal.file.AbstractFileTreeElement.copyTo(AbstractFileTreeElement.java:74)
        ... 95 more


BUILD FAILED

Total time: 5.144 secs

C:\Users\#####\OneDrive\Plocha\mcmod>gradlew build
This mapping 'stable_20' was designed for MC 1.8.8! Use at your own peril.
WARNING: You are using an unsupported version of ForgeGradle.
Please consider upgrading to ForgeGradle 5 and helping in the efforts to get old versions working on the modern toolchain.
See https://gist.github.com/TheCurle/fe7ad3ede188cbdd15c235cc75d52d4a for more info on contributing.
#################################################
         ForgeGradle 2.1.3-g6a7c715
  https://github.com/MinecraftForge/ForgeGradle
#################################################
               Powered by MCP unknown
             http://modcoderpack.com
         by: Searge, ProfMobius, Fesh0r,
         R4wk, ZeuX, IngisKahn, bspkrs
#################################################
:deobfCompileDummyTask
:deobfProvidedDummyTask
:sourceApiJava UP-TO-DATE
:compileApiJava UP-TO-DATE
:processApiResources UP-TO-DATE
:apiClasses UP-TO-DATE
:sourceMainJava UP-TO-DATE
:compileJava
warning: [options] bootstrap class path not set in conjunction with -source 1.6
1 warning
:processResources FAILED

FAILURE: Build failed with an exception.

* What went wrong:
Execution failed for task ':processResources'.
> Could not copy file 'C:\Users\#####\OneDrive\Plocha\mcmod\src\main\resources\mcmod.info' to 'C:\Users\#####\OneDrive\Plocha\mcmod\build\resources\main\mcmod.info'.

* Try:
Run with --stacktrace option to get the stack trace. Run with --info or --debug option to get more log output.

BUILD FAILED

Total time: 5.402 secs

C:\Users\#####\OneDrive\Plocha\mcmod>gradlew build
This mapping 'stable_20' was designed for MC 1.8.8! Use at your own peril.
WARNING: You are using an unsupported version of ForgeGradle.
Please consider upgrading to ForgeGradle 5 and helping in the efforts to get old versions working on the modern toolchain.
See https://gist.github.com/TheCurle/fe7ad3ede188cbdd15c235cc75d52d4a for more info on contributing.
#################################################
         ForgeGradle 2.1.3-g6a7c715
  https://github.com/MinecraftForge/ForgeGradle
#################################################
               Powered by MCP unknown
             http://modcoderpack.com
         by: Searge, ProfMobius, Fesh0r,
         R4wk, ZeuX, IngisKahn, bspkrs
#################################################
:deobfCompileDummyTask
:deobfProvidedDummyTask
:sourceApiJava UP-TO-DATE
:compileApiJava UP-TO-DATE
:processApiResources UP-TO-DATE
:apiClasses UP-TO-DATE
:sourceMainJava UP-TO-DATE
:compileJava
warning: [options] bootstrap class path not set in conjunction with -source 1.6
1 warning
:processResources FAILED

FAILURE: Build failed with an exception.

* What went wrong:
Execution failed for task ':processResources'.
> Could not copy file 'C:\Users\#####\OneDrive\Plocha\mcmod\src\main\resources\mcmod.info' to 'C:\Users\#####\OneDrive\Plocha\mcmod\build\resources\main\mcmod.info'.

* Try:
Run with --stacktrace option to get the stack trace. Run with --info or --debug option to get more log output.

BUILD FAILED

Total time: 5.29 secs

C:\Users\#####\OneDrive\Plocha\mcmod>gradlew build
This mapping 'stable_20' was designed for MC 1.8.8! Use at your own peril.
WARNING: You are using an unsupported version of ForgeGradle.
Please consider upgrading to ForgeGradle 5 and helping in the efforts to get old versions working on the modern toolchain.
See https://gist.github.com/TheCurle/fe7ad3ede188cbdd15c235cc75d52d4a for more info on contributing.
#################################################
         ForgeGradle 2.1.3-g6a7c715
  https://github.com/MinecraftForge/ForgeGradle
#################################################
               Powered by MCP unknown
             http://modcoderpack.com
         by: Searge, ProfMobius, Fesh0r,
         R4wk, ZeuX, IngisKahn, bspkrs
#################################################
:deobfCompileDummyTask
:deobfProvidedDummyTask
:sourceApiJava UP-TO-DATE
:compileApiJava UP-TO-DATE
:processApiResources UP-TO-DATE
:apiClasses UP-TO-DATE
:sourceMainJava
:compileJava
warning: [options] bootstrap class path not set in conjunction with -source 1.6
1 warning
:processResources FAILED

FAILURE: Build failed with an exception.

* What went wrong:
Execution failed for task ':processResources'.
> Could not copy file 'C:\Users\#####\OneDrive\Plocha\mcmod\src\main\resources\mcmod.info' to 'C:\Users\#####\OneDrive\Plocha\mcmod\build\resources\main\mcmod.info'.

* Try:
Run with --stacktrace option to get the stack trace. Run with --info or --debug option to get more log output.

BUILD FAILED

Total time: 9.693 secs

C:\Users\#####\OneDrive\Plocha\mcmod>gradlew build --stacktrace
This mapping 'stable_20' was designed for MC 1.8.8! Use at your own peril.
WARNING: You are using an unsupported version of ForgeGradle.
Please consider upgrading to ForgeGradle 5 and helping in the efforts to get old versions working on the modern toolchain.
See https://gist.github.com/TheCurle/fe7ad3ede188cbdd15c235cc75d52d4a for more info on contributing.
#################################################
         ForgeGradle 2.1.3-g6a7c715
  https://github.com/MinecraftForge/ForgeGradle
#################################################
               Powered by MCP unknown
             http://modcoderpack.com
         by: Searge, ProfMobius, Fesh0r,
         R4wk, ZeuX, IngisKahn, bspkrs
#################################################
:deobfCompileDummyTask
:deobfProvidedDummyTask
:sourceApiJava UP-TO-DATE
:compileApiJava UP-TO-DATE
:processApiResources UP-TO-DATE
:apiClasses UP-TO-DATE
:sourceMainJava UP-TO-DATE
:compileJava
warning: [options] bootstrap class path not set in conjunction with -source 1.6
1 warning
:processResources FAILED

FAILURE: Build failed with an exception.

* What went wrong:
Execution failed for task ':processResources'.
> Could not copy file 'C:\Users\#####\OneDrive\Plocha\mcmod\src\main\resources\mcmod.info' to 'C:\Users\#####\OneDrive\Plocha\mcmod\build\resources\main\mcmod.info'.

* Try:
Run with --info or --debug option to get more log output.

* Exception is:
org.gradle.api.tasks.TaskExecutionException: Execution failed for task ':processResources'.
        at org.gradle.api.internal.tasks.execution.ExecuteActionsTaskExecuter.executeActions(ExecuteActionsTaskExecuter.java:69)
        at org.gradle.api.internal.tasks.execution.ExecuteActionsTaskExecuter.execute(ExecuteActionsTaskExecuter.java:46)
        at org.gradle.api.internal.tasks.execution.PostExecutionAnalysisTaskExecuter.execute(PostExecutionAnalysisTaskExecuter.java:35)
        at org.gradle.api.internal.tasks.execution.SkipUpToDateTaskExecuter.execute(SkipUpToDateTaskExecuter.java:64)
        at org.gradle.api.internal.tasks.execution.ValidatingTaskExecuter.execute(ValidatingTaskExecuter.java:58)
        at org.gradle.api.internal.tasks.execution.SkipEmptySourceFilesTaskExecuter.execute(SkipEmptySourceFilesTaskExecuter.java:52)
        at org.gradle.api.internal.tasks.execution.SkipTaskWithNoActionsExecuter.execute(SkipTaskWithNoActionsExecuter.java:52)
        at org.gradle.api.internal.tasks.execution.SkipOnlyIfTaskExecuter.execute(SkipOnlyIfTaskExecuter.java:53)
        at org.gradle.api.internal.tasks.execution.ExecuteAtMostOnceTaskExecuter.execute(ExecuteAtMostOnceTaskExecuter.java:43)
        at org.gradle.execution.taskgraph.DefaultTaskGraphExecuter$EventFiringTaskWorker.execute(DefaultTaskGraphExecuter.java:203)
        at org.gradle.execution.taskgraph.DefaultTaskGraphExecuter$EventFiringTaskWorker.execute(DefaultTaskGraphExecuter.java:185)
        at org.gradle.execution.taskgraph.AbstractTaskPlanExecutor$TaskExecutorWorker.processTask(AbstractTaskPlanExecutor.java:62)
        at org.gradle.execution.taskgraph.AbstractTaskPlanExecutor$TaskExecutorWorker.run(AbstractTaskPlanExecutor.java:50)
        at org.gradle.execution.taskgraph.DefaultTaskPlanExecutor.process(DefaultTaskPlanExecutor.java:25)
        at org.gradle.execution.taskgraph.DefaultTaskGraphExecuter.execute(DefaultTaskGraphExecuter.java:110)
        at org.gradle.execution.SelectedTaskExecutionAction.execute(SelectedTaskExecutionAction.java:37)
        at org.gradle.execution.DefaultBuildExecuter.execute(DefaultBuildExecuter.java:37)
        at org.gradle.execution.DefaultBuildExecuter.access$000(DefaultBuildExecuter.java:23)
        at org.gradle.execution.DefaultBuildExecuter$1.proceed(DefaultBuildExecuter.java:43)
        at org.gradle.execution.DryRunBuildExecutionAction.execute(DryRunBuildExecutionAction.java:32)
        at org.gradle.execution.DefaultBuildExecuter.execute(DefaultBuildExecuter.java:37)
        at org.gradle.execution.DefaultBuildExecuter.execute(DefaultBuildExecuter.java:30)
        at org.gradle.initialization.DefaultGradleLauncher$4.run(DefaultGradleLauncher.java:155)
        at org.gradle.internal.Factories$1.create(Factories.java:22)
        at org.gradle.internal.progress.DefaultBuildOperationExecutor.run(DefaultBuildOperationExecutor.java:90)
        at org.gradle.internal.progress.DefaultBuildOperationExecutor.run(DefaultBuildOperationExecutor.java:52)
        at org.gradle.initialization.DefaultGradleLauncher.doBuildStages(DefaultGradleLauncher.java:152)
        at org.gradle.initialization.DefaultGradleLauncher.access$200(DefaultGradleLauncher.java:33)
        at org.gradle.initialization.DefaultGradleLauncher$1.create(DefaultGradleLauncher.java:100)
        at org.gradle.initialization.DefaultGradleLauncher$1.create(DefaultGradleLauncher.java:94)
        at org.gradle.internal.progress.DefaultBuildOperationExecutor.run(DefaultBuildOperationExecutor.java:90)
        at org.gradle.internal.progress.DefaultBuildOperationExecutor.run(DefaultBuildOperationExecutor.java:62)
        at org.gradle.initialization.DefaultGradleLauncher.doBuild(DefaultGradleLauncher.java:94)
        at org.gradle.initialization.DefaultGradleLauncher.run(DefaultGradleLauncher.java:83)
        at org.gradle.launcher.exec.InProcessBuildActionExecuter$DefaultBuildController.run(InProcessBuildActionExecuter.java:94)
        at org.gradle.tooling.internal.provider.ExecuteBuildActionRunner.run(ExecuteBuildActionRunner.java:28)
        at org.gradle.launcher.exec.ChainingBuildActionRunner.run(ChainingBuildActionRunner.java:35)
        at org.gradle.launcher.exec.InProcessBuildActionExecuter.execute(InProcessBuildActionExecuter.java:43)
        at org.gradle.launcher.exec.InProcessBuildActionExecuter.execute(InProcessBuildActionExecuter.java:28)
        at org.gradle.launcher.exec.ContinuousBuildActionExecuter.execute(ContinuousBuildActionExecuter.java:77)
        at org.gradle.launcher.exec.ContinuousBuildActionExecuter.execute(ContinuousBuildActionExecuter.java:47)
        at org.gradle.launcher.exec.DaemonUsageSuggestingBuildActionExecuter.execute(DaemonUsageSuggestingBuildActionExecuter.java:51)
        at org.gradle.launcher.exec.DaemonUsageSuggestingBuildActionExecuter.execute(DaemonUsageSuggestingBuildActionExecuter.java:28)
        at org.gradle.launcher.cli.RunBuildAction.run(RunBuildAction.java:43)
        at org.gradle.internal.Actions$RunnableActionAdapter.execute(Actions.java:170)
        at org.gradle.launcher.cli.CommandLineActionFactory$ParseAndBuildAction.execute(CommandLineActionFactory.java:237)
        at org.gradle.launcher.cli.CommandLineActionFactory$ParseAndBuildAction.execute(CommandLineActionFactory.java:210)
        at org.gradle.launcher.cli.JavaRuntimeValidationAction.execute(JavaRuntimeValidationAction.java:35)
        at org.gradle.launcher.cli.JavaRuntimeValidationAction.execute(JavaRuntimeValidationAction.java:24)
        at org.gradle.launcher.cli.CommandLineActionFactory$WithLogging.execute(CommandLineActionFactory.java:206)
        at org.gradle.launcher.cli.CommandLineActionFactory$WithLogging.execute(CommandLineActionFactory.java:169)
        at org.gradle.launcher.cli.ExceptionReportingAction.execute(ExceptionReportingAction.java:33)
        at org.gradle.launcher.cli.ExceptionReportingAction.execute(ExceptionReportingAction.java:22)
        at org.gradle.launcher.Main.doAction(Main.java:33)
        at org.gradle.launcher.bootstrap.EntryPoint.run(EntryPoint.java:45)
        at org.gradle.launcher.bootstrap.ProcessBootstrap.runNoExit(ProcessBootstrap.java:54)
        at org.gradle.launcher.bootstrap.ProcessBootstrap.run(ProcessBootstrap.java:35)
        at org.gradle.launcher.GradleMain.main(GradleMain.java:23)
        at org.gradle.wrapper.BootstrapMainStarter.start(BootstrapMainStarter.java:30)
        at org.gradle.wrapper.WrapperExecutor.execute(WrapperExecutor.java:127)
        at org.gradle.wrapper.GradleWrapperMain.main(GradleWrapperMain.java:61)
Caused by: org.gradle.api.GradleException: Could not copy file 'C:\Users\#####\OneDrive\Plocha\mcmod\src\main\resources\mcmod.info' to 'C:\Users\#####\OneDrive\Plocha\mcmod\build\resources\main\mcmod.info'.
        at org.gradle.api.internal.file.AbstractFileTreeElement.copyTo(AbstractFileTreeElement.java:79)
        at org.gradle.api.internal.file.copy.DefaultFileCopyDetails.copyTo(DefaultFileCopyDetails.java:102)
        at org.gradle.api.internal.file.copy.FileCopyAction$FileCopyDetailsInternalAction.processFile(FileCopyAction.java:44)
        at org.gradle.api.internal.file.copy.NormalizingCopyActionDecorator$1$1.processFile(NormalizingCopyActionDecorator.java:65)
        at org.gradle.api.internal.file.copy.DuplicateHandlingCopyActionDecorator$1$1.processFile(DuplicateHandlingCopyActionDecorator.java:60)
        at org.gradle.api.internal.file.copy.CopyFileVisitorImpl.processFile(CopyFileVisitorImpl.java:60)
        at org.gradle.api.internal.file.copy.CopyFileVisitorImpl.visitFile(CopyFileVisitorImpl.java:44)
        at org.gradle.api.internal.file.collections.DirectoryFileTree.walkDir(DirectoryFileTree.java:154)
        at org.gradle.api.internal.file.collections.DirectoryFileTree.visitFrom(DirectoryFileTree.java:122)
        at org.gradle.api.internal.file.collections.DirectoryFileTree.visit(DirectoryFileTree.java:112)
        at org.gradle.api.internal.file.collections.FileTreeAdapter.visit(FileTreeAdapter.java:108)
        at org.gradle.api.internal.file.CompositeFileTree.visit(CompositeFileTree.java:55)
        at org.gradle.api.internal.file.copy.CopySpecActionImpl.execute(CopySpecActionImpl.java:37)
        at org.gradle.api.internal.file.copy.CopySpecActionImpl.execute(CopySpecActionImpl.java:24)
        at org.gradle.api.internal.file.copy.DefaultCopySpec$DefaultCopySpecResolver.walk(DefaultCopySpec.java:498)
        at org.gradle.api.internal.file.copy.DefaultCopySpec$DefaultCopySpecResolver.walk(DefaultCopySpec.java:500)
        at org.gradle.api.internal.file.copy.DefaultCopySpec$DefaultCopySpecResolver.walk(DefaultCopySpec.java:500)
        at org.gradle.api.internal.file.copy.DefaultCopySpec.walk(DefaultCopySpec.java:322)
        at org.gradle.api.internal.file.copy.DelegatingCopySpecInternal.walk(DelegatingCopySpecInternal.java:206)
        at org.gradle.api.internal.file.copy.CopySpecBackedCopyActionProcessingStream.process(CopySpecBackedCopyActionProcessingStream.java:36)
        at org.gradle.api.internal.file.copy.DuplicateHandlingCopyActionDecorator$1.process(DuplicateHandlingCopyActionDecorator.java:44)
        at org.gradle.api.internal.file.copy.NormalizingCopyActionDecorator$1.process(NormalizingCopyActionDecorator.java:56)
        at org.gradle.api.internal.file.copy.FileCopyAction.execute(FileCopyAction.java:35)
        at org.gradle.api.internal.file.copy.NormalizingCopyActionDecorator.execute(NormalizingCopyActionDecorator.java:52)
        at org.gradle.api.internal.file.copy.DuplicateHandlingCopyActionDecorator.execute(DuplicateHandlingCopyActionDecorator.java:42)
        at org.gradle.api.internal.file.copy.CopyActionExecuter.execute(CopyActionExecuter.java:38)
        at org.gradle.api.tasks.AbstractCopyTask.copy(AbstractCopyTask.java:83)
        at org.gradle.language.jvm.tasks.ProcessResources.copy(ProcessResources.java:33)
        at org.gradle.internal.reflect.JavaMethod.invoke(JavaMethod.java:75)
        at org.gradle.api.internal.project.taskfactory.AnnotationProcessingTaskFactory$StandardTaskAction.doExecute(AnnotationProcessingTaskFactory.java:226)
        at org.gradle.api.internal.project.taskfactory.AnnotationProcessingTaskFactory$StandardTaskAction.execute(AnnotationProcessingTaskFactory.java:219)
        at org.gradle.api.internal.project.taskfactory.AnnotationProcessingTaskFactory$StandardTaskAction.execute(AnnotationProcessingTaskFactory.java:208)
        at org.gradle.api.internal.AbstractTask$TaskActionWrapper.execute(AbstractTask.java:585)
        at org.gradle.api.internal.AbstractTask$TaskActionWrapper.execute(AbstractTask.java:568)
        at org.gradle.api.internal.tasks.execution.ExecuteActionsTaskExecuter.executeAction(ExecuteActionsTaskExecuter.java:80)
        at org.gradle.api.internal.tasks.execution.ExecuteActionsTaskExecuter.executeActions(ExecuteActionsTaskExecuter.java:61)
        ... 60 more
Caused by: groovy.lang.GroovyRuntimeException: Failed to parse template script (your template may contain an error or be trying to use expressions not currently supported): startup failed:
SimpleTemplateScript1.groovy: 6: unexpected token: 0 @ line 6, column 24.
     \"version\": \"${1.0.0}\",
                          ^

1 error

        at org.gradle.api.internal.file.copy.FilterChain$3.transform(FilterChain.java:90)
        at org.gradle.api.internal.file.copy.FilterChain$3.transform(FilterChain.java:84)
        at org.gradle.api.internal.ChainingTransformer.transform(ChainingTransformer.java:37)
        at org.gradle.api.internal.file.copy.FilterChain.transform(FilterChain.java:39)
        at org.gradle.api.internal.file.copy.FilterChain.transform(FilterChain.java:46)
        at org.gradle.api.internal.file.copy.DefaultFileCopyDetails.open(DefaultFileCopyDetails.java:86)
        at org.gradle.api.internal.file.AbstractFileTreeElement.copyTo(AbstractFileTreeElement.java:56)
        at org.gradle.api.internal.file.copy.DefaultFileCopyDetails.copyTo(DefaultFileCopyDetails.java:94)
        at org.gradle.api.internal.file.AbstractFileTreeElement.copyFile(AbstractFileTreeElement.java:93)
        at org.gradle.api.internal.file.AbstractFileTreeElement.copyTo(AbstractFileTreeElement.java:74)
        ... 95 more


BUILD FAILED

Total time: 3.914 secs



I've looked at this thread, I followed everything, but none of the answers worked.


Every variable is the same in mcmod and in build.gradle: 
 

// For those who want the bleeding edge
buildscript {
    repositories {
        jcenter()
        maven {
            name = "kauftest"
            url = "http://files.minecraftforge.net/maven"
        }
    }
    dependencies {
        classpath 'net.minecraftforge.gradle:ForgeGradle:2.1-SNAPSHOT'
    }
}
apply plugin: 'net.minecraftforge.gradle.forge'

/*
// for people who want stable - not yet functional for MC 1.8.8 - we require the forgegradle 2.1 snapshot
plugins {
    id "net.minecraftforge.gradle.forge" version "2.0.2"
}
*/
// +SETTINGS
def domain = 'com.kauf.www' // http://maven.apache.org/guides/mini/guide-naming-conventions.html
def modid = 'modid'
def mcversion = '1.8.9'
version = '1.0'
// -SETTINGS

group = "${domain}.${modid}"
archivesBaseName = "${modid}_${mcversion}" // add Minecraft version to jar for better user friendliness

minecraft {
    version = "1.8.9-11.15.1.2318-1.8.9"
    runDir = "run"
    
    // the mappings can be changed at any time, and must be in the following format.
    // snapshot_YYYYMMDD   snapshot are built nightly.
    // stable_#            stables are built at the discretion of the MCP team.
    // Use non-default mappings at your own risk. they may not allways work.
    // simply re-run your setup task after changing the mappings to update your workspace.
    mappings = "stable_20"
    // makeObfSourceJar = false // an Srg named sources jar is made by default. uncomment this to disable.
}

dependencies {
    // you may put jars on which you depend on in ./libs
    // or you may define them like so..
    //compile "some.group:artifact:version:classifier"
    //compile "some.group:artifact:version"
      
    // real examples
    //compile 'com.mod-buildcraft:buildcraft:6.0.8:dev'  // adds buildcraft to the dev env
    //compile 'com.googlecode.efficient-java-matrix-library:ejml:0.24' // adds ejml to the dev env

    // the 'provided' configuration is for optional dependencies that exist at compile-time but might not at runtime.
    //provided 'com.mod-buildcraft:buildcraft:6.0.8:dev'

    // the deobf configurations:  'deobfCompile' and 'deobfProvided' are the same as the normal compile and provided,
    // except that these dependencies get remapped to your current MCP mappings
    //deobfCompile 'com.mod-buildcraft:buildcraft:6.0.8:dev'
    //deobfProvided 'com.mod-buildcraft:buildcraft:6.0.8:dev'

    // for more info...
    // http://www.gradle.org/docs/current/userguide/artifact_dependencies_tutorial.html
    // http://www.gradle.org/docs/current/userguide/dependency_management.html

}

processResources
{
    // this will ensure that this task is redone when the versions change.
    inputs.property "version", project.version
    inputs.property "mcversion", project.minecraft.version

    // replace stuff in mcmod.info, nothing else
    from(sourceSets.main.resources.srcDirs) {
        include 'mcmod.info'
                
        // replace version and mcversion
        expand 'version':project.version, 'mcversion':project.minecraft.version
    }
}

And here is my mcmod.info

[
{
  "modid": "test",
  "name": "testkauf",
  "description": "testdesc",
  "version": "${1.0.0}",
  "mcversion": "${1.8.9}",
  "url": "",
  "updateUrl": "",
  "authorList": ["kauf"],
  "credits": "test credits ",
  "logoFile": "",
  "screenshots": [],
  "dependencies": []
}
]

 

Edited by Kaufko
Link to comment
Share on other sites

The version you are using is no longer supported on this forum.

Please update to a modern version of Minecraft to receive support.

Currently supported versions are 1.18.1/1.18.2 (Latest) and 1.16.5 (LTS).

Link to comment
Share on other sites

Guest
This topic is now closed to further replies.
 Share



×
×
  • Create New...

Important Information

By using this site, you agree to our Privacy Policy.