Jump to content
Search In
  • More options...
Find results that contain...
Find results in...

ForgeGradle Failing to execute setupDecompWorkspace


The_1_gamers
 Share

Recommended Posts

Log:

 

FAILURE: Build failed with an exception.

 

* What went wrong:

Task 'setupDecompWorkspace' not found in root project 'Vincent-Laptop'.

 

* Try:

Run gradlew tasks to get a list of available tasks. Run with --info or --debug option to get more log output.

 

* Exception is:

org.gradle.execution.TaskSelectionException: Task 'setupDecompWorkspace' not found in root project 'Vincent-Laptop'.

at org.gradle.execution.TaskSelector.getSelection(TaskSelector.java:69)

at org.gradle.execution.commandline.CommandLineTaskParser.parseTasks(CommandLineTaskParser.java:41)

at org.gradle.execution.TaskNameResolvingBuildConfigurationAction.configure(TaskNameResolvingBuildConfigurationAction.java:45)

at org.gradle.execution.DefaultBuildExecuter.configure(DefaultBuildExecuter.java:42)

at org.gradle.execution.DefaultBuildExecuter.access$100(DefaultBuildExecuter.java:23)

at org.gradle.execution.DefaultBuildExecuter$1.proceed(DefaultBuildExecuter.java:48)

at org.gradle.execution.ExcludedTaskFilteringBuildConfigurationAction.configure(ExcludedTaskFilteringBuildConfigurationAction.java:46)

at org.gradle.execution.DefaultBuildExecuter.configure(DefaultBuildExecuter.java:42)

at org.gradle.execution.DefaultBuildExecuter.access$100(DefaultBuildExecuter.java:23)

at org.gradle.execution.DefaultBuildExecuter$1.proceed(DefaultBuildExecuter.java:48)

at org.gradle.execution.DefaultTasksBuildExecutionAction.configure(DefaultTasksBuildExecutionAction.java:38)

at org.gradle.execution.DefaultBuildExecuter.configure(DefaultBuildExecuter.java:42)

at org.gradle.execution.DefaultBuildExecuter.select(DefaultBuildExecuter.java:35)

at org.gradle.initialization.DefaultGradleLauncher.doBuildStages(DefaultGradleLauncher.java:155)

at org.gradle.initialization.DefaultGradleLauncher.doBuild(DefaultGradleLauncher.java:113)

at org.gradle.initialization.DefaultGradleLauncher.run(DefaultGradleLauncher.java:81)

at org.gradle.launcher.exec.InProcessBuildActionExecuter$DefaultBuildController.run(InProcessBuildActionExecuter.java:64)

at org.gradle.launcher.cli.ExecuteBuildAction.run(ExecuteBuildAction.java:33)

at org.gradle.launcher.cli.ExecuteBuildAction.run(ExecuteBuildAction.java:24)

at org.gradle.launcher.exec.InProcessBuildActionExecuter.execute(InProcessBuildActionExecuter.java:35)

at org.gradle.launcher.exec.InProcessBuildActionExecuter.execute(InProcessBuildActionExecuter.java:26)

at org.gradle.launcher.cli.RunBuildAction.run(RunBuildAction.java:50)

at org.gradle.internal.Actions$RunnableActionAdapter.execute(Actions.java:171)

at org.gradle.launcher.cli.CommandLineActionFactory$ParseAndBuildAction.execute(CommandLineActionFactory.java:201)

at org.gradle.launcher.cli.CommandLineActionFactory$ParseAndBuildAction.execute(CommandLineActionFactory.java:174)

at org.gradle.launcher.cli.CommandLineActionFactory$WithLogging.execute(CommandLineActionFactory.java:170)

at org.gradle.launcher.cli.CommandLineActionFactory$WithLogging.execute(CommandLineActionFactory.java:139)

at org.gradle.launcher.cli.ExceptionReportingAction.execute(ExceptionReportingAction.java:33)

at org.gradle.launcher.cli.ExceptionReportingAction.execute(ExceptionReportingAction.java:22)

at org.gradle.launcher.Main.doAction(Main.java:46)

at org.gradle.launcher.bootstrap.EntryPoint.run(EntryPoint.java:45)

at org.gradle.launcher.Main.main(Main.java:37)

at org.gradle.launcher.bootstrap.ProcessBootstrap.runNoExit(ProcessBootstrap.java:50)

at org.gradle.launcher.bootstrap.ProcessBootstrap.run(ProcessBootstrap.java:32)

at org.gradle.launcher.GradleMain.main(GradleMain.java:23)

at org.gradle.wrapper.BootstrapMainStarter.start(BootstrapMainStarter.java:30)

at org.gradle.wrapper.WrapperExecutor.execute(WrapperExecutor.java:127)

at org.gradle.wrapper.GradleWrapperMain.main(GradleWrapperMain.java:58)

 

 

BUILD FAILED

 

I am doing everything related to the tutorials on youtube I need real bad help

Link to comment
Share on other sites

Join the conversation

You can post now and register later. If you have an account, sign in now to post with your account.
Note: Your post will require moderator approval before it will be visible.

Guest
Reply to this topic...

×   Pasted as rich text.   Restore formatting

  Only 75 emoji are allowed.

×   Your link has been automatically embedded.   Display as a link instead

×   Your previous content has been restored.   Clear editor

×   You cannot paste images directly. Upload or insert images from URL.

 Share



  • Recently Browsing

    • No registered users viewing this page.
  • Posts

    • Whenever I try to start my server I get this crash: [14:05:21] [main/FATAL]: Failed to start the minecraft server com.google.gson.JsonParseException: Error loading registry data: Not a valid resource location: #minecraft:infiniburn_end Non [a-z0-9_.-] character in namespace of location: #minecraft:infiniburn_end         at net.minecraft.core.RegistryAccess.m_175498_(RegistryAccess.java:156) ~[server-1.18.1-20211210.034407-srg.jar%2390!/:?]         at java.util.Optional.ifPresent(Optional.java:178) ~[?:?]         at net.minecraft.core.RegistryAccess.m_175503_(RegistryAccess.java:155) ~[server-1.18.1-20211210.034407-srg.jar%2390!/:?]         at net.minecraft.core.RegistryAccess.m_175500_(RegistryAccess.java:146) ~[server-1.18.1-20211210.034407-srg.jar%2390!/:?]         at net.minecraft.resources.RegistryReadOps.m_195841_(RegistryReadOps.java:37) ~[server-1.18.1-20211210.034407-srg.jar%2390!/:?]         at net.minecraft.resources.RegistryReadOps.m_179866_(RegistryReadOps.java:31) ~[server-1.18.1-20211210.034407-srg.jar%2390!/:?]         at net.minecraft.server.Main.main(Main.java:161) ~[server-1.18.1-20211210.034407-srg.jar%2390!/:?]         at jdk.internal.reflect.NativeMethodAccessorImpl.invoke0(Native Method) ~[?:?]         at jdk.internal.reflect.NativeMethodAccessorImpl.invoke(NativeMethodAccessorImpl.java:77) ~[?:?]         at jdk.internal.reflect.DelegatingMethodAccessorImpl.invoke(DelegatingMethodAccessorImpl.java:43) ~[?:?]         at java.lang.reflect.Method.invoke(Method.java:568) ~[?:?]         at net.minecraftforge.fml.loading.targets.CommonServerLaunchHandler.lambda$launchService$0(CommonServerLaunchHandler.java:46) ~[fmlloader-1.18.1-39.0.75.jar%2361!/:?]         at cpw.mods.modlauncher.LaunchServiceHandlerDecorator.launch(LaunchServiceHandlerDecorator.java:37) ~[modlauncher-9.1.0.jar%2343!/:?]         at cpw.mods.modlauncher.LaunchServiceHandler.launch(LaunchServiceHandler.java:53) ~[modlauncher-9.1.0.jar%2343!/:?]         at cpw.mods.modlauncher.LaunchServiceHandler.launch(LaunchServiceHandler.java:71) ~[modlauncher-9.1.0.jar%2343!/:?]         at cpw.mods.modlauncher.Launcher.run(Launcher.java:106) ~[modlauncher-9.1.0.jar%2343!/:?]         at cpw.mods.modlauncher.Launcher.main(Launcher.java:77) ~[modlauncher-9.1.0.jar%2343!/:?]         at cpw.mods.modlauncher.BootstrapLaunchConsumer.accept(BootstrapLaunchConsumer.java:26) ~[modlauncher-9.1.0.jar%2343!/:?]         at cpw.mods.modlauncher.BootstrapLaunchConsumer.accept(BootstrapLaunchConsumer.java:23) ~[modlauncher-9.1.0.jar%2343!/:?]         at cpw.mods.bootstraplauncher.BootstrapLauncher.main(BootstrapLauncher.java:149) ~[bootstraplauncher-1.0.0.jar:?]         at jdk.internal.reflect.NativeMethodAccessorImpl.invoke0(Native Method) ~[?:?]         at jdk.internal.reflect.NativeMethodAccessorImpl.invoke(NativeMethodAccessorImpl.java:77) ~[?:?]         at jdk.internal.reflect.DelegatingMethodAccessorImpl.invoke(DelegatingMethodAccessorImpl.java:43) ~[?:?]         at java.lang.reflect.Method.invoke(Method.java:568) ~[?:?]         at org.jmt.mcmt.modlauncher.FastUtilTransformerService.argumentValues(FastUtilTransformerService.java:200) ~[jmt_mcmt-1.18.1-0.24.2-118-packaged.jar%2375!/:?]         at cpw.mods.modlauncher.TransformationServicesHandler.lambda$offerArgumentResultsToServices$5(TransformationServicesHandler.java:80) ~[modlauncher-9.1.0.jar%235!/:?]         at java.util.stream.ForEachOps$ForEachOp$OfRef.accept(ForEachOps.java:183) ~[?:?]         at java.util.stream.ReferencePipeline$3$1.accept(ReferencePipeline.java:197) ~[?:?]         at java.util.HashMap$ValueSpliterator.forEachRemaining(HashMap.java:1779) ~[?:?]         at java.util.stream.AbstractPipeline.copyInto(AbstractPipeline.java:509) ~[?:?]         at java.util.stream.AbstractPipeline.wrapAndCopyInto(AbstractPipeline.java:499) ~[?:?]         at java.util.stream.ForEachOps$ForEachOp.evaluateSequential(ForEachOps.java:150) ~[?:?]         at java.util.stream.ForEachOps$ForEachOp$OfRef.evaluateSequential(ForEachOps.java:173) ~[?:?]         at java.util.stream.AbstractPipeline.evaluate(AbstractPipeline.java:234) ~[?:?]         at java.util.stream.ReferencePipeline.forEach(ReferencePipeline.java:596) ~[?:?]         at cpw.mods.modlauncher.TransformationServicesHandler.offerArgumentResultsToServices(TransformationServicesHandler.java:80) ~[modlauncher-9.1.0.jar%235!/:?]         at cpw.mods.modlauncher.ArgumentHandler.processArguments(ArgumentHandler.java:71) [modlauncher-9.1.0.jar%235!/:?]         at cpw.mods.modlauncher.TransformationServicesHandler.processArguments(TransformationServicesHandler.java:68) [modlauncher-9.1.0.jar%235!/:?]         at cpw.mods.modlauncher.TransformationServicesHandler.initializeTransformationServices(TransformationServicesHandler.java:50) [modlauncher-9.1.0.jar%235!/:?]         at cpw.mods.modlauncher.Launcher.run(Launcher.java:87) [modlauncher-9.1.0.jar%235!/:?]         at cpw.mods.modlauncher.Launcher.main(Launcher.java:77) [modlauncher-9.1.0.jar%235!/:?]         at cpw.mods.modlauncher.BootstrapLaunchConsumer.accept(BootstrapLaunchConsumer.java:26) [modlauncher-9.1.0.jar%235!/:?]         at cpw.mods.modlauncher.BootstrapLaunchConsumer.accept(BootstrapLaunchConsumer.java:23) [modlauncher-9.1.0.jar%235!/:?]         at cpw.mods.bootstraplauncher.BootstrapLauncher.main(BootstrapLauncher.java:149) [bootstraplauncher-1.0.0.jar:?] container@pterodactyl~ Server marked as offline... [Game2 Daemon]: ---------- Detected server process in a crashed state! ---------- [Game2 Daemon]: Exit code: 1 [Game2 Daemon]: Out of memory: false [Game2 Daemon]: Aborting automatic restart, last crash occurred less than 120 seconds ago.
    • why, you have Event instance so call the getters we all have the code of the Event the Event exist to perform an action at a specific 'time'/'action' in the game what are you talking about
    • I am sorry, but I have zero idea what you are trying to say.
    • Thanks for the tip, I managed to get the data I wanted in the return parameters of the listened event. Here is part of the code @SubscribeEvent public static void Demo02(LivingHurtEvent event) { System.out.println("sadawedawdawdawdadwa" + '\n' + event.getAmount()); }  
  • Topics

×
×
  • Create New...

Important Information

By using this site, you agree to our Privacy Policy.