Jump to content

[1.7.10] Gradle Error


WARDOGSK93

Recommended Posts

when i run gradle with the arguments setupDecompWorkspace i get this error any help

 

F:\Minecraft Modding Development\MC 1.7.10\OpenPipes>gradle setupDecompWorkspace

 

****************************

Powered By MCP:

http://mcp.ocean-labs.de/

Searge, ProfMobius, Fesh0r,

R4wk, ZeuX, IngisKahn

MCP Data version : unknown

****************************

 

FAILURE: Build failed with an exception.

 

* What went wrong:

A problem occurred configuring root project 'OpenPipes'.

> com.google.gson.stream.MalformedJsonException: Unterminated string at line 528

column 33

 

* Try:

Run with --stacktrace option to get the stack trace. Run with --info or --debug

option to get more log output.

 

BUILD FAILED

 

Total time: 35.761 secs

 

F:\Minecraft Modding Development\MC 1.7.10\OpenPipes>

Link to comment
Share on other sites

Join the conversation

You can post now and register later. If you have an account, sign in now to post with your account.
Note: Your post will require moderator approval before it will be visible.

Guest
Unfortunately, your content contains terms that we do not allow. Please edit your content to remove the highlighted words below.
Reply to this topic...

×   Pasted as rich text.   Restore formatting

  Only 75 emoji are allowed.

×   Your link has been automatically embedded.   Display as a link instead

×   Your previous content has been restored.   Clear editor

×   You cannot paste images directly. Upload or insert images from URL.

Announcements



×
×
  • Create New...

Important Information

By using this site, you agree to our Terms of Use.