Jump to content

Can't build! (Could not copy file Thumbs.db)


Eria8

Recommended Posts

So I'm making like the 30th update for my mod and for some reason I suddenly can't build.

 

It seems it can't find a file called "Thumbs.db" even though that file does not exist even with hidden files enabled.

 

This is the full error log I get:

 

The assetDir is deprecated!  Use runDir instead! runDir set to eclipse/assets/..The assetDir is deprecated!  Use runDir instead! runDir set to eclipse/assets/..

 

****************************

Powered By MCP:           

http://mcp.ocean-labs.de/ 

Searge, ProfMobius, Fesh0r,

R4wk, ZeuX, IngisKahn     

MCP Data version : unknown

****************************

:compileApiJava UP-TO-DATE

:processApiResources UP-TO-DATE

:apiClasses UP-TO-DATE

:sourceMainJava UP-TO-DATE

:compileJava UP-TO-DATE

:processResources FAILED

 

FAILURE: Build failed with an exception.

 

* What went wrong:

Execution failed for task ':processResources'.

> Could not copy file 'C:\Users\Erika\Desktop\Forge 1194 2\src\main\resources\assets\Thumbs.db' to 'C:\Users\Erika\Desktop\Forge 1194 2\build\resources\main\assets\Thumbs.db'.

 

* Try:

Run with --info or --debug option to get more log output.

 

* Exception is:

org.gradle.api.tasks.TaskExecutionException: Execution failed for task ':processResources'.

at org.gradle.api.internal.tasks.execution.ExecuteActionsTaskExecuter.executeActions(ExecuteActionsTaskExecuter.java:69)

at org.gradle.api.internal.tasks.execution.ExecuteActionsTaskExecuter.execute(ExecuteActionsTaskExecuter.java:46)

at org.gradle.api.internal.tasks.execution.PostExecutionAnalysisTaskExecuter.execute(PostExecutionAnalysisTaskExecuter.java:35)

at org.gradle.api.internal.tasks.execution.SkipUpToDateTaskExecuter.execute(SkipUpToDateTaskExecuter.java:64)

at org.gradle.api.internal.tasks.execution.ValidatingTaskExecuter.execute(ValidatingTaskExecuter.java:58)

at org.gradle.api.internal.tasks.execution.SkipEmptySourceFilesTaskExecuter.execute(SkipEmptySourceFilesTaskExecuter.java:42)

at org.gradle.api.internal.tasks.execution.SkipTaskWithNoActionsExecuter.execute(SkipTaskWithNoActionsExecuter.java:52)

at org.gradle.api.internal.tasks.execution.SkipOnlyIfTaskExecuter.execute(SkipOnlyIfTaskExecuter.java:53)

at org.gradle.api.internal.tasks.execution.ExecuteAtMostOnceTaskExecuter.execute(ExecuteAtMostOnceTaskExecuter.java:43)

at org.gradle.api.internal.AbstractTask.executeWithoutThrowingTaskFailure(AbstractTask.java:296)

at org.gradle.execution.taskgraph.AbstractTaskPlanExecutor$TaskExecutorWorker.executeTask(AbstractTaskPlanExecutor.java:79)

at org.gradle.execution.taskgraph.AbstractTaskPlanExecutor$TaskExecutorWorker.processTask(AbstractTaskPlanExecutor.java:63)

at org.gradle.execution.taskgraph.AbstractTaskPlanExecutor$TaskExecutorWorker.run(AbstractTaskPlanExecutor.java:51)

at org.gradle.execution.taskgraph.DefaultTaskPlanExecutor.process(DefaultTaskPlanExecutor.java:23)

at org.gradle.execution.taskgraph.DefaultTaskGraphExecuter.execute(DefaultTaskGraphExecuter.java:86)

at org.gradle.execution.SelectedTaskExecutionAction.execute(SelectedTaskExecutionAction.java:29)

at org.gradle.execution.DefaultBuildExecuter.execute(DefaultBuildExecuter.java:61)

at org.gradle.execution.DefaultBuildExecuter.access$200(DefaultBuildExecuter.java:23)

at org.gradle.execution.DefaultBuildExecuter$2.proceed(DefaultBuildExecuter.java:67)

at org.gradle.execution.DryRunBuildExecutionAction.execute(DryRunBuildExecutionAction.java:32)

at org.gradle.execution.DefaultBuildExecuter.execute(DefaultBuildExecuter.java:61)

at org.gradle.execution.DefaultBuildExecuter.execute(DefaultBuildExecuter.java:54)

at org.gradle.initialization.DefaultGradleLauncher.doBuildStages(DefaultGradleLauncher.java:148)

at org.gradle.initialization.DefaultGradleLauncher.doBuild(DefaultGradleLauncher.java:105)

at org.gradle.initialization.DefaultGradleLauncher.run(DefaultGradleLauncher.java:85)

at org.gradle.launcher.exec.InProcessBuildActionExecuter$DefaultBuildController.run(InProcessBuildActionExecuter.java:81)

at org.gradle.launcher.cli.ExecuteBuildAction.run(ExecuteBuildAction.java:33)

at org.gradle.launcher.cli.ExecuteBuildAction.run(ExecuteBuildAction.java:24)

at org.gradle.launcher.exec.InProcessBuildActionExecuter.execute(InProcessBuildActionExecuter.java:39)

at org.gradle.launcher.exec.InProcessBuildActionExecuter.execute(InProcessBuildActionExecuter.java:29)

at org.gradle.launcher.cli.RunBuildAction.run(RunBuildAction.java:50)

at org.gradle.internal.Actions$RunnableActionAdapter.execute(Actions.java:171)

at org.gradle.launcher.cli.CommandLineActionFactory$ParseAndBuildAction.execute(CommandLineActionFactory.java:237)

at org.gradle.launcher.cli.CommandLineActionFactory$ParseAndBuildAction.execute(CommandLineActionFactory.java:210)

at org.gradle.launcher.cli.JavaRuntimeValidationAction.execute(JavaRuntimeValidationAction.java:35)

at org.gradle.launcher.cli.JavaRuntimeValidationAction.execute(JavaRuntimeValidationAction.java:24)

at org.gradle.launcher.cli.CommandLineActionFactory$WithLogging.execute(CommandLineActionFactory.java:206)

at org.gradle.launcher.cli.CommandLineActionFactory$WithLogging.execute(CommandLineActionFactory.java:169)

at org.gradle.launcher.cli.ExceptionReportingAction.execute(ExceptionReportingAction.java:33)

at org.gradle.launcher.cli.ExceptionReportingAction.execute(ExceptionReportingAction.java:22)

at org.gradle.launcher.Main.doAction(Main.java:33)

at org.gradle.launcher.bootstrap.EntryPoint.run(EntryPoint.java:45)

at org.gradle.launcher.bootstrap.ProcessBootstrap.runNoExit(ProcessBootstrap.java:54)

at org.gradle.launcher.bootstrap.ProcessBootstrap.run(ProcessBootstrap.java:35)

at org.gradle.launcher.GradleMain.main(GradleMain.java:23)

at org.gradle.wrapper.BootstrapMainStarter.start(BootstrapMainStarter.java:30)

at org.gradle.wrapper.WrapperExecutor.execute(WrapperExecutor.java:127)

at org.gradle.wrapper.GradleWrapperMain.main(GradleWrapperMain.java:56)

Caused by: org.gradle.api.GradleException: Could not copy file 'C:\Users\Erika\Desktop\Forge 1194 2\src\main\resources\assets\Thumbs.db' to 'C:\Users\Erika\Desktop\Forge 1194 2\build\resources\main\assets\Thumbs.db'.

at org.gradle.api.internal.file.AbstractFileTreeElement.copyTo(AbstractFileTreeElement.java:79)

at org.gradle.api.internal.file.copy.DefaultFileCopyDetails.copyTo(DefaultFileCopyDetails.java:104)

at org.gradle.api.internal.file.copy.FileCopyAction$FileCopyDetailsInternalAction.processFile(FileCopyAction.java:44)

at org.gradle.api.internal.file.copy.NormalizingCopyActionDecorator$1$1.processFile(NormalizingCopyActionDecorator.java:65)

at org.gradle.api.internal.file.copy.DuplicateHandlingCopyActionDecorator$1$1.processFile(DuplicateHandlingCopyActionDecorator.java:60)

at org.gradle.api.internal.file.copy.CopyFileVisitorImpl.processFile(CopyFileVisitorImpl.java:60)

at org.gradle.api.internal.file.copy.CopyFileVisitorImpl.visitFile(CopyFileVisitorImpl.java:44)

at org.gradle.api.internal.file.collections.DirectoryFileTree.walkDir(DirectoryFileTree.java:157)

at org.gradle.api.internal.file.collections.DirectoryFileTree.walkDir(DirectoryFileTree.java:172)

at org.gradle.api.internal.file.collections.DirectoryFileTree.visitFrom(DirectoryFileTree.java:125)

at org.gradle.api.internal.file.collections.DirectoryFileTree.visit(DirectoryFileTree.java:115)

at org.gradle.api.internal.file.collections.FileTreeAdapter.visit(FileTreeAdapter.java:96)

at org.gradle.api.internal.file.CompositeFileTree.visit(CompositeFileTree.java:54)

at org.gradle.api.internal.file.copy.CopySpecActionImpl.execute(CopySpecActionImpl.java:37)

at org.gradle.api.internal.file.copy.CopySpecActionImpl.execute(CopySpecActionImpl.java:24)

at org.gradle.api.internal.file.copy.DefaultCopySpec$DefaultCopySpecResolver.walk(DefaultCopySpec.java:498)

at org.gradle.api.internal.file.copy.DefaultCopySpec$DefaultCopySpecResolver.walk(DefaultCopySpec.java:500)

at org.gradle.api.internal.file.copy.DefaultCopySpec.walk(DefaultCopySpec.java:322)

at org.gradle.api.internal.file.copy.DelegatingCopySpecInternal.walk(DelegatingCopySpecInternal.java:206)

at org.gradle.api.internal.file.copy.CopySpecBackedCopyActionProcessingStream.process(CopySpecBackedCopyActionProcessingStream.java:36)

at org.gradle.api.internal.file.copy.DuplicateHandlingCopyActionDecorator$1.process(DuplicateHandlingCopyActionDecorator.java:44)

at org.gradle.api.internal.file.copy.NormalizingCopyActionDecorator$1.process(NormalizingCopyActionDecorator.java:56)

at org.gradle.api.internal.file.copy.FileCopyAction.execute(FileCopyAction.java:35)

at org.gradle.api.internal.file.copy.NormalizingCopyActionDecorator.execute(NormalizingCopyActionDecorator.java:52)

at org.gradle.api.internal.file.copy.DuplicateHandlingCopyActionDecorator.execute(DuplicateHandlingCopyActionDecorator.java:42)

at org.gradle.api.internal.file.copy.CopyActionExecuter.execute(CopyActionExecuter.java:38)

at org.gradle.api.tasks.AbstractCopyTask.copy(AbstractCopyTask.java:83)

at org.gradle.language.jvm.tasks.ProcessResources.copy(ProcessResources.java:33)

at org.gradle.internal.reflect.JavaMethod.invoke(JavaMethod.java:63)

at org.gradle.api.internal.project.taskfactory.AnnotationProcessingTaskFactory$StandardTaskAction.doExecute(AnnotationProcessingTaskFactory.java:218)

at org.gradle.api.internal.project.taskfactory.AnnotationProcessingTaskFactory$StandardTaskAction.execute(AnnotationProcessingTaskFactory.java:211)

at org.gradle.api.internal.project.taskfactory.AnnotationProcessingTaskFactory$StandardTaskAction.execute(AnnotationProcessingTaskFactory.java:200)

at org.gradle.api.internal.AbstractTask$TaskActionWrapper.execute(AbstractTask.java:570)

at org.gradle.api.internal.AbstractTask$TaskActionWrapper.execute(AbstractTask.java:553)

at org.gradle.api.internal.tasks.execution.ExecuteActionsTaskExecuter.executeAction(ExecuteActionsTaskExecuter.java:80)

at org.gradle.api.internal.tasks.execution.ExecuteActionsTaskExecuter.executeActions(ExecuteActionsTaskExecuter.java:61)

... 47 more

Caused by: java.io.FileNotFoundException: C:\Users\Erika\Desktop\Forge 1194 2\build\resources\main\assets\Thumbs.db (Access is denied)

at org.gradle.api.internal.file.AbstractFileTreeElement.copyFile(AbstractFileTreeElement.java:91)

at org.gradle.api.internal.file.AbstractFileTreeElement.copyTo(AbstractFileTreeElement.java:74)

... 82 more

 

 

BUILD FAILED

 

Total time: 16.36 secs

 

 

 

And even when I completely disable image caching which is supposed to fix "Thumbs.db" related errors, the same thing happens.

 

A quick response would be very much appreciated...

Link to comment
Share on other sites

Join the conversation

You can post now and register later. If you have an account, sign in now to post with your account.
Note: Your post will require moderator approval before it will be visible.

Guest
Unfortunately, your content contains terms that we do not allow. Please edit your content to remove the highlighted words below.
Reply to this topic...

×   Pasted as rich text.   Restore formatting

  Only 75 emoji are allowed.

×   Your link has been automatically embedded.   Display as a link instead

×   Your previous content has been restored.   Clear editor

×   You cannot paste images directly. Upload or insert images from URL.



×
×
  • Create New...

Important Information

By using this site, you agree to our Terms of Use.