Jump to content

I got another problem with gradle.


Lumberstock

Recommended Posts

Let's just get to the problem.

I'm trying to install forge 1.7.2.

Everytime I try, it says:

 

"FAILURE: Build failed with an exception.

 

* What went wrong:

The setupDecompWorkspace will only work with Java 7! This is fixed in ForgeGradle 1.2

 

* Try:

Run with --stacktrace option to get the stack trace. Run with --info or --debug option to get more log output.

 

BUILD FAILED"

 

Yeah. It's pretty obvious, what I need to do, but I already downgraded from 8 to 7. - Six times. So, I don't know what I should do.

I've tried clearing the cache and running it with --stacktrace.

 

Then it said:

 

java.lang.RuntimeException: The setupDecompWorkspace will only work with Java 7! This is fixed in ForgeGradle 1.2

at net.minecraftforge.gradle.user.UserBasePlugin$1.call(UserBasePlugin.java:127)

at net.minecraftforge.gradle.user.UserBasePlugin$1.call(UserBasePlugin.java:146)

at org.gradle.listener.ClosureBackedMethodInvocationDispatch.dispatch(ClosureBackedMethodInvocationDispatch.java:40)

at org.gradle.listener.ClosureBackedMethodInvocationDispatch.dispatch(ClosureBackedMethodInvocationDispatch.java:25)

at org.gradle.listener.BroadcastDispatch.dispatch(BroadcastDispatch.java:79)

at org.gradle.listener.BroadcastDispatch.dispatch(BroadcastDispatch.java:31)

at org.gradle.messaging.dispatch.ProxyDispatchAdapter$DispatchingInvocationHandler.invoke(ProxyDispatchAdapter.java:93)

at com.sun.proxy.$Proxy11.graphPopulated(Unknown Source)

at org.gradle.execution.taskgraph.DefaultTaskGraphExecuter.execute(DefaultTaskGraphExecuter.java:84)

at org.gradle.execution.SelectedTaskExecutionAction.execute(SelectedTaskExecutionAction.java:29)

at org.gradle.execution.DefaultBuildExecuter.execute(DefaultBuildExecuter.java:61)

at org.gradle.execution.DefaultBuildExecuter.access$200(DefaultBuildExecuter.java:23)

at org.gradle.execution.DefaultBuildExecuter$2.proceed(DefaultBuildExecuter.java:67)

at org.gradle.execution.DryRunBuildExecutionAction.execute(DryRunBuildExecutionAction.java:32)

at org.gradle.execution.DefaultBuildExecuter.execute(DefaultBuildExecuter.java:61)

at org.gradle.execution.DefaultBuildExecuter.execute(DefaultBuildExecuter.java:54)

at org.gradle.initialization.DefaultGradleLauncher.doBuildStages(DefaultGradleLauncher.java:166)

at org.gradle.initialization.DefaultGradleLauncher.doBuild(DefaultGradleLauncher.java:113)

at org.gradle.initialization.DefaultGradleLauncher.run(DefaultGradleLauncher.java:81)

at org.gradle.launcher.exec.InProcessBuildActionExecuter$DefaultBuildController.run(InProcessBuildActionExecuter.java:64)

at org.gradle.launcher.cli.ExecuteBuildAction.run(ExecuteBuildAction.java:33)

at org.gradle.launcher.cli.ExecuteBuildAction.run(ExecuteBuildAction.java:24)

at org.gradle.launcher.exec.InProcessBuildActionExecuter.execute(InProcessBuildActionExecuter.java:35)

at org.gradle.launcher.exec.InProcessBuildActionExecuter.execute(InProcessBuildActionExecuter.java:26)

at org.gradle.launcher.cli.RunBuildAction.run(RunBuildAction.java:50)

at org.gradle.internal.Actions$RunnableActionAdapter.execute(Actions.java:171)

at org.gradle.launcher.cli.CommandLineActionFactory$ParseAndBuildAction.execute(CommandLineActionFactory.java:201)

at org.gradle.launcher.cli.CommandLineActionFactory$ParseAndBuildAction.execute(CommandLineActionFactory.java:174)

at org.gradle.launcher.cli.CommandLineActionFactory$WithLogging.execute(CommandLineActionFactory.java:170)

at org.gradle.launcher.cli.CommandLineActionFactory$WithLogging.execute(CommandLineActionFactory.java:139)

at org.gradle.launcher.cli.ExceptionReportingAction.execute(ExceptionReportingAction.java:33)

at org.gradle.launcher.cli.ExceptionReportingAction.execute(ExceptionReportingAction.java:22)

at org.gradle.launcher.Main.doAction(Main.java:46)

at org.gradle.launcher.bootstrap.EntryPoint.run(EntryPoint.java:45)

at org.gradle.launcher.Main.main(Main.java:37)

at org.gradle.launcher.bootstrap.ProcessBootstrap.runNoExit(ProcessBootstrap.java:50)

at org.gradle.launcher.bootstrap.ProcessBootstrap.run(ProcessBootstrap.java:32)

at org.gradle.launcher.GradleMain.main(GradleMain.java:23)

at org.gradle.wrapper.BootstrapMainStarter.start(BootstrapMainStarter.java:30)

at org.gradle.wrapper.WrapperExecutor.execute(WrapperExecutor.java:127)

at org.gradle.wrapper.GradleWrapperMain.main(GradleWrapperMain.java:58)

 

Apologies for the bad knowledge of coding and stuff.

 

 

This is this.

Link to comment
Share on other sites

Join the conversation

You can post now and register later. If you have an account, sign in now to post with your account.
Note: Your post will require moderator approval before it will be visible.

Guest
Unfortunately, your content contains terms that we do not allow. Please edit your content to remove the highlighted words below.
Reply to this topic...

×   Pasted as rich text.   Restore formatting

  Only 75 emoji are allowed.

×   Your link has been automatically embedded.   Display as a link instead

×   Your previous content has been restored.   Clear editor

×   You cannot paste images directly. Upload or insert images from URL.



  • Recently Browsing

    • No registered users viewing this page.
  • Posts

    • Minecraft opened, but when I went to create a new world I got another error. https://pastebin.com/mmdNztmW
    • java.lang.RuntimeException: Could not execute entrypoint stage 'main' due to errors, provided by 'terrablender'!     at net.fabricmc.loader.impl.FabricLoaderImpl.lambda$invokeEntrypoints$2(FabricLoaderImpl.java:388) ~[fabric-loader-0.15.11.jar:?]     at net.fabricmc.loader.impl.util.ExceptionUtil.gatherExceptions(ExceptionUtil.java:33) ~[fabric-loader-0.15.11.jar:?]     at net.fabricmc.loader.impl.FabricLoaderImpl.invokeEntrypoints(FabricLoaderImpl.java:386) ~[fabric-loader-0.15.11.jar:?]     at net.fabricmc.loader.impl.game.minecraft.Hooks.startServer(Hooks.java:63) ~[fabric-loader-0.15.11.jar:?]     at net.minecraft.server.Main.main(Main.java:112) ~[server-intermediary.jar:?]     at net.fabricmc.loader.impl.game.minecraft.MinecraftGameProvider.launch(MinecraftGameProvider.java:470) ~[fabric-loader-0.15.11.jar:?]     at net.fabricmc.loader.impl.launch.knot.Knot.launch(Knot.java:74) ~[fabric-loader-0.15.11.jar:?]     at net.fabricmc.loader.impl.launch.knot.KnotServer.main(KnotServer.java:23) ~[fabric-loader-0.15.11.jar:?]     at net.fabricmc.loader.impl.launch.server.FabricServerLauncher.main(FabricServerLauncher.java:69) ~[fabric-loader-0.15.11.jar:?] Caused by: java.lang.NoSuchFieldError: Class me.lortseam.completeconfig.data.BooleanEntry does not have member field 'boolean checkbox'     at me.lortseam.completeconfig.data.BooleanEntry.<init>(BooleanEntry.java:25) ~[completeconfig-base-2.5.0-cd5950f26b406f27.jar:?]     at me.lortseam.completeconfig.data.Entry.create(Entry.java:42) ~[completeconfig-base-2.5.0-cd5950f26b406f27.jar:?]     at me.lortseam.completeconfig.data.EntrySet.lambda$resolve$1(EntrySet.java:31) ~[completeconfig-base-2.5.0-cd5950f26b406f27.jar:?]     at java.util.stream.ReferencePipeline$3$1.accept(ReferencePipeline.java:212) ~[?:?]     at java.util.stream.ReferencePipeline$2$1.accept(ReferencePipeline.java:194) ~[?:?]     at java.util.Spliterators$ArraySpliterator.forEachRemaining(Spliterators.java:1024) ~[?:?]     at java.util.stream.AbstractPipeline.copyInto(AbstractPipeline.java:556) ~[?:?]     at java.util.stream.AbstractPipeline.wrapAndCopyInto(AbstractPipeline.java:546) ~[?:?]     at java.util.stream.ForEachOps$ForEachOp.evaluateSequential(ForEachOps.java:151) ~[?:?]     at java.util.stream.ForEachOps$ForEachOp$OfRef.evaluateSequential(ForEachOps.java:174) ~[?:?]     at java.util.stream.AbstractPipeline.evaluate(AbstractPipeline.java:265) ~[?:?]     at java.util.stream.ReferencePipeline.forEach(ReferencePipeline.java:611) ~[?:?]     at me.lortseam.completeconfig.data.EntrySet.resolve(EntrySet.java:32) ~[completeconfig-base-2.5.0-cd5950f26b406f27.jar:?]     at me.lortseam.completeconfig.data.Parent.resolveContainer(Parent.java:58) ~[completeconfig-base-2.5.0-cd5950f26b406f27.jar:?]     at me.lortseam.completeconfig.data.Parent.resolve(Parent.java:110) ~[completeconfig-base-2.5.0-cd5950f26b406f27.jar:?]     at me.lortseam.completeconfig.data.Config.lambda$new$0(Config.java:51) ~[completeconfig-base-2.5.0-cd5950f26b406f27.jar:?]     at me.lortseam.completeconfig.data.Config.deserialize(Config.java:94) ~[completeconfig-base-2.5.0-cd5950f26b406f27.jar:?]     at me.lortseam.completeconfig.data.Config.load(Config.java:121) ~[completeconfig-base-2.5.0-cd5950f26b406f27.jar:?]     at io.github.uhq_games.regions_unexplored.RegionsUnexplored.onTerraBlenderInitialized(RegionsUnexplored.java:70) ~[RegionsUnexploredFabric-0.5.31.20.1.jar:?]     at terrablender.core.TerraBlenderFabric.lambda$onInitialize$0(TerraBlenderFabric.java:40) ~[TerraBlender-fabric-1.20.1-3.0.1.7.jar:?]     at java.util.ArrayList.forEach(ArrayList.java:1597) ~[?:?]     at terrablender.core.TerraBlenderFabric.onInitialize(TerraBlenderFabric.java:38) ~[TerraBlender-fabric-1.20.1-3.0.1.7.jar:?]     at net.fabricmc.loader.impl.FabricLoaderImpl.invokeEntrypoints(FabricLoaderImpl.java:384) ~[fabric-loader-0.15.11.jar:?]  
    • Hi, I have the oficial launcher using the version 1.21, and forge 51.0.13, as soon as I start the installation the games crashes and gives me "exit code: 1", I haven't put any mods yet in the folder. Its the second time that uninstall and install everything and nothing works, checket my graphics and they are updated. https://pastebin.com/STPgEiVs   thanks!
    • Ty very much it worked
    • no clue what is going on, you guys seem more knowledgeable than I am. So here's my log as well as my mod list. Error Folder On Google Drive  
  • Topics

×
×
  • Create New...

Important Information

By using this site, you agree to our Terms of Use.