Jump to content
Search In
  • More options...
Find results that contain...
Find results in...

Gradlew error : java.lang.IllegalStateException


AlekBardzo
 Share

Recommended Posts

Hi

 

  Everything worked nicely, I made a mod, built it, and wanted to make another one, and without any particular reason that I can think of, gradlew went haywire. Whenever I try to build or decompWorkspace I get the following error :

 

FAILURE: Build failed with an exception.

 

* Where:

Build file 'C:\Users\dell\Desktop\Java\forge-1.7.10-10.13.2.1291-src\build.gradle' line: 18

 

* What went wrong:

A problem occurred evaluating root project 'forge-1.7.10-10.13.2.1291-src'.

> java.lang.IllegalStateException: Expected BEGIN_OBJECT but was STRING at line 3 column 1

 

 

What do I do ? I'm pretty green with this stuff.

I'm using JDK 1.7.0_75, forge obviously 1.7.10-10.13.2.1291

Link to comment
Share on other sites

 

FAILURE: Build failed with an exception.

 

* Where:

Build file 'C:\Users\dell\Desktop\Java\forge-1.7.10-10.13.2.1291-src\build.gradle' line: 18

 

* What went wrong:

A problem occurred evaluating root project 'forge-1.7.10-10.13.2.1291-src'.

> java.lang.IllegalStateException: Expected BEGIN_OBJECT but was STRING at line 3 column 1

 

* Try:

Run with --info or --debug option to get more log output.

 

* Exception is:

org.gradle.api.GradleScriptException: A problem occurred evaluating root project 'forge-1.7.10-10.13.2.1291-src'.

at org.gradle.groovy.scripts.internal.DefaultScriptRunnerFactory$ScriptRunnerImpl.run(DefaultScriptRunnerFactory.java:54)

at org.gradle.configuration.DefaultScriptPluginFactory$ScriptPluginImpl.apply(DefaultScriptPluginFactory.java:187)

at org.gradle.configuration.project.BuildScriptProcessor.execute(BuildScriptProcessor.java:39)

at org.gradle.configuration.project.BuildScriptProcessor.execute(BuildScriptProcessor.java:26)

at org.gradle.configuration.project.ConfigureActionsProjectEvaluator.evaluate(ConfigureActionsProjectEvaluator.java:34)

at org.gradle.configuration.project.LifecycleProjectEvaluator.evaluate(LifecycleProjectEvaluator.java:55)

at org.gradle.api.internal.project.AbstractProject.evaluate(AbstractProject.java:470)

at org.gradle.api.internal.project.AbstractProject.evaluate(AbstractProject.java:79)

at org.gradle.configuration.DefaultBuildConfigurer.configure(DefaultBuildConfigurer.java:31)

at org.gradle.initialization.DefaultGradleLauncher.doBuildStages(DefaultGradleLauncher.java:128)

at org.gradle.initialization.DefaultGradleLauncher.doBuild(DefaultGradleLauncher.java:105)

at org.gradle.initialization.DefaultGradleLauncher.run(DefaultGradleLauncher.java:85)

at org.gradle.launcher.exec.InProcessBuildActionExecuter$DefaultBuildController.run(InProcessBuildActionExecuter.java:81)

at org.gradle.launcher.cli.ExecuteBuildAction.run(ExecuteBuildAction.java:33)

at org.gradle.launcher.cli.ExecuteBuildAction.run(ExecuteBuildAction.java:24)

at org.gradle.launcher.exec.InProcessBuildActionExecuter.execute(InProcessBuildActionExecuter.java:39)

at org.gradle.launcher.exec.InProcessBuildActionExecuter.execute(InProcessBuildActionExecuter.java:29)

at org.gradle.launcher.cli.RunBuildAction.run(RunBuildAction.java:50)

at org.gradle.internal.Actions$RunnableActionAdapter.execute(Actions.java:171)

at org.gradle.launcher.cli.CommandLineActionFactory$ParseAndBuildAction.execute(CommandLineActionFactory.java:237)

at org.gradle.launcher.cli.CommandLineActionFactory$ParseAndBuildAction.execute(CommandLineActionFactory.java:210)

at org.gradle.launcher.cli.JavaRuntimeValidationAction.execute(JavaRuntimeValidationAction.java:35)

at org.gradle.launcher.cli.JavaRuntimeValidationAction.execute(JavaRuntimeValidationAction.java:24)

at org.gradle.launcher.cli.CommandLineActionFactory$WithLogging.execute(CommandLineActionFactory.java:206)

at org.gradle.launcher.cli.CommandLineActionFactory$WithLogging.execute(CommandLineActionFactory.java:169)

at org.gradle.launcher.cli.ExceptionReportingAction.execute(ExceptionReportingAction.java:33)

at org.gradle.launcher.cli.ExceptionReportingAction.execute(ExceptionReportingAction.java:22)

at org.gradle.launcher.Main.doAction(Main.java:33)

at org.gradle.launcher.bootstrap.EntryPoint.run(EntryPoint.java:45)

at org.gradle.launcher.bootstrap.ProcessBootstrap.runNoExit(ProcessBootstrap.java:54)

at org.gradle.launcher.bootstrap.ProcessBootstrap.run(ProcessBootstrap.java:35)

at org.gradle.launcher.GradleMain.main(GradleMain.java:23)

at org.gradle.wrapper.BootstrapMainStarter.start(BootstrapMainStarter.java:30)

at org.gradle.wrapper.WrapperExecutor.execute(WrapperExecutor.java:127)

at org.gradle.wrapper.GradleWrapperMain.main(GradleWrapperMain.java:56)

Caused by: com.google.gson.JsonSyntaxException: java.lang.IllegalStateException: Expected BEGIN_OBJECT but was STRING at line 3 column 1

at com.google.gson.internal.bind.ReflectiveTypeAdapterFactory$Adapter.read(ReflectiveTypeAdapterFactory.java:176)

at com.google.gson.Gson.fromJson(Gson.java:803)

at com.google.gson.Gson.fromJson(Gson.java:768)

at com.google.gson.Gson.fromJson(Gson.java:717)

at com.google.gson.Gson.fromJson(Gson.java:689)

at net.minecraftforge.gradle.user.patch.UserPatchBasePlugin.setVersionInfoJson(UserPatchBasePlugin.java:144)

at net.minecraftforge.gradle.user.patch.UserPatchBasePlugin.applyPlugin(UserPatchBasePlugin.java:56)

at net.minecraftforge.gradle.common.BasePlugin.apply(BasePlugin.java:138)

at net.minecraftforge.gradle.common.BasePlugin.apply(BasePlugin.java:41)

at org.gradle.api.internal.plugins.DefaultPluginContainer.providePlugin(DefaultPluginContainer.java:110)

at org.gradle.api.internal.plugins.DefaultPluginContainer.addPluginInternal(DefaultPluginContainer.java:69)

at org.gradle.api.internal.plugins.DefaultPluginContainer.apply(DefaultPluginContainer.java:35)

at org.gradle.api.internal.plugins.DefaultObjectConfigurationAction.applyPlugin(DefaultObjectConfigurationAction.java:117)

at org.gradle.api.internal.plugins.DefaultObjectConfigurationAction.access$200(DefaultObjectConfigurationAction.java:36)

at org.gradle.api.internal.plugins.DefaultObjectConfigurationAction$3.run(DefaultObjectConfigurationAction.java:85)

at org.gradle.api.internal.plugins.DefaultObjectConfigurationAction.execute(DefaultObjectConfigurationAction.java:130)

at org.gradle.api.internal.project.AbstractPluginAware.apply(AbstractPluginAware.java:41)

at org.gradle.api.Project$apply$0.call(Unknown Source)

at org.gradle.api.internal.project.ProjectScript.apply(ProjectScript.groovy:34)

at org.gradle.api.Script$apply$0.callCurrent(Unknown Source)

at build_30no3cq3s4r6pm77r6kqn2u6u5.run(C:\Users\dell\Desktop\Java\forge-1.7.10-10.13.2.1291-src\build.gradle:18)

at org.gradle.groovy.scripts.internal.DefaultScriptRunnerFactory$ScriptRunnerImpl.run(DefaultScriptRunnerFactory.java:52)

... 34 more

Caused by: java.lang.IllegalStateException: Expected BEGIN_OBJECT but was STRING at line 3 column 1

at com.google.gson.stream.JsonReader.beginObject(JsonReader.java:374)

at com.google.gson.internal.bind.ReflectiveTypeAdapterFactory$Adapter.read(ReflectiveTypeAdapterFactory.java:165)

... 55 more

 

 

BUILD FAILED

 

Total time: 8.142 secs

Link to comment
Share on other sites

Join the conversation

You can post now and register later. If you have an account, sign in now to post with your account.
Note: Your post will require moderator approval before it will be visible.

Guest
Reply to this topic...

×   Pasted as rich text.   Restore formatting

  Only 75 emoji are allowed.

×   Your link has been automatically embedded.   Display as a link instead

×   Your previous content has been restored.   Clear editor

×   You cannot paste images directly. Upload or insert images from URL.

 Share



×
×
  • Create New...

Important Information

By using this site, you agree to our Privacy Policy.