Jump to content
Search In
  • More options...
Find results that contain...
Find results in...

:reobf error


Xetapro12
 Share

Recommended Posts

Hey this happen when i do gradlew build

 

 BUILD FAILED

Total time: 8.5 secs

C:\Users\Marius\Desktop\1.7.10>gradlew build --info
Starting Build
Settings evaluated using empty settings script.
Projects loaded. Root project using build file 'C:\Users\Marius\Desktop\1.7.10\b
uild.gradle'.
Included projects: [root project '1.7.10']
Evaluating root project '1.7.10' using build file 'C:\Users\Marius\Desktop\1.7.1
0\build.gradle'.
****************************
Powered By MCP:
http://mcp.ocean-labs.de/
Searge, ProfMobius, Fesh0r,
R4wk, ZeuX, IngisKahn, bspkrs
MCP Data version : unknown
****************************
All projects evaluated.
Selected primary task 'DefaultTaskParameter{taskName='build',projectPath='null'}
'
Tasks to be executed: [task ':compileApiJava', task ':processApiResources', task
':apiClasses', task ':sourceMainJava', task ':compileJava', task ':processResou
rces', task ':classes', task ':jar', task ':compileTestJava', task ':processTest
Resources', task ':testClasses', task ':test', task ':extractMcpData', task ':ge
tVersionJson', task ':extractUserDev', task ':genSrgs', task ':reobf', task ':as
semble', task ':check', task ':build']
:compileApiJava (Thread[main,5,main]) started.
:compileApiJava
Skipping task ':compileApiJava' as it has no source files.
:compileApiJava UP-TO-DATE
:compileApiJava (Thread[main,5,main]) completed. Took 0.024 secs.
:processApiResources (Thread[main,5,main]) started.
:processApiResources
Skipping task ':processApiResources' as it has no source files.
:processApiResources UP-TO-DATE
:processApiResources (Thread[main,5,main]) completed. Took 0.007 secs.
:apiClasses (Thread[main,5,main]) started.
:apiClasses
Skipping task ':apiClasses' as it has no actions.
:apiClasses UP-TO-DATE
:apiClasses (Thread[main,5,main]) completed. Took 0.007 secs.
:sourceMainJava (Thread[main,5,main]) started.
:sourceMainJava
Skipping task ':sourceMainJava' as it is up-to-date (took 0.07 secs).
:sourceMainJava UP-TO-DATE
:sourceMainJava (Thread[main,5,main]) completed. Took 0.08 secs.
:compileJava (Thread[main,5,main]) started.
:compileJava
Failed to get resource: GET. [HTTP HTTP/1.1 403 Forbidden: https://libraries.min
ecraft.net//forgeSrc/1.7.10-10.13.2.1291/forgeSrc-1.7.10-10.13.2.1291.pom]
Failed to get resource: GET. [HTTP HTTP/1.1 403 Forbidden: https://libraries.min
ecraft.net/org/scala-lang/scala-parser-combinators_2.11/1.0.1/scala-parser-combi
nators_2.11-1.0.1.pom]
Failed to get resource: GET. [HTTP HTTP/1.1 403 Forbidden: https://libraries.min
ecraft.net/org/scala-lang/scala-swing_2.11/1.0.1/scala-swing_2.11-1.0.1.pom]
Failed to get resource: GET. [HTTP HTTP/1.1 403 Forbidden: https://libraries.min
ecraft.net/org/scala-lang/scala-xml_2.11/1.0.2/scala-xml_2.11-1.0.2.pom]
file or directory 'C:\Users\Marius\Desktop\1.7.10\libs', not found
Skipping task ':compileJava' as it is up-to-date (took 1.134 secs).
:compileJava UP-TO-DATE
:compileJava (Thread[main,5,main]) completed. Took 1.145 secs.
:processResources (Thread[main,5,main]) started.
:processResources
Skipping task ':processResources' as it is up-to-date (took 0.068 secs).
:processResources UP-TO-DATE
:processResources (Thread[main,5,main]) completed. Took 0.079 secs.
:classes (Thread[main,5,main]) started.
:classes
Skipping task ':classes' as it has no actions.
:classes UP-TO-DATE
:classes (Thread[main,5,main]) completed. Took 0.006 secs.
:jar (Thread[main,5,main]) started.
:jar
Skipping task ':jar' as it is up-to-date (took 0.038 secs).
:jar UP-TO-DATE
:jar (Thread[main,5,main]) completed. Took 0.048 secs.
:compileTestJava (Thread[main,5,main]) started.
:compileTestJava
Skipping task ':compileTestJava' as it has no source files.
:compileTestJava UP-TO-DATE
:compileTestJava (Thread[main,5,main]) completed. Took 0.006 secs.
:processTestResources (Thread[main,5,main]) started.
:processTestResources
Skipping task ':processTestResources' as it has no source files.
:processTestResources UP-TO-DATE
:processTestResources (Thread[main,5,main]) completed. Took 0.007 secs.
:testClasses (Thread[main,5,main]) started.
:testClasses
Skipping task ':testClasses' as it has no actions.
:testClasses UP-TO-DATE
:testClasses (Thread[main,5,main]) completed. Took 0.006 secs.
:test (Thread[main,5,main]) started.
:test
file or directory 'C:\Users\Marius\Desktop\1.7.10\build\classes\test', not found

Skipping task ':test' as it has no source files.
:test UP-TO-DATE
:test (Thread[main,5,main]) completed. Took 0.008 secs.
:extractMcpData (Thread[main,5,main]) started.
:extractMcpData
Skipping task ':extractMcpData' as it is up-to-date (took 0.004 secs).
:extractMcpData UP-TO-DATE
:extractMcpData (Thread[main,5,main]) completed. Took 0.01 secs.
:getVersionJson (Thread[main,5,main]) started.
:getVersionJson
Executing task ':getVersionJson' (up-to-date check took 0.001 secs) due to:
  Task has not declared any outputs.
:getVersionJson (Thread[main,5,main]) completed. Took 0.324 secs.
:extractUserDev (Thread[main,5,main]) started.
:extractUserDev
Failed to get resource: GET. [HTTP HTTP/1.1 403 Forbidden: https://libraries.min
ecraft.net/net/minecraftforge/forge/1.7.10-10.13.2.1291/forge-1.7.10-10.13.2.129
1.pom]
Skipping task ':extractUserDev' as it is up-to-date (took 0.542 secs).
:extractUserDev UP-TO-DATE
:extractUserDev (Thread[main,5,main]) completed. Took 0.554 secs.
:genSrgs (Thread[main,5,main]) started.
:genSrgs
Skipping task ':genSrgs' as task onlyIf is false.
:genSrgs SKIPPED
:genSrgs (Thread[main,5,main]) completed. Took 0.239 secs.
:reobf (Thread[main,5,main]) started.
:reobf
Executing task ':reobf' (up-to-date check took 0.003 secs) due to:
  Output file C:\Users\Marius\Desktop\1.7.10\build\libs\modid-1.0.jar has change
d.
  Output file C:\Users\Marius\Desktop\1.7.10\build\libs\modid-1.0.jar has change
d.
:reobf FAILED
:reobf (Thread[main,5,main]) completed. Took 0.582 secs.

FAILURE: Build failed with an exception.

* What went wrong:
Execution failed for task ':reobf'.
> MALFORMED

* Try:
Run with --stacktrace option to get the stack trace. Run with --debug option to
get more log output.

BUILD FAILED

Total time: 10.01 secs

NEWB! in java im sorry :/

Link to comment
Share on other sites

Run with --stacktrace option to get the stack trace

Don't ask for support per PM! They'll get ignored! | If a post helped you, click the "Thank You" button at the top right corner of said post! |

mah twitter

This thread makes me sad because people just post copy-paste-ready code when it's obvious that the OP has little to no programming experience. This is not how learning works.

Link to comment
Share on other sites

Join the conversation

You can post now and register later. If you have an account, sign in now to post with your account.
Note: Your post will require moderator approval before it will be visible.

Guest
Reply to this topic...

×   Pasted as rich text.   Restore formatting

  Only 75 emoji are allowed.

×   Your link has been automatically embedded.   Display as a link instead

×   Your previous content has been restored.   Clear editor

×   You cannot paste images directly. Upload or insert images from URL.

 Share



×
×
  • Create New...

Important Information

By using this site, you agree to our Terms of Use.