Jump to content

[1.8.9] JDA Library


DarkKazi

Recommended Posts

https://github.com/DV8FromTheWorld/JDA#download

If you add JDA to your dependencies using Gradle, it will compile using it as well.

Don't PM me with questions. They will be ignored! Make a thread on the appropriate board for support.

 

1.12 -> 1.13 primer by williewillus.

 

1.7.10 and older versions of Minecraft are no longer supported due to it's age! Update to the latest version for support.

 

http://www.howoldisminecraft1710.today/

Link to comment
Share on other sites

The only thing you have to do to add Gradle dependencies:

  • Add the repository (jcenter() is already added in the default Forge build.gradle)
  • Add the dependencies (the compile: line)
  • Refresh Gradle in your IDE

You don't have to manually place libraries in folders, Gradle does that all for you.

Don't PM me with questions. They will be ignored! Make a thread on the appropriate board for support.

 

1.12 -> 1.13 primer by williewillus.

 

1.7.10 and older versions of Minecraft are no longer supported due to it's age! Update to the latest version for support.

 

http://www.howoldisminecraft1710.today/

Link to comment
Share on other sites

Spoiler

 


buildscript {
    repositories {
        jcenter()
        maven {
            name = "forge"
            url = "http://files.minecraftforge.net/maven"
        }	
    }
    dependencies {
        classpath 'net.minecraftforge.gradle:ForgeGradle:2.1-SNAPSHOT'
    }
}

apply plugin: 'net.minecraftforge.gradle.forge'

version = "0.1"
group= "pl.darkkazai.minediscord" // http://maven.apache.org/guides/mini/guide-naming-conventions.html
archivesBaseName = "minediscord"

repositories
{
    jcenter()
}

dependencies
{
    compile 'net.dv8tion:JDA:3.5.0_338'
}

minecraft
{
    version = "1.8.9-11.15.1.1722"
    runDir = "run"

    mappings = "stable_20"
}

processResources
{
    inputs.property "version", project.version
    inputs.property "mcversion", project.minecraft.version

    from(sourceSets.main.resources.srcDirs) {
        include 'mcmod.info'

        expand 'version':project.version, 'mcversion':project.minecraft.version
    }

    from(sourceSets.main.resources.srcDirs) {
        exclude 'mcmod.info'
    }
}

 

^ this is my build.gradle
i compile mod but it isn't finding library...

Edited by DarkKazi
Repair Spoiler
Link to comment
Share on other sites

I do this maybe it's because you haven't added the full location (if it is local).

dependencies {
	compile files("C:/Users/user/ModEnviroment/Modding1.12.2/r2s-Core/bin"){
		 builtBy 'compile'
	}
}

 

Always looking for new challenges, and happy to help the people where ever I can

Link to comment
Share on other sites

i tried many combination, moving Library, changing src but that doesn't work.
so this is my Project src Screen and build.gradle and how i can add library to mod?

Gradle:

Spoiler

buildscript {
    repositories {
        jcenter()
        maven {
            name = "forge"
            url = "http://files.minecraftforge.net/maven"
        }
    }
    dependencies {
        classpath 'net.minecraftforge.gradle:ForgeGradle:2.1-SNAPSHOT'
    }
}
apply plugin: 'net.minecraftforge.gradle.forge'

version = "1.0"
group= "com.yourname.modid" // http://maven.apache.org/guides/mini/guide-naming-conventions.html
archivesBaseName = "modid"

minecraft
{
    version = "1.8.9-11.15.1.1722"
    runDir = "run"

    mappings = "stable_20"
}

repositories
{
    jcenter()
}
dependencies
{
    compile 'net.dv8tion:JDA:3.5.0_338'
    compile files("src/main/java/lib") {
        builtBy 'build'
    }
}

processResources
{
    inputs.property "version", project.version
    inputs.property "mcversion", project.minecraft.version

    from(sourceSets.main.resources.srcDirs) {
        include 'mcmod.info'
        expand 'version':project.version, 'mcversion':project.minecraft.version
    }

    from(sourceSets.main.resources.srcDirs) {
        exclude 'mcmod.info'
    }
}

 

src:
 

and current error:

Spoiler

3:16:10.315 [DEBUG] [org.gradle.model.internal.registry.DefaultModelRegistry] Transitioning model element 'tasks.sourceTestJava' to state GraphClosed.
23:16:10.316 [DEBUG] [org.gradle.execution.taskgraph.DefaultTaskGraphExecuter] Timing: Creating the DAG took 0.806 secs
23:16:10.317 [DEBUG] [org.gradle.launcher.daemon.server.SynchronizedDispatchConnection] thread 227: dispatching class org.gradle.launcher.daemon.protocol.BuildEvent
23:16:10.318 [DEBUG] [org.gradle.launcher.daemon.server.SynchronizedDispatchConnection] thread 227: dispatching class org.gradle.launcher.daemon.protocol.BuildEvent
23:16:10.352 [DEBUG] [org.gradle.launcher.daemon.server.SynchronizedDispatchConnection] thread 227: dispatching class org.gradle.launcher.daemon.protocol.BuildEvent
23:16:10.445 [ERROR] [org.gradle.BuildExceptionReporter]
23:16:10.445 [ERROR] [org.gradle.BuildExceptionReporter] FAILURE: Build failed with an exception.
23:16:10.445 [ERROR] [org.gradle.BuildExceptionReporter]
23:16:10.445 [ERROR] [org.gradle.BuildExceptionReporter] * What went wrong:
23:16:10.445 [ERROR] [org.gradle.BuildExceptionReporter] Circular dependency between the following tasks:
23:16:10.445 [ERROR] [org.gradle.BuildExceptionReporter] :apiClasses
23:16:10.445 [ERROR] [org.gradle.BuildExceptionReporter] \--- :compileApiJava
23:16:10.445 [ERROR] [org.gradle.BuildExceptionReporter]      \--- :build
23:16:10.445 [ERROR] [org.gradle.BuildExceptionReporter]           +--- :assemble
23:16:10.445 [ERROR] [org.gradle.BuildExceptionReporter]           |    +--- :jar
23:16:10.445 [ERROR] [org.gradle.BuildExceptionReporter]           |    |    \--- :classes
23:16:10.445 [ERROR] [org.gradle.BuildExceptionReporter]           |    |         \--- :compileJava
23:16:10.445 [ERROR] [org.gradle.BuildExceptionReporter]           |    |              +--- :apiClasses (*)
23:16:10.445 [ERROR] [org.gradle.BuildExceptionReporter]           |    |              \--- :build (*)
23:16:10.461 [ERROR] [org.gradle.BuildExceptionReporter]           |    +--- :reobfJar
23:16:10.461 [ERROR] [org.gradle.BuildExceptionReporter]           |    |    +--- :jar (*)
23:16:10.461 [ERROR] [org.gradle.BuildExceptionReporter]           |    |    \--- :test
23:16:10.461 [ERROR] [org.gradle.BuildExceptionReporter]           |    |         +--- :apiClasses (*)
23:16:10.461 [ERROR] [org.gradle.BuildExceptionReporter]           |    |         +--- :build (*)
23:16:10.461 [ERROR] [org.gradle.BuildExceptionReporter]           |    |         +--- :classes (*)
23:16:10.461 [ERROR] [org.gradle.BuildExceptionReporter]           |    |         \--- :testClasses
23:16:10.461 [ERROR] [org.gradle.BuildExceptionReporter]           |    |              \--- :compileTestJava
23:16:10.461 [ERROR] [org.gradle.BuildExceptionReporter]           |    |                   +--- :apiClasses (*)
23:16:10.461 [ERROR] [org.gradle.BuildExceptionReporter]           |    |                   +--- :build (*)
23:16:10.461 [ERROR] [org.gradle.BuildExceptionReporter]           |    |                   \--- :classes (*)
23:16:10.461 [ERROR] [org.gradle.BuildExceptionReporter]           |    \--- :sourceJar
23:16:10.461 [ERROR] [org.gradle.BuildExceptionReporter]           |         +--- :compileJava (*)
23:16:10.461 [ERROR] [org.gradle.BuildExceptionReporter]           |         \--- :retromapReplacedMain
23:16:10.461 [ERROR] [org.gradle.BuildExceptionReporter]           |              \--- :extractRangemapReplacedMain
23:16:10.461 [ERROR] [org.gradle.BuildExceptionReporter]           |                   +--- :apiClasses (*)
23:16:10.461 [ERROR] [org.gradle.BuildExceptionReporter]           |                   \--- :build (*)
23:16:10.461 [ERROR] [org.gradle.BuildExceptionReporter]           \--- :check
23:16:10.461 [ERROR] [org.gradle.BuildExceptionReporter]                \--- :test (*)
23:16:10.461 [ERROR] [org.gradle.BuildExceptionReporter]
23:16:10.476 [ERROR] [org.gradle.BuildExceptionReporter] (*) - details omitted (listed previously)
23:16:10.476 [ERROR] [org.gradle.BuildExceptionReporter]
23:16:10.476 [ERROR] [org.gradle.BuildExceptionReporter]
23:16:10.476 [ERROR] [org.gradle.BuildExceptionReporter] * Exception is:
23:16:10.476 [ERROR] [org.gradle.BuildExceptionReporter] org.gradle.api.CircularReferenceException: Circular dependency between the following tasks:
23:16:10.476 [ERROR] [org.gradle.BuildExceptionReporter] :apiClasses
23:16:10.476 [ERROR] [org.gradle.BuildExceptionReporter] \--- :compileApiJava
23:16:10.476 [ERROR] [org.gradle.BuildExceptionReporter]      \--- :build
23:16:10.476 [ERROR] [org.gradle.BuildExceptionReporter]           +--- :assemble
23:16:10.476 [ERROR] [org.gradle.BuildExceptionReporter]           |    +--- :jar
23:16:10.476 [ERROR] [org.gradle.BuildExceptionReporter]           |    |    \--- :classes
23:16:10.476 [ERROR] [org.gradle.BuildExceptionReporter]           |    |         \--- :compileJava
23:16:10.476 [ERROR] [org.gradle.BuildExceptionReporter]           |    |              +--- :apiClasses (*)
23:16:10.476 [ERROR] [org.gradle.BuildExceptionReporter]           |    |              \--- :build (*)
23:16:10.476 [ERROR] [org.gradle.BuildExceptionReporter]           |    +--- :reobfJar
23:16:10.476 [ERROR] [org.gradle.BuildExceptionReporter]           |    |    +--- :jar (*)
23:16:10.476 [ERROR] [org.gradle.BuildExceptionReporter]           |    |    \--- :test
23:16:10.476 [ERROR] [org.gradle.BuildExceptionReporter]           |    |         +--- :apiClasses (*)
23:16:10.476 [ERROR] [org.gradle.BuildExceptionReporter]           |    |         +--- :build (*)
23:16:10.476 [ERROR] [org.gradle.BuildExceptionReporter]           |    |         +--- :classes (*)
23:16:10.476 [ERROR] [org.gradle.BuildExceptionReporter]           |    |         \--- :testClasses
23:16:10.476 [ERROR] [org.gradle.BuildExceptionReporter]           |    |              \--- :compileTestJava
23:16:10.476 [ERROR] [org.gradle.BuildExceptionReporter]           |    |                   +--- :apiClasses (*)
23:16:10.476 [ERROR] [org.gradle.BuildExceptionReporter]           |    |                   +--- :build (*)
23:16:10.476 [ERROR] [org.gradle.BuildExceptionReporter]           |    |                   \--- :classes (*)
23:16:10.492 [ERROR] [org.gradle.BuildExceptionReporter]           |    \--- :sourceJar
23:16:10.492 [ERROR] [org.gradle.BuildExceptionReporter]           |         +--- :compileJava (*)
23:16:10.492 [ERROR] [org.gradle.BuildExceptionReporter]           |         \--- :retromapReplacedMain
23:16:10.492 [ERROR] [org.gradle.BuildExceptionReporter]           |              \--- :extractRangemapReplacedMain
23:16:10.492 [ERROR] [org.gradle.BuildExceptionReporter]           |                   +--- :apiClasses (*)
23:16:10.492 [ERROR] [org.gradle.BuildExceptionReporter]           |                   \--- :build (*)
23:16:10.492 [ERROR] [org.gradle.BuildExceptionReporter]           \--- :check
23:16:10.492 [ERROR] [org.gradle.BuildExceptionReporter]                \--- :test (*)
23:16:10.492 [ERROR] [org.gradle.BuildExceptionReporter]
23:16:10.492 [ERROR] [org.gradle.BuildExceptionReporter] (*) - details omitted (listed previously)
23:16:10.492 [ERROR] [org.gradle.BuildExceptionReporter]
23:16:10.492 [ERROR] [org.gradle.BuildExceptionReporter]     at org.gradle.execution.taskgraph.DefaultTaskExecutionPlan.onOrderingCycle(DefaultTaskExecutionPlan.java:429)
23:16:10.492 [ERROR] [org.gradle.BuildExceptionReporter]     at org.gradle.execution.taskgraph.DefaultTaskExecutionPlan.determineExecutionPlan(DefaultTaskExecutionPlan.java:294)
23:16:10.492 [ERROR] [org.gradle.BuildExceptionReporter]     at org.gradle.execution.taskgraph.DefaultTaskGraphExecuter.ensurePopulated(DefaultTaskGraphExecuter.java:172)
23:16:10.492 [ERROR] [org.gradle.BuildExceptionReporter]     at org.gradle.execution.taskgraph.DefaultTaskGraphExecuter.execute(DefaultTaskGraphExecuter.java:106)
23:16:10.492 [ERROR] [org.gradle.BuildExceptionReporter]     at org.gradle.execution.SelectedTaskExecutionAction.execute(SelectedTaskExecutionAction.java:37)
23:16:10.492 [ERROR] [org.gradle.BuildExceptionReporter]     at org.gradle.execution.DefaultBuildExecuter.execute(DefaultBuildExecuter.java:37)
23:16:10.492 [ERROR] [org.gradle.BuildExceptionReporter]     at org.gradle.execution.DefaultBuildExecuter.access$000(DefaultBuildExecuter.java:23)
23:16:10.492 [ERROR] [org.gradle.BuildExceptionReporter]     at org.gradle.execution.DefaultBuildExecuter$1.proceed(DefaultBuildExecuter.java:43)
23:16:10.492 [ERROR] [org.gradle.BuildExceptionReporter]     at org.gradle.execution.DryRunBuildExecutionAction.execute(DryRunBuildExecutionAction.java:32)
23:16:10.492 [ERROR] [org.gradle.BuildExceptionReporter]     at org.gradle.execution.DefaultBuildExecuter.execute(DefaultBuildExecuter.java:37)
23:16:10.492 [ERROR] [org.gradle.BuildExceptionReporter]     at org.gradle.execution.DefaultBuildExecuter.execute(DefaultBuildExecuter.java:30)
23:16:10.492 [ERROR] [org.gradle.BuildExceptionReporter]     at org.gradle.initialization.DefaultGradleLauncher$4.run(DefaultGradleLauncher.java:155)
23:16:10.492 [ERROR] [org.gradle.BuildExceptionReporter]     at org.gradle.internal.Factories$1.create(Factories.java:22)
23:16:10.492 [ERROR] [org.gradle.BuildExceptionReporter]     at org.gradle.internal.progress.DefaultBuildOperationExecutor.run(DefaultBuildOperationExecutor.java:90)
23:16:10.508 [ERROR] [org.gradle.BuildExceptionReporter]     at org.gradle.internal.progress.DefaultBuildOperationExecutor.run(DefaultBuildOperationExecutor.java:52)
23:16:10.508 [ERROR] [org.gradle.BuildExceptionReporter]     at org.gradle.initialization.DefaultGradleLauncher.doBuildStages(DefaultGradleLauncher.java:152)
23:16:10.508 [ERROR] [org.gradle.BuildExceptionReporter]     at org.gradle.initialization.DefaultGradleLauncher.access$200(DefaultGradleLauncher.java:33)
23:16:10.508 [ERROR] [org.gradle.BuildExceptionReporter]     at org.gradle.initialization.DefaultGradleLauncher$1.create(DefaultGradleLauncher.java:100)
23:16:10.508 [ERROR] [org.gradle.BuildExceptionReporter]     at org.gradle.initialization.DefaultGradleLauncher$1.create(DefaultGradleLauncher.java:94)
23:16:10.508 [ERROR] [org.gradle.BuildExceptionReporter]     at org.gradle.internal.progress.DefaultBuildOperationExecutor.run(DefaultBuildOperationExecutor.java:90)
23:16:10.508 [ERROR] [org.gradle.BuildExceptionReporter]     at org.gradle.internal.progress.DefaultBuildOperationExecutor.run(DefaultBuildOperationExecutor.java:62)
23:16:10.508 [ERROR] [org.gradle.BuildExceptionReporter]     at org.gradle.initialization.DefaultGradleLauncher.doBuild(DefaultGradleLauncher.java:94)
23:16:10.508 [ERROR] [org.gradle.BuildExceptionReporter]     at org.gradle.initialization.DefaultGradleLauncher.run(DefaultGradleLauncher.java:83)
23:16:10.508 [ERROR] [org.gradle.BuildExceptionReporter]     at org.gradle.launcher.exec.InProcessBuildActionExecuter$DefaultBuildController.run(InProcessBuildActionExecuter.java:94)
23:16:10.508 [ERROR] [org.gradle.BuildExceptionReporter]     at org.gradle.tooling.internal.provider.runner.BuildModelActionRunner.run(BuildModelActionRunner.java:46)
23:16:10.508 [ERROR] [org.gradle.BuildExceptionReporter]     at org.gradle.launcher.exec.ChainingBuildActionRunner.run(ChainingBuildActionRunner.java:35)
23:16:10.508 [ERROR] [org.gradle.BuildExceptionReporter]     at org.gradle.tooling.internal.provider.runner.SubscribableBuildActionRunner.run(SubscribableBuildActionRunner.java:58)
23:16:10.508 [ERROR] [org.gradle.BuildExceptionReporter]     at org.gradle.launcher.exec.ChainingBuildActionRunner.run(ChainingBuildActionRunner.java:35)
23:16:10.508 [ERROR] [org.gradle.BuildExceptionReporter]     at org.gradle.launcher.exec.InProcessBuildActionExecuter.execute(InProcessBuildActionExecuter.java:43)
23:16:10.508 [ERROR] [org.gradle.BuildExceptionReporter]     at org.gradle.launcher.exec.InProcessBuildActionExecuter.execute(InProcessBuildActionExecuter.java:28)
23:16:10.508 [ERROR] [org.gradle.BuildExceptionReporter]     at org.gradle.launcher.exec.ContinuousBuildActionExecuter.execute(ContinuousBuildActionExecuter.java:77)
23:16:10.508 [ERROR] [org.gradle.BuildExceptionReporter]     at org.gradle.launcher.exec.ContinuousBuildActionExecuter.execute(ContinuousBuildActionExecuter.java:47)
23:16:10.508 [ERROR] [org.gradle.BuildExceptionReporter]     at org.gradle.launcher.daemon.server.exec.ExecuteBuild.doBuild(ExecuteBuild.java:52)
23:16:10.508 [ERROR] [org.gradle.BuildExceptionReporter]     at org.gradle.launcher.daemon.server.exec.BuildCommandOnly.execute(BuildCommandOnly.java:36)
23:16:10.508 [ERROR] [org.gradle.BuildExceptionReporter]     at org.gradle.launcher.daemon.server.api.DaemonCommandExecution.proceed(DaemonCommandExecution.java:120)
23:16:10.508 [ERROR] [org.gradle.BuildExceptionReporter]     at org.gradle.launcher.daemon.server.exec.WatchForDisconnection.execute(WatchForDisconnection.java:37)
23:16:10.508 [ERROR] [org.gradle.BuildExceptionReporter]     at org.gradle.launcher.daemon.server.api.DaemonCommandExecution.proceed(DaemonCommandExecution.java:120)
23:16:10.508 [ERROR] [org.gradle.BuildExceptionReporter]     at org.gradle.launcher.daemon.server.exec.ResetDeprecationLogger.execute(ResetDeprecationLogger.java:26)
23:16:10.508 [ERROR] [org.gradle.BuildExceptionReporter]     at org.gradle.launcher.daemon.server.api.DaemonCommandExecution.proceed(DaemonCommandExecution.java:120)
23:16:10.508 [ERROR] [org.gradle.BuildExceptionReporter]     at org.gradle.launcher.daemon.server.exec.RequestStopIfSingleUsedDaemon.execute(RequestStopIfSingleUsedDaemon.java:34)
23:16:10.508 [ERROR] [org.gradle.BuildExceptionReporter]     at org.gradle.launcher.daemon.server.api.DaemonCommandExecution.proceed(DaemonCommandExecution.java:120)
23:16:10.508 [ERROR] [org.gradle.BuildExceptionReporter]     at org.gradle.launcher.daemon.server.exec.ForwardClientInput$2.call(ForwardClientInput.java:74)
23:16:10.508 [ERROR] [org.gradle.BuildExceptionReporter]     at org.gradle.launcher.daemon.server.exec.ForwardClientInput$2.call(ForwardClientInput.java:72)
23:16:10.508 [ERROR] [org.gradle.BuildExceptionReporter]     at org.gradle.util.Swapper.swap(Swapper.java:38)
23:16:10.508 [ERROR] [org.gradle.BuildExceptionReporter]     at org.gradle.launcher.daemon.server.exec.ForwardClientInput.execute(ForwardClientInput.java:72)
23:16:10.508 [ERROR] [org.gradle.BuildExceptionReporter]     at org.gradle.launcher.daemon.server.api.DaemonCommandExecution.proceed(DaemonCommandExecution.java:120)
23:16:10.523 [ERROR] [org.gradle.BuildExceptionReporter]     at org.gradle.launcher.daemon.server.health.DaemonHealthTracker.execute(DaemonHealthTracker.java:47)
23:16:10.523 [ERROR] [org.gradle.BuildExceptionReporter]     at org.gradle.launcher.daemon.server.api.DaemonCommandExecution.proceed(DaemonCommandExecution.java:120)
23:16:10.523 [ERROR] [org.gradle.BuildExceptionReporter]     at org.gradle.launcher.daemon.server.exec.LogToClient.doBuild(LogToClient.java:66)
23:16:10.523 [ERROR] [org.gradle.BuildExceptionReporter]     at org.gradle.launcher.daemon.server.exec.BuildCommandOnly.execute(BuildCommandOnly.java:36)
23:16:10.523 [ERROR] [org.gradle.BuildExceptionReporter]     at org.gradle.launcher.daemon.server.api.DaemonCommandExecution.proceed(DaemonCommandExecution.java:120)
23:16:10.523 [ERROR] [org.gradle.BuildExceptionReporter]     at org.gradle.launcher.daemon.server.exec.EstablishBuildEnvironment.doBuild(EstablishBuildEnvironment.java:71)
23:16:10.523 [ERROR] [org.gradle.BuildExceptionReporter]     at org.gradle.launcher.daemon.server.exec.BuildCommandOnly.execute(BuildCommandOnly.java:36)
23:16:10.523 [ERROR] [org.gradle.BuildExceptionReporter]     at org.gradle.launcher.daemon.server.api.DaemonCommandExecution.proceed(DaemonCommandExecution.java:120)
23:16:10.523 [ERROR] [org.gradle.BuildExceptionReporter]     at org.gradle.launcher.daemon.server.health.HintGCAfterBuild.execute(HintGCAfterBuild.java:41)
23:16:10.523 [ERROR] [org.gradle.BuildExceptionReporter]     at org.gradle.launcher.daemon.server.api.DaemonCommandExecution.proceed(DaemonCommandExecution.java:120)
23:16:10.523 [ERROR] [org.gradle.BuildExceptionReporter]     at org.gradle.launcher.daemon.server.exec.StartBuildOrRespondWithBusy$1.run(StartBuildOrRespondWithBusy.java:50)
23:16:10.539 [ERROR] [org.gradle.BuildExceptionReporter]     at org.gradle.launcher.daemon.server.DaemonStateCoordinator$1.run(DaemonStateCoordinator.java:246)
23:16:10.539 [ERROR] [org.gradle.BuildExceptionReporter]     at org.gradle.internal.concurrent.ExecutorPolicy$CatchAndRecordFailures.onExecute(ExecutorPolicy.java:54)
23:16:10.539 [ERROR] [org.gradle.BuildExceptionReporter]     at org.gradle.internal.concurrent.StoppableExecutorImpl$1.run(StoppableExecutorImpl.java:40)
23:16:10.539 [ERROR] [org.gradle.BuildExceptionReporter]
23:16:10.539 [LIFECYCLE] [org.gradle.BuildResultLogger]
23:16:10.539 [LIFECYCLE] [org.gradle.BuildResultLogger] BUILD FAILED
23:16:10.539 [LIFECYCLE] [org.gradle.BuildResultLogger]
23:16:10.539 [LIFECYCLE] [org.gradle.BuildResultLogger] Total time: 35.998 secs

Circular dependency between the following tasks:
:apiClasses
\--- :compileApiJava
     \--- :build
          +--- :assemble
          |    +--- :jar
          |    |    \--- :classes
          |    |         \--- :compileJava
          |    |              +--- :apiClasses (*)
          |    |              \--- :build (*)
          |    +--- :reobfJar
          |    |    +--- :jar (*)
          |    |    \--- :test
          |    |         +--- :apiClasses (*)
          |    |         +--- :build (*)
          |    |         +--- :classes (*)
          |    |         \--- :testClasses
          |    |              \--- :compileTestJava
          |    |                   +--- :apiClasses (*)
          |    |                   +--- :build (*)
          |    |                   \--- :classes (*)
          |    \--- :sourceJar
          |         +--- :compileJava (*)
          |         \--- :retromapReplacedMain
          |              \--- :extractRangemapReplacedMain
          |                   +--- :apiClasses (*)
          |                   \--- :build (*)
          \--- :check
               \--- :test (*)

(*) - details omitted (listed previously)

23:16:27: External task execution finished 'build --stacktrace --debug '.

 


 

Edited by DarkKazi
Current Error
Link to comment
Share on other sites

Join the conversation

You can post now and register later. If you have an account, sign in now to post with your account.
Note: Your post will require moderator approval before it will be visible.

Guest
Unfortunately, your content contains terms that we do not allow. Please edit your content to remove the highlighted words below.
Reply to this topic...

×   Pasted as rich text.   Restore formatting

  Only 75 emoji are allowed.

×   Your link has been automatically embedded.   Display as a link instead

×   Your previous content has been restored.   Clear editor

×   You cannot paste images directly. Upload or insert images from URL.

×
×
  • Create New...

Important Information

By using this site, you agree to our Terms of Use.