Jump to content
Search In
  • More options...
Find results that contain...
Find results in...

gradlew (...) doesn't work


TheKillTnT
 Share

Recommended Posts

hello, i have a big problem, because all of the gradlew commands are down and return the same exception.

If you can help me thanks !


 

Quote

FAILURE: Build failed with an exception.

* Where:
Build file 'C:\Users\Aurelien\Desktop\alesiummod\build.gradle' line: 18

* What went wrong:
A problem occurred evaluating root project 'alesiummod'.
> com.google.gson.stream.MalformedJsonException: Unterminated string at line 88780 column 12

* Try:
Run with --info or --debug option to get more log output.

* Exception is:
org.gradle.api.GradleScriptException: A problem occurred evaluating root project 'alesiummod'.
    at org.gradle.groovy.scripts.internal.DefaultScriptRunnerFactory$ScriptRunnerImpl.run(DefaultScriptRunnerFactory.java:54)
    at org.gradle.configuration.DefaultScriptPluginFactory$ScriptPluginImpl.apply(DefaultScriptPluginFactory.java:187)
    at org.gradle.configuration.project.BuildScriptProcessor.execute(BuildScriptProcessor.java:39)
    at org.gradle.configuration.project.BuildScriptProcessor.execute(BuildScriptProcessor.java:26)
    at org.gradle.configuration.project.ConfigureActionsProjectEvaluator.evaluate(ConfigureActionsProjectEvaluator.java:34)
    at org.gradle.configuration.project.LifecycleProjectEvaluator.evaluate(LifecycleProjectEvaluator.java:55)
    at org.gradle.api.internal.project.AbstractProject.evaluate(AbstractProject.java:470)
    at org.gradle.api.internal.project.AbstractProject.evaluate(AbstractProject.java:79)
    at org.gradle.configuration.DefaultBuildConfigurer.configure(DefaultBuildConfigurer.java:31)
    at org.gradle.initialization.DefaultGradleLauncher.doBuildStages(DefaultGradleLauncher.java:128)
    at org.gradle.initialization.DefaultGradleLauncher.doBuild(DefaultGradleLauncher.java:105)
    at org.gradle.initialization.DefaultGradleLauncher.run(DefaultGradleLauncher.java:85)
    at org.gradle.launcher.exec.InProcessBuildActionExecuter$DefaultBuildController.run(InProcessBuildActionExecuter.java:81)
    at org.gradle.launcher.cli.ExecuteBuildAction.run(ExecuteBuildAction.java:33)
    at org.gradle.launcher.cli.ExecuteBuildAction.run(ExecuteBuildAction.java:24)
    at org.gradle.launcher.exec.InProcessBuildActionExecuter.execute(InProcessBuildActionExecuter.java:39)
    at org.gradle.launcher.exec.InProcessBuildActionExecuter.execute(InProcessBuildActionExecuter.java:29)
    at org.gradle.launcher.cli.RunBuildAction.run(RunBuildAction.java:50)
    at org.gradle.internal.Actions$RunnableActionAdapter.execute(Actions.java:171)
    at org.gradle.launcher.cli.CommandLineActionFactory$ParseAndBuildAction.execute(CommandLineActionFactory.java:237)
    at org.gradle.launcher.cli.CommandLineActionFactory$ParseAndBuildAction.execute(CommandLineActionFactory.java:210)
    at org.gradle.launcher.cli.JavaRuntimeValidationAction.execute(JavaRuntimeValidationAction.java:35)
    at org.gradle.launcher.cli.JavaRuntimeValidationAction.execute(JavaRuntimeValidationAction.java:24)
    at org.gradle.launcher.cli.CommandLineActionFactory$WithLogging.execute(CommandLineActionFactory.java:206)
    at org.gradle.launcher.cli.CommandLineActionFactory$WithLogging.execute(CommandLineActionFactory.java:169)
    at org.gradle.launcher.cli.ExceptionReportingAction.execute(ExceptionReportingAction.java:33)
    at org.gradle.launcher.cli.ExceptionReportingAction.execute(ExceptionReportingAction.java:22)
    at org.gradle.launcher.Main.doAction(Main.java:33)
    at org.gradle.launcher.bootstrap.EntryPoint.run(EntryPoint.java:45)
    at org.gradle.launcher.bootstrap.ProcessBootstrap.runNoExit(ProcessBootstrap.java:54)
    at org.gradle.launcher.bootstrap.ProcessBootstrap.run(ProcessBootstrap.java:35)
    at org.gradle.launcher.GradleMain.main(GradleMain.java:23)
    at org.gradle.wrapper.BootstrapMainStarter.start(BootstrapMainStarter.java:30)
    at org.gradle.wrapper.WrapperExecutor.execute(WrapperExecutor.java:127)
    at org.gradle.wrapper.GradleWrapperMain.main(GradleWrapperMain.java:56)
Caused by: com.google.gson.JsonSyntaxException: com.google.gson.stream.MalformedJsonException: Unterminated string at line 88780 column 12
    at com.google.gson.Gson.fromJson(Gson.java:818)
    at com.google.gson.Gson.fromJson(Gson.java:768)
    at com.google.gson.Gson.fromJson(Gson.java:717)
    at com.google.gson.Gson.fromJson(Gson.java:689)
    at net.minecraftforge.gradle.user.patch.UserPatchBasePlugin.setVersionInfoJson(UserPatchBasePlugin.java:145)
    at net.minecraftforge.gradle.user.patch.UserPatchBasePlugin.applyPlugin(UserPatchBasePlugin.java:46)
    at net.minecraftforge.gradle.common.BasePlugin.apply(BasePlugin.java:154)
    at net.minecraftforge.gradle.common.BasePlugin.apply(BasePlugin.java:49)
    at org.gradle.api.internal.plugins.DefaultPluginContainer.providePlugin(DefaultPluginContainer.java:110)
    at org.gradle.api.internal.plugins.DefaultPluginContainer.addPluginInternal(DefaultPluginContainer.java:69)
    at org.gradle.api.internal.plugins.DefaultPluginContainer.apply(DefaultPluginContainer.java:35)
    at org.gradle.api.internal.plugins.DefaultObjectConfigurationAction.applyPlugin(DefaultObjectConfigurationAction.java:117)
    at org.gradle.api.internal.plugins.DefaultObjectConfigurationAction.access$200(DefaultObjectConfigurationAction.java:36)
    at org.gradle.api.internal.plugins.DefaultObjectConfigurationAction$3.run(DefaultObjectConfigurationAction.java:85)
    at org.gradle.api.internal.plugins.DefaultObjectConfigurationAction.execute(DefaultObjectConfigurationAction.java:130)
    at org.gradle.api.internal.project.AbstractPluginAware.apply(AbstractPluginAware.java:41)
    at org.gradle.api.Project$apply$0.call(Unknown Source)
    at org.gradle.api.internal.project.ProjectScript.apply(ProjectScript.groovy:34)
    at org.gradle.api.Script$apply$0.callCurrent(Unknown Source)
    at build_1ethdvnn5ct4i4sgk0iauqd0cd.run(C:\Users\Aurelien\Desktop\alesiummod\build.gradle:18)
    at org.gradle.groovy.scripts.internal.DefaultScriptRunnerFactory$ScriptRunnerImpl.run(DefaultScriptRunnerFactory.java:52)
    ... 34 more
Caused by: com.google.gson.stream.MalformedJsonException: Unterminated string at line 88780 column 12
    at com.google.gson.stream.JsonReader.syntaxError(JsonReader.java:1505)
    at com.google.gson.stream.JsonReader.skipQuotedValue(JsonReader.java:1100)
    at com.google.gson.stream.JsonReader.skipValue(JsonReader.java:1229)
    at com.google.gson.internal.bind.ReflectiveTypeAdapterFactory$Adapter.read(ReflectiveTypeAdapterFactory.java:170)
    at com.google.gson.internal.bind.TypeAdapterRuntimeTypeWrapper.read(TypeAdapterRuntimeTypeWrapper.java:40)
    at com.google.gson.internal.bind.MapTypeAdapterFactory$Adapter.read(MapTypeAdapterFactory.java:187)
    at com.google.gson.internal.bind.MapTypeAdapterFactory$Adapter.read(MapTypeAdapterFactory.java:145)
    at com.google.gson.internal.bind.ReflectiveTypeAdapterFactory$1.read(ReflectiveTypeAdapterFactory.java:93)
    at com.google.gson.internal.bind.ReflectiveTypeAdapterFactory$Adapter.read(ReflectiveTypeAdapterFactory.java:172)
    at com.google.gson.Gson.fromJson(Gson.java:803)
    ... 54 more


BUILD FAILED

Total time: 19.086 secs


 

 

Link to comment
Share on other sites

2 hours ago, TheKillTnT said:

Caused by: com.google.gson.stream.MalformedJsonException: Unterminated string at line 88780 column 12

Uhmmm... How does your build.gradle look like?

Don't PM me with questions. They will be ignored! Make a thread on the appropriate board for support.

 

1.12 -> 1.13 primer by williewillus.

 

1.7.10 and older versions of Minecraft are no longer supported due to it's age! Update to the latest version for support.

 

http://www.howoldisminecraft1710.today/

Link to comment
Share on other sites

Why did you comment out the "apply plugin: 'forge'"? It needs to be there.

 

Also, stop modding for 1.7.10. It's not supported anymore because of its age.

Don't PM me with questions. They will be ignored! Make a thread on the appropriate board for support.

 

1.12 -> 1.13 primer by williewillus.

 

1.7.10 and older versions of Minecraft are no longer supported due to it's age! Update to the latest version for support.

 

http://www.howoldisminecraft1710.today/

Link to comment
Share on other sites

Guest
This topic is now closed to further replies.
 Share



  • Recently Browsing

    No registered users viewing this page.

  • Posts

    • You need to talk to the server provider. The bat or sh file must be used to start a 1.17 or newer server.
    • Hello guys,   I ve created a Desktop Folder and installed a Forge server "forge-1.18-38.0.16-installer" into it! I ve Installed the correct java version and edited "user_jvm_args" .. i can start the server via "run.bat" I use a Nitrado.net Minecraft Server where i want to manually Update the Forge version .. at the moment i am using "Forge 37.0.60 (1.17.1)" Official Wiki for the Nitrado Server says i need a "minecraft_server.jar"  ( https://i.ibb.co/mGPgmPk/server.png ).. But when i install the forge 38.0.16 there is just the bat in the folder? What should i do now.. does it work with the bat file too or should i create this server.jar ? but how? Hope you can help me! Kind regards           
    • JVM info: Oracle Corporation - 1.8.0_311 - 25.311-b11 java.net.preferIPv4Stack=true Found java version 1.8.0_311 Extracting json Considering minecraft client jar Downloading libraries Found 0 additional library directories Considering library cpw.mods:securejarhandler:0.9.54   File exists: Checksum validated. Considering library org.ow2.asm:asm:9.1   File exists: Checksum validated. Considering library org.ow2.asm:asm-commons:9.1   File exists: Checksum validated. Considering library org.ow2.asm:asm-tree:9.1   File exists: Checksum validated. Considering library org.ow2.asm:asm-util:9.1   File exists: Checksum validated. Considering library org.ow2.asm:asm-analysis:9.1   File exists: Checksum validated. Considering library net.minecraftforge:accesstransformers:8.0.4   File exists: Checksum validated. Considering library org.antlr:antlr4-runtime:4.9.1   File exists: Checksum validated. Considering library net.minecraftforge:eventbus:5.0.3   File exists: Checksum validated. Considering library net.minecraftforge:forgespi:4.0.10   File exists: Checksum validated. Considering library net.minecraftforge:coremods:5.0.1   File exists: Checksum validated. Considering library cpw.mods:modlauncher:9.0.7   File exists: Checksum validated. Considering library net.minecraftforge:unsafe:0.2.0   File exists: Checksum validated. Considering library com.electronwill.night-config:core:3.6.4   File exists: Checksum validated. Considering library com.electronwill.night-config:toml:3.6.4   File exists: Checksum validated. Considering library org.apache.maven:maven-artifact:3.6.3   File exists: Checksum validated. Considering library org.apache.commons:commons-lang3:3.12.0   File exists: Checksum validated. Considering library net.jodah:typetools:0.8.3   File exists: Checksum validated. Considering library org.apache.logging.log4j:log4j-api:2.14.1   File exists: Checksum validated. Considering library org.apache.logging.log4j:log4j-core:2.14.1   File exists: Checksum validated. Considering library net.minecrell:terminalconsoleappender:1.2.0   File exists: Checksum validated. Considering library org.jline:jline-reader:3.12.1   File exists: Checksum validated. Considering library org.jline:jline-terminal:3.12.1   File exists: Checksum validated. Considering library net.sf.jopt-simple:jopt-simple:5.0.4   File exists: Checksum validated. Considering library org.spongepowered:mixin:0.8.5   File exists: Checksum validated. Considering library org.openjdk.nashorn:nashorn-core:15.3   File exists: Checksum validated. Considering library com.google.guava:guava:31.0.1-jre   File exists: Checksum validated. Considering library com.google.code.gson:gson:2.8.8   File exists: Checksum validated. Considering library cpw.mods:bootstraplauncher:0.1.17   File exists: Checksum validated. Considering library net.minecraftforge:fmlloader:1.18-38.0.15   File exists: Checksum validated. Considering library com.github.jponge:lzma-java:1.3   File exists: Checksum validated. Considering library com.google.code.findbugs:jsr305:3.0.2   File exists: Checksum validated. Considering library com.google.code.gson:gson:2.8.7   File exists: Checksum validated. Considering library com.google.errorprone:error_prone_annotations:2.1.3   File exists: Checksum validated. Considering library com.google.guava:guava:20.0   File exists: Checksum validated. Considering library com.google.guava:guava:25.1-jre   File exists: Checksum validated. Considering library com.google.j2objc:j2objc-annotations:1.1   File exists: Checksum validated. Considering library com.nothome:javaxdelta:2.0.1   File exists: Checksum validated. Considering library com.opencsv:opencsv:4.4   File exists: Checksum validated. Considering library commons-beanutils:commons-beanutils:1.9.3   File exists: Checksum validated. Considering library commons-collections:commons-collections:3.2.2   File exists: Checksum validated. Considering library commons-io:commons-io:2.4   File exists: Checksum validated. Considering library commons-logging:commons-logging:1.2   File exists: Checksum validated. Considering library de.oceanlabs.mcp:mcp_config:1.18-20211130.085255@zip   File exists: Checksum validated. Considering library de.siegmar:fastcsv:2.0.0   File exists: Checksum validated. Considering library net.md-5:SpecialSource:1.10.0   File exists: Checksum validated. Considering library net.minecraftforge:ForgeAutoRenamingTool:0.1.17:all   File exists: Checksum validated. Considering library net.minecraftforge:binarypatcher:1.0.12   File exists: Checksum validated. Considering library net.minecraftforge:fmlcore:1.18-38.0.15   File exists: Checksum validated. Considering library net.minecraftforge:fmlloader:1.18-38.0.15   File exists: Checksum validated. Considering library net.minecraftforge:forge:1.18-38.0.15:universal   File exists: Checksum validated. Considering library net.minecraftforge:installertools:1.2.10   File exists: Checksum validated. Considering library net.minecraftforge:jarsplitter:1.1.4   File exists: Checksum validated. Considering library net.minecraftforge:javafmllanguage:1.18-38.0.15   File exists: Checksum validated. Considering library net.minecraftforge:mclanguage:1.18-38.0.15   File exists: Checksum validated. Considering library net.minecraftforge:srgutils:0.4.3   File exists: Checksum validated. Considering library net.minecraftforge:srgutils:0.4.7   File exists: Checksum validated. Considering library net.sf.jopt-simple:jopt-simple:5.0.4   File exists: Checksum validated. Considering library net.sf.jopt-simple:jopt-simple:6.0-alpha-3   File exists: Checksum validated. Considering library org.apache.commons:commons-collections4:4.2   File exists: Checksum validated. Considering library org.apache.commons:commons-lang3:3.8.1   File exists: Checksum validated. Considering library org.apache.commons:commons-text:1.3   File exists: Checksum validated. Considering library org.checkerframework:checker-qual:2.0.0   File exists: Checksum validated. Considering library org.codehaus.mojo:animal-sniffer-annotations:1.14   File exists: Checksum validated. Considering library org.ow2.asm:asm-analysis:9.1   File exists: Checksum validated. Considering library org.ow2.asm:asm-analysis:9.2   File exists: Checksum validated. Considering library org.ow2.asm:asm-commons:9.1   File exists: Checksum validated. Considering library org.ow2.asm:asm-commons:9.2   File exists: Checksum validated. Considering library org.ow2.asm:asm-tree:9.1   File exists: Checksum validated. Considering library org.ow2.asm:asm-tree:9.2   File exists: Checksum validated. Considering library org.ow2.asm:asm:9.1   File exists: Checksum validated. Considering library org.ow2.asm:asm:9.2   File exists: Checksum validated. Considering library trove:trove:1.0.2   File exists: Checksum validated. Created Temporary Directory: C:\Users\ACER\AppData\Local\Temp\forge_installer700304410901520145   Extracting: /data/client.lzma Building Processors ===============================================================================   MainClass: net.minecraftforge.installertools.ConsoleTool   Classpath:     C:\Users\ACER\AppData\Roaming\.minecraft\libraries\net\minecraftforge\installertools\1.2.10\installertools-1.2.10.jar     C:\Users\ACER\AppData\Roaming\.minecraft\libraries\net\md-5\SpecialSource\1.10.0\SpecialSource-1.10.0.jar     C:\Users\ACER\AppData\Roaming\.minecraft\libraries\net\sf\jopt-simple\jopt-simple\5.0.4\jopt-simple-5.0.4.jar     C:\Users\ACER\AppData\Roaming\.minecraft\libraries\com\google\code\gson\gson\2.8.7\gson-2.8.7.jar     C:\Users\ACER\AppData\Roaming\.minecraft\libraries\de\siegmar\fastcsv\2.0.0\fastcsv-2.0.0.jar     C:\Users\ACER\AppData\Roaming\.minecraft\libraries\net\minecraftforge\srgutils\0.4.3\srgutils-0.4.3.jar     C:\Users\ACER\AppData\Roaming\.minecraft\libraries\org\ow2\asm\asm-commons\9.1\asm-commons-9.1.jar     C:\Users\ACER\AppData\Roaming\.minecraft\libraries\com\google\guava\guava\20.0\guava-20.0.jar     C:\Users\ACER\AppData\Roaming\.minecraft\libraries\com\opencsv\opencsv\4.4\opencsv-4.4.jar     C:\Users\ACER\AppData\Roaming\.minecraft\libraries\org\ow2\asm\asm-analysis\9.1\asm-analysis-9.1.jar     C:\Users\ACER\AppData\Roaming\.minecraft\libraries\org\ow2\asm\asm-tree\9.1\asm-tree-9.1.jar     C:\Users\ACER\AppData\Roaming\.minecraft\libraries\org\ow2\asm\asm\9.1\asm-9.1.jar     C:\Users\ACER\AppData\Roaming\.minecraft\libraries\org\apache\commons\commons-text\1.3\commons-text-1.3.jar     C:\Users\ACER\AppData\Roaming\.minecraft\libraries\org\apache\commons\commons-lang3\3.8.1\commons-lang3-3.8.1.jar     C:\Users\ACER\AppData\Roaming\.minecraft\libraries\commons-beanutils\commons-beanutils\1.9.3\commons-beanutils-1.9.3.jar     C:\Users\ACER\AppData\Roaming\.minecraft\libraries\org\apache\commons\commons-collections4\4.2\commons-collections4-4.2.jar     C:\Users\ACER\AppData\Roaming\.minecraft\libraries\commons-logging\commons-logging\1.2\commons-logging-1.2.jar     C:\Users\ACER\AppData\Roaming\.minecraft\libraries\commons-collections\commons-collections\3.2.2\commons-collections-3.2.2.jar   Args: --task, MCP_DATA, --input, C:\Users\ACER\AppData\Roaming\.minecraft\libraries\de\oceanlabs\mcp\mcp_config\1.18-20211130.085255\mcp_config-1.18-20211130.085255.zip, --output, C:\Users\ACER\AppData\Roaming\.minecraft\libraries\de\oceanlabs\mcp\mcp_config\1.18-20211130.085255\mcp_config-1.18-20211130.085255-mappings.txt, --key, mappings Task: MCP_DATA Input:  C:\Users\ACER\AppData\Roaming\.minecraft\libraries\de\oceanlabs\mcp\mcp_config\1.18-20211130.085255\mcp_config-1.18-20211130.085255.zip Output: C:\Users\ACER\AppData\Roaming\.minecraft\libraries\de\oceanlabs\mcp\mcp_config\1.18-20211130.085255\mcp_config-1.18-20211130.085255-mappings.txt Key:    mappings Extracting: config/joined.tsrg ===============================================================================   MainClass: net.minecraftforge.installertools.ConsoleTool   Classpath:     C:\Users\ACER\AppData\Roaming\.minecraft\libraries\net\minecraftforge\installertools\1.2.10\installertools-1.2.10.jar     C:\Users\ACER\AppData\Roaming\.minecraft\libraries\net\md-5\SpecialSource\1.10.0\SpecialSource-1.10.0.jar     C:\Users\ACER\AppData\Roaming\.minecraft\libraries\net\sf\jopt-simple\jopt-simple\5.0.4\jopt-simple-5.0.4.jar     C:\Users\ACER\AppData\Roaming\.minecraft\libraries\com\google\code\gson\gson\2.8.7\gson-2.8.7.jar     C:\Users\ACER\AppData\Roaming\.minecraft\libraries\de\siegmar\fastcsv\2.0.0\fastcsv-2.0.0.jar     C:\Users\ACER\AppData\Roaming\.minecraft\libraries\net\minecraftforge\srgutils\0.4.3\srgutils-0.4.3.jar     C:\Users\ACER\AppData\Roaming\.minecraft\libraries\org\ow2\asm\asm-commons\9.1\asm-commons-9.1.jar     C:\Users\ACER\AppData\Roaming\.minecraft\libraries\com\google\guava\guava\20.0\guava-20.0.jar     C:\Users\ACER\AppData\Roaming\.minecraft\libraries\com\opencsv\opencsv\4.4\opencsv-4.4.jar     C:\Users\ACER\AppData\Roaming\.minecraft\libraries\org\ow2\asm\asm-analysis\9.1\asm-analysis-9.1.jar     C:\Users\ACER\AppData\Roaming\.minecraft\libraries\org\ow2\asm\asm-tree\9.1\asm-tree-9.1.jar     C:\Users\ACER\AppData\Roaming\.minecraft\libraries\org\ow2\asm\asm\9.1\asm-9.1.jar     C:\Users\ACER\AppData\Roaming\.minecraft\libraries\org\apache\commons\commons-text\1.3\commons-text-1.3.jar     C:\Users\ACER\AppData\Roaming\.minecraft\libraries\org\apache\commons\commons-lang3\3.8.1\commons-lang3-3.8.1.jar     C:\Users\ACER\AppData\Roaming\.minecraft\libraries\commons-beanutils\commons-beanutils\1.9.3\commons-beanutils-1.9.3.jar     C:\Users\ACER\AppData\Roaming\.minecraft\libraries\org\apache\commons\commons-collections4\4.2\commons-collections4-4.2.jar     C:\Users\ACER\AppData\Roaming\.minecraft\libraries\commons-logging\commons-logging\1.2\commons-logging-1.2.jar     C:\Users\ACER\AppData\Roaming\.minecraft\libraries\commons-collections\commons-collections\3.2.2\commons-collections-3.2.2.jar   Args: --task, DOWNLOAD_MOJMAPS, --version, 1.18, --side, client, --output, C:\Users\ACER\AppData\Roaming\.minecraft\libraries\net\minecraft\client\1.18-20211130.085255\client-1.18-20211130.085255-mappings.txt Task: DOWNLOAD_MOJMAPS MC Version: 1.18 Side:       client Output:     C:\Users\ACER\AppData\Roaming\.minecraft\libraries\net\minecraft\client\1.18-20211130.085255\client-1.18-20211130.085255-mappings.txt javax.net.ssl.SSLHandshakeException: sun.security.validator.ValidatorException: PKIX path building failed: sun.security.provider.certpath.SunCertPathBuilderException: unable to find valid certification path to requested target     at sun.security.ssl.Alert.createSSLException(Unknown Source)     at sun.security.ssl.TransportContext.fatal(Unknown Source)     at sun.security.ssl.TransportContext.fatal(Unknown Source)     at sun.security.ssl.TransportContext.fatal(Unknown Source)     at sun.security.ssl.CertificateMessage$T12CertificateConsumer.checkServerCerts(Unknown Source)     at sun.security.ssl.CertificateMessage$T12CertificateConsumer.onCertificate(Unknown Source)     at sun.security.ssl.CertificateMessage$T12CertificateConsumer.consume(Unknown Source)     at sun.security.ssl.SSLHandshake.consume(Unknown Source)     at sun.security.ssl.HandshakeContext.dispatch(Unknown Source)     at sun.security.ssl.HandshakeContext.dispatch(Unknown Source)     at sun.security.ssl.TransportContext.dispatch(Unknown Source)     at sun.security.ssl.SSLTransport.decode(Unknown Source)     at sun.security.ssl.SSLSocketImpl.decode(Unknown Source)     at sun.security.ssl.SSLSocketImpl.readHandshakeRecord(Unknown Source)     at sun.security.ssl.SSLSocketImpl.startHandshake(Unknown Source)     at sun.security.ssl.SSLSocketImpl.startHandshake(Unknown Source)     at sun.net.www.protocol.https.HttpsClient.afterConnect(Unknown Source)     at sun.net.www.protocol.https.AbstractDelegateHttpsURLConnection.connect(Unknown Source)     at sun.net.www.protocol.http.HttpURLConnection.getInputStream0(Unknown Source)     at sun.net.www.protocol.http.HttpURLConnection.getInputStream(Unknown Source)     at sun.net.www.protocol.https.HttpsURLConnectionImpl.getInputStream(Unknown Source)     at java.net.URL.openStream(Unknown Source)     at net.minecraftforge.installertools.DownloadMojmaps.process(DownloadMojmaps.java:65)     at net.minecraftforge.installertools.ConsoleTool.main(ConsoleTool.java:55)     at sun.reflect.NativeMethodAccessorImpl.invoke0(Native Method)     at sun.reflect.NativeMethodAccessorImpl.invoke(Unknown Source)     at sun.reflect.DelegatingMethodAccessorImpl.invoke(Unknown Source)     at java.lang.reflect.Method.invoke(Unknown Source)     at net.minecraftforge.installer.actions.PostProcessors.process(PostProcessors.java:226)     at net.minecraftforge.installer.actions.ClientInstall.run(ClientInstall.java:144)     at net.minecraftforge.installer.InstallerPanel.run(InstallerPanel.java:423)     at net.minecraftforge.installer.SimpleInstaller.launchGui(SimpleInstaller.java:175)     at net.minecraftforge.installer.SimpleInstaller.main(SimpleInstaller.java:147) Caused by: sun.security.validator.ValidatorException: PKIX path building failed: sun.security.provider.certpath.SunCertPathBuilderException: unable to find valid certification path to requested target     at sun.security.validator.PKIXValidator.doBuild(Unknown Source)     at sun.security.validator.PKIXValidator.engineValidate(Unknown Source)     at sun.security.validator.Validator.validate(Unknown Source)     at sun.security.ssl.X509TrustManagerImpl.validate(Unknown Source)     at sun.security.ssl.X509TrustManagerImpl.checkTrusted(Unknown Source)     at sun.security.ssl.X509TrustManagerImpl.checkServerTrusted(Unknown Source)     ... 29 more Caused by: sun.security.provider.certpath.SunCertPathBuilderException: unable to find valid certification path to requested target     at sun.security.provider.certpath.SunCertPathBuilder.build(Unknown Source)     at sun.security.provider.certpath.SunCertPathBuilder.engineBuild(Unknown Source)     at java.security.cert.CertPathBuilder.build(Unknown Source)     ... 35 more Failed to run processor: javax.net.ssl.SSLHandshakeException:sun.security.validator.ValidatorException: PKIX path building failed: sun.security.provider.certpath.SunCertPathBuilderException: unable to find valid certification path to requested target See log for more details.     see
  • Topics

  • Who's Online (See full list)

×
×
  • Create New...

Important Information

By using this site, you agree to our Privacy Policy.