Jump to content
Search In
  • More options...
Find results that contain...
Find results in...

yavuzselim313

Members
  • Posts

    4
  • Joined

  • Last visited

yavuzselim313's Achievements

Tree Puncher

Tree Puncher (2/8)

0

Reputation

  1. I have this problem: C:\Users\yavuz\Desktop\Modding 1.12.2>gradlew build To honour the JVM settings for this build a new JVM will be forked. Please consider using the daemon: https://docs.gradle.org/2.14/userguide/gradle_daemon.html. This mapping 'snapshot_20171003' was designed for MC 1.12! Use at your own peril. FAILURE: Build failed with an exception. * Where: Build file 'C:\Users\yavuz\Desktop\Modding 1.12.2\build.gradle' line: 51 * What went wrong: A problem occurred evaluating root project 'Modding 1.12.2'. > Could not get unknown property 'mcversion' for object of type org.gradle.api.internal.artifacts.dsl.dependencies.DefaultDependencyHandler. * Try: Run with --stacktrace option to get the stack trace. Run with --info or --debug option to get more log output. BUILD FAILED Total time: 10.055 secs C:\Users\yavuz\Desktop\Modding 1.12.2>gradlew build To honour the JVM settings for this build a new JVM will be forked. Please consider using the daemon: https://docs.gradle.org/2.14/userguide/gradle_daemon.html. This mapping 'snapshot_20171003' was designed for MC 1.12! Use at your own peril. FAILURE: Build failed with an exception. * Where: Build file 'C:\Users\yavuz\Desktop\Modding 1.12.2\build.gradle' line: 53 * What went wrong: A problem occurred evaluating root project 'Modding 1.12.2'. > Could not get unknown property 'mcversion' for object of type org.gradle.api.internal.artifacts.dsl.dependencies.DefaultDependencyHandler. * Try: Run with --stacktrace option to get the stack trace. Run with --info or --debug option to get more log output. BUILD FAILED Total time: 14.161 secs C:\Users\yavuz\Desktop\Modding 1.12.2>gradlew build To honour the JVM settings for this build a new JVM will be forked. Please consider using the daemon: https://docs.gradle.org/2.14/userguide/gradle_daemon.html. This mapping 'snapshot_20171003' was designed for MC 1.12! Use at your own peril. ################################################# ForgeGradle 2.3-SNAPSHOT-6084129e https://github.com/MinecraftForge/ForgeGradle ################################################# Powered by MCP http://modcoderpack.com by: Searge, ProfMobius, R4wk, ZeuX Fesh0r, IngisKahn, bspkrs, LexManos ################################################# :deobfCompileDummyTask :extractMcpMappings SKIPPED :deobfProvidedDeobfDepTask0 SKIPPED :deobfProvidedRemapDepSourcesTask1 :deobfProvidedDummyTask :sourceApiJava UP-TO-DATE :compileApiJava UP-TO-DATE :processApiResources UP-TO-DATE :apiClasses UP-TO-DATE :sourceMainJava UP-TO-DATE :compileJava Note: C:\Users\yavuz\Desktop\Modding 1.12.2\build\sources\main\java\com\YTrollman\Starforcraft\entity\villager_milli\EntityVillager_milli.java uses unchecked or unsafe operations. Note: Recompile with -Xlint:unchecked for details. :processResources FAILED FAILURE: Build failed with an exception. * What went wrong: Execution failed for task ':processResources'. > Could not copy file 'C:\Users\yavuz\Desktop\Modding 1.12.2\src\main\resources\mcmod.info' to 'C:\Users\yavuz\Desktop\Modding 1.12.2\build\resources\main\mcmod.info'. * Try: Run with --stacktrace option to get the stack trace. Run with --info or --debug option to get more log output. BUILD FAILED Total time: 19.976 secs
  2. and I have found something. How can I fix it?
  3. I would make entities but nothing happen. I tried to solve myself but nothing happen. i delete my mod Items but in the game it was there i have no idea more and I have on my folder a exclamation mark.
×
×
  • Create New...

Important Information

By using this site, you agree to our Privacy Policy.