Jump to content
Search In
  • More options...
Find results that contain...
Find results in...

NeatFoxes

Members
  • Posts

    4
  • Joined

  • Last visited

Recent Profile Visitors

The recent visitors block is disabled and is not being shown to other users.

NeatFoxes's Achievements

Tree Puncher

Tree Puncher (2/8)

0

Reputation

  1. Oh I restarted my computer and solved this problem.Thank you all the same,@diesieben07
  2. I've updated my variable value of "JAVA_HOME" in "Environment variables",but it still doesn't work.
  3. I just uninstalled my java of old version and installed a new version. F:\Minecraft\forge>gradlew.bat setupDecompWorkspace ERROR: JAVA_HOME is set to an invalid directory: C:\Program Files\Java\jdk1.8.0_241\bin\java.exe Please set the JAVA_HOME variable in your environment to match the location of your Java installation. Help me,please.
  4. run with -stacktrace This mapping 'snapshot_20171003' was designed for MC 1.12! Use at your own peril. ################################################# ForgeGradle 2.3-SNAPSHOT-6084129e https://github.com/MinecraftForge/ForgeGradle ################################################# Powered by MCP http://modcoderpack.com by: Searge, ProfMobius, R4wk, ZeuX Fesh0r, IngisKahn, bspkrs, LexManos ################################################# :deobfCompileDummyTask :deobfProvidedDummyTask :getVersionJson :extractUserdev UP-TO-DATE :extractDependencyATs SKIPPED :extractMcpData SKIPPED :extractMcpMappings :genSrgs SKIPPED :downloadClient SKIPPED :downloadServer SKIPPED :splitServerJar SKIPPED :mergeJars SKIPPED :deobfMcSRG SKIPPED :decompileMc Error occurred during initialization of VM Could not reserve enough space for 3145728KB object heap :decompileMc FAILED FAILURE: Build failed with an exception. * What went wrong: Execution failed for task ':decompileMc'. > Process 'command 'C:\Program Files (x86)\Java\jdk1.8.0_181\bin\java.exe'' finished with non-zero exit value 1 * Try: Run with --info or --debug option to get more log output. * Exception is: org.gradle.api.tasks.TaskExecutionException: Execution failed for task ':decompileMc'. at org.gradle.api.internal.tasks.execution.ExecuteActionsTaskExecuter.executeActions(ExecuteActionsTaskExecuter.java:69) at org.gradle.api.internal.tasks.execution.ExecuteActionsTaskExecuter.execute(ExecuteActionsTaskExecuter.java:46) at org.gradle.api.internal.tasks.execution.PostExecutionAnalysisTaskExecuter.execute(PostExecutionAnalysisTaskExecuter.java:35) at org.gradle.api.internal.tasks.execution.SkipUpToDateTaskExecuter.execute(SkipUpToDateTaskExecuter.java:66) at org.gradle.api.internal.tasks.execution.ValidatingTaskExecuter.execute(ValidatingTaskExecuter.java:58) at org.gradle.api.internal.tasks.execution.SkipEmptySourceFilesTaskExecuter.execute(SkipEmptySourceFilesTaskExecuter.java:52) at org.gradle.api.internal.tasks.execution.SkipTaskWithNoActionsExecuter.execute(SkipTaskWithNoActionsExecuter.java:52) at org.gradle.api.internal.tasks.execution.SkipOnlyIfTaskExecuter.execute(SkipOnlyIfTaskExecuter.java:53) at org.gradle.api.internal.tasks.execution.ExecuteAtMostOnceTaskExecuter.execute(ExecuteAtMostOnceTaskExecuter.java:43) at org.gradle.execution.taskgraph.DefaultTaskGraphExecuter$EventFiringTaskWorker.execute(DefaultTaskGraphExecuter.java:203) at org.gradle.execution.taskgraph.DefaultTaskGraphExecuter$EventFiringTaskWorker.execute(DefaultTaskGraphExecuter.java:185) at org.gradle.execution.taskgraph.AbstractTaskPlanExecutor$TaskExecutorWorker.processTask(AbstractTaskPlanExecutor.java:66) at org.gradle.execution.taskgraph.AbstractTaskPlanExecutor$TaskExecutorWorker.run(AbstractTaskPlanExecutor.java:50) at org.gradle.execution.taskgraph.DefaultTaskPlanExecutor.process(DefaultTaskPlanExecutor.java:25) at org.gradle.execution.taskgraph.DefaultTaskGraphExecuter.execute(DefaultTaskGraphExecuter.java:110) at org.gradle.execution.SelectedTaskExecutionAction.execute(SelectedTaskExecutionAction.java:37) at org.gradle.execution.DefaultBuildExecuter.execute(DefaultBuildExecuter.java:37) at org.gradle.execution.DefaultBuildExecuter.access$000(DefaultBuildExecuter.java:23) at org.gradle.execution.DefaultBuildExecuter$1.proceed(DefaultBuildExecuter.java:43) at org.gradle.execution.DryRunBuildExecutionAction.execute(DryRunBuildExecutionAction.java:32) at org.gradle.execution.DefaultBuildExecuter.execute(DefaultBuildExecuter.java:37) at org.gradle.execution.DefaultBuildExecuter.execute(DefaultBuildExecuter.java:30) at org.gradle.initialization.DefaultGradleLauncher$4.run(DefaultGradleLauncher.java:153) at org.gradle.internal.Factories$1.create(Factories.java:22) at org.gradle.internal.progress.DefaultBuildOperationExecutor.run(DefaultBuildOperationExecutor.java:91) at org.gradle.internal.progress.DefaultBuildOperationExecutor.run(DefaultBuildOperationExecutor.java:53) at org.gradle.initialization.DefaultGradleLauncher.doBuildStages(DefaultGradleLauncher.java:150) at org.gradle.initialization.DefaultGradleLauncher.access$200(DefaultGradleLauncher.java:32) at org.gradle.initialization.DefaultGradleLauncher$1.create(DefaultGradleLauncher.java:98) at org.gradle.initialization.DefaultGradleLauncher$1.create(DefaultGradleLauncher.java:92) at org.gradle.internal.progress.DefaultBuildOperationExecutor.run(DefaultBuildOperationExecutor.java:91) at org.gradle.internal.progress.DefaultBuildOperationExecutor.run(DefaultBuildOperationExecutor.java:63) at org.gradle.initialization.DefaultGradleLauncher.doBuild(DefaultGradleLauncher.java:92) at org.gradle.initialization.DefaultGradleLauncher.run(DefaultGradleLauncher.java:83) at org.gradle.launcher.exec.InProcessBuildActionExecuter$DefaultBuildController.run(InProcessBuildActionExecuter.java:99) at org.gradle.tooling.internal.provider.ExecuteBuildActionRunner.run(ExecuteBuildActionRunner.java:28) at org.gradle.launcher.exec.ChainingBuildActionRunner.run(ChainingBuildActionRunner.java:35) at org.gradle.launcher.exec.InProcessBuildActionExecuter.execute(InProcessBuildActionExecuter.java:48) at org.gradle.launcher.exec.InProcessBuildActionExecuter.execute(InProcessBuildActionExecuter.java:30) at org.gradle.launcher.exec.ContinuousBuildActionExecuter.execute(ContinuousBuildActionExecuter.java:81) at org.gradle.launcher.exec.ContinuousBuildActionExecuter.execute(ContinuousBuildActionExecuter.java:46) at org.gradle.launcher.daemon.server.exec.ExecuteBuild.doBuild(ExecuteBuild.java:52) at org.gradle.launcher.daemon.server.exec.BuildCommandOnly.execute(BuildCommandOnly.java:36) at org.gradle.launcher.daemon.server.api.DaemonCommandExecution.proceed(DaemonCommandExecution.java:120) at org.gradle.launcher.daemon.server.exec.WatchForDisconnection.execute(WatchForDisconnection.java:37) at org.gradle.launcher.daemon.server.api.DaemonCommandExecution.proceed(DaemonCommandExecution.java:120) at org.gradle.launcher.daemon.server.exec.ResetDeprecationLogger.execute(ResetDeprecationLogger.java:26) at org.gradle.launcher.daemon.server.api.DaemonCommandExecution.proceed(DaemonCommandExecution.java:120) at org.gradle.launcher.daemon.server.exec.RequestStopIfSingleUsedDaemon.execute(RequestStopIfSingleUsedDaemon.java:34) at org.gradle.launcher.daemon.server.api.DaemonCommandExecution.proceed(DaemonCommandExecution.java:120) at org.gradle.launcher.daemon.server.exec.ForwardClientInput$2.call(ForwardClientInput.java:74) at org.gradle.launcher.daemon.server.exec.ForwardClientInput$2.call(ForwardClientInput.java:72) at org.gradle.util.Swapper.swap(Swapper.java:38) at org.gradle.launcher.daemon.server.exec.ForwardClientInput.execute(ForwardClientInput.java:72) at org.gradle.launcher.daemon.server.api.DaemonCommandExecution.proceed(DaemonCommandExecution.java:120) at org.gradle.launcher.daemon.server.health.DaemonHealthTracker.execute(DaemonHealthTracker.java:47) at org.gradle.launcher.daemon.server.api.DaemonCommandExecution.proceed(DaemonCommandExecution.java:120) at org.gradle.launcher.daemon.server.exec.LogToClient.doBuild(LogToClient.java:60) at org.gradle.launcher.daemon.server.exec.BuildCommandOnly.execute(BuildCommandOnly.java:36) at org.gradle.launcher.daemon.server.api.DaemonCommandExecution.proceed(DaemonCommandExecution.java:120) at org.gradle.launcher.daemon.server.exec.EstablishBuildEnvironment.doBuild(EstablishBuildEnvironment.java:72) at org.gradle.launcher.daemon.server.exec.BuildCommandOnly.execute(BuildCommandOnly.java:36) at org.gradle.launcher.daemon.server.api.DaemonCommandExecution.proceed(DaemonCommandExecution.java:120) at org.gradle.launcher.daemon.server.health.HintGCAfterBuild.execute(HintGCAfterBuild.java:41) at org.gradle.launcher.daemon.server.api.DaemonCommandExecution.proceed(DaemonCommandExecution.java:120) at org.gradle.launcher.daemon.server.exec.StartBuildOrRespondWithBusy$1.run(StartBuildOrRespondWithBusy.java:50) at org.gradle.launcher.daemon.server.DaemonStateCoordinator$1.run(DaemonStateCoordinator.java:237) at org.gradle.internal.concurrent.ExecutorPolicy$CatchAndRecordFailures.onExecute(ExecutorPolicy.java:54) at org.gradle.internal.concurrent.StoppableExecutorImpl$1.run(StoppableExecutorImpl.java:40) Caused by: org.gradle.process.internal.ExecException: Process 'command 'C:\Program Files (x86)\Java\jdk1.8.0_181\bin\java.exe'' finished with non-zero exit value 1 at org.gradle.process.internal.DefaultExecHandle$ExecResultImpl.assertNormalExitValue(DefaultExecHandle.java:367) at org.gradle.process.internal.DefaultJavaExecAction.execute(DefaultJavaExecAction.java:31) at org.gradle.api.internal.file.DefaultFileOperations.javaexec(DefaultFileOperations.java:170) at org.gradle.api.internal.project.AbstractProject.javaexec(AbstractProject.java:848) at net.minecraftforge.gradle.tasks.fernflower.ApplyFernFlowerTask.runForkedFernFlower(ApplyFernFlowerTask.java:131) at net.minecraftforge.gradle.tasks.fernflower.ApplyFernFlowerTask.runFernFlower(ApplyFernFlowerTask.java:103) at net.minecraftforge.gradle.tasks.fernflower.ApplyFernFlowerTask.applyFernFlower(ApplyFernFlowerTask.java:84) at org.gradle.internal.reflect.JavaMethod.invoke(JavaMethod.java:75) at org.gradle.api.internal.project.taskfactory.AnnotationProcessingTaskFactory$StandardTaskAction.doExecute(AnnotationProcessingTaskFactory.java:228) at org.gradle.api.internal.project.taskfactory.AnnotationProcessingTaskFactory$StandardTaskAction.execute(AnnotationProcessingTaskFactory.java:221) at org.gradle.api.internal.project.taskfactory.AnnotationProcessingTaskFactory$StandardTaskAction.execute(AnnotationProcessingTaskFactory.java:210) at org.gradle.api.internal.AbstractTask$TaskActionWrapper.execute(AbstractTask.java:621) at org.gradle.api.internal.AbstractTask$TaskActionWrapper.execute(AbstractTask.java:604) at org.gradle.api.internal.tasks.execution.ExecuteActionsTaskExecuter.executeAction(ExecuteActionsTaskExecuter.java:80) at org.gradle.api.internal.tasks.execution.ExecuteActionsTaskExecuter.executeActions(ExecuteActionsTaskExecuter.java:61) ... 68 more BUILD FAILED run with -info F:\Minecraft\forge-1.12.2-14.23.5.2847-mdk>gradlew.bat setupDecompWorkspace -info Connected to daemon DaemonInfo{pid=588, address=[ed09d76c-c085-404f-9945-493cfbc09dbf port:53511, addresses:[/127.0.0.1, /0:0:0:0:0:0:0:1]], idle=true, lastBusy=1583926017109, context=DefaultDaemonContext[uid=688c90f0-78e7-4940-8ae9-dd9a447ca176,javaHome=C:\Program Files (x86)\Java\jdk1.8.0_181,daemonRegistryDir=C:\Users\GreenBean\.gradle\daemon,pid=588,idleTimeout=10800000,daemonOpts=-Xmx512m,-Dfile.encoding=GBK,-Duser.country=CN,-Duser.language=zh,-Duser.variant]}. Dispatching request Build{id=413b3a13-31cb-420d-9010-1dff8a7fe399.1, currentDir=F:\Minecraft\forge-1.12.2-14.23.5.2847-mdk}. Received result org.gradle.launcher.daemon.protocol.BuildStarted@72a540 from daemon DaemonInfo{pid=588, address=[ed09d76c-c085-404f-9945-493cfbc09dbf port:53511, addresses:[/127.0.0.1, /0:0:0:0:0:0:0:1]], idle=true, lastBusy=1583926017109, context=DefaultDaemonContext[uid=688c90f0-78e7-4940-8ae9-dd9a447ca176,javaHome=C:\Program Files (x86)\Java\jdk1.8.0_181,daemonRegistryDir=C:\Users\GreenBean\.gradle\daemon,pid=588,idleTimeout=10800000,daemonOpts=-Xmx512m,-Dfile.encoding=GBK,-Duser.country=CN,-Duser.language=zh,-Duser.variant]} (build should be starting). The client will now receive all logging from the daemon (pid: 588). The daemon log file: C:\Users\GreenBean\.gradle\daemon\2.14\daemon-588.out.log Starting 2nd build in daemon [uptime: 6 mins 33.392 secs, performance: 98%, no major garbage collections] Executing build with daemon context: DefaultDaemonContext[uid=688c90f0-78e7-4940-8ae9-dd9a447ca176,javaHome=C:\Program Files (x86)\Java\jdk1.8.0_181,daemonRegistryDir=C:\Users\GreenBean\.gradle\daemon,pid=588,idleTimeout=10800000,daemonOpts=-Xmx512m,-Dfile.encoding=GBK,-Duser.country=CN,-Duser.language=zh,-Duser.variant] Starting Build Settings evaluated using settings file 'F:\master\settings.gradle'. Projects loaded. Root project using build file 'F:\Minecraft\forge-1.12.2-14.23.5.2847-mdk\build.gradle'. Included projects: [root project 'forge-1.12.2-14.23.5.2847-mdk'] Evaluating root project 'forge-1.12.2-14.23.5.2847-mdk' using build file 'F:\Minecraft\forge-1.12.2-14.23.5.2847-mdk\build.gradle'. This mapping 'snapshot_20171003' was designed for MC 1.12! Use at your own peril. file or directory 'F:\Minecraft\forge-1.12.2-14.23.5.2847-mdk\src\api\resources', not found All projects evaluated. Selected primary task 'setupDecompWorkspace' from project : Tasks to be executed: [task ':deobfCompileDummyTask', task ':deobfProvidedDummyTask', task ':getVersionJson', task ':extractUserdev', task ':extractDependencyATs', task ':extractMcpData', task ':extractMcpMappings', task ':genSrgs', task ':downloadClient', task ':downloadServer', task ':splitServerJar', task ':mergeJars', task ':deobfMcSRG', task ':decompileMc', task ':fixMcSources', task ':applySourcePatches', task ':remapMcSources', task ':recompileMc', task ':extractNatives', task ':getAssetIndex', task ':getAssets', task ':makeStart', task ':setupDecompWorkspace'] In-memory cache of F:\Minecraft\forge-1.12.2-14.23.5.2847-mdk\.gradle\2.14\taskArtifacts\fileHashes.bin: Size{21}, CacheStats{hitCount=18, missCount=21, loadSuccessCount=0, loadExceptionCount=0, totalLoadTime=0, evictionCount=0} In-memory cache of F:\Minecraft\forge-1.12.2-14.23.5.2847-mdk\.gradle\2.14\taskArtifacts\treeSnapshots.bin: Size{1}, CacheStats{hitCount=0, missCount=1, loadSuccessCount=0, loadExceptionCount=0, totalLoadTime=0, evictionCount=0} In-memory cache of F:\Minecraft\forge-1.12.2-14.23.5.2847-mdk\.gradle\2.14\taskArtifacts\treeSnapshotUsage.bin: Size{0}, CacheStats{hitCount=0, missCount=0, loadSuccessCount=0, loadExceptionCount=0, totalLoadTime=0, evictionCount=0} In-memory cache of F:\Minecraft\forge-1.12.2-14.23.5.2847-mdk\.gradle\2.14\taskArtifacts\fileSnapshotsToTreeSnapshotsIndex.bin: Size{6}, CacheStats{hitCount=0, missCount=6, loadSuccessCount=0, loadExceptionCount=0, totalLoadTime=0, evictionCount=0} In-memory cache of F:\Minecraft\forge-1.12.2-14.23.5.2847-mdk\.gradle\2.14\taskArtifacts\fileSnapshots.bin: Size{11}, CacheStats{hitCount=0, missCount=5, loadSuccessCount=0, loadExceptionCount=0, totalLoadTime=0, evictionCount=0} In-memory cache of F:\Minecraft\forge-1.12.2-14.23.5.2847-mdk\.gradle\2.14\taskArtifacts\taskArtifacts.bin: Size{4}, CacheStats{hitCount=0, missCount=4, loadSuccessCount=0, loadExceptionCount=0, totalLoadTime=0, evictionCount=0} :deobfCompileDummyTask (Thread[Daemon worker Thread 2,5,main]) started. :deobfCompileDummyTask Executing task ':deobfCompileDummyTask' (up-to-date check took 0.0 secs) due to: Task has not declared any outputs. :deobfCompileDummyTask (Thread[Daemon worker Thread 2,5,main]) completed. Took 0.002 secs. :deobfProvidedDummyTask (Thread[Daemon worker Thread 2,5,main]) started. :deobfProvidedDummyTask Executing task ':deobfProvidedDummyTask' (up-to-date check took 0.0 secs) due to: Task has not declared any outputs. :deobfProvidedDummyTask (Thread[Daemon worker Thread 2,5,main]) completed. Took 0.002 secs. :getVersionJson (Thread[Daemon worker Thread 2,5,main]) started. :getVersionJson Executing task ':getVersionJson' (up-to-date check took 0.005 secs) due to: Task.upToDateWhen is false. :getVersionJson (Thread[Daemon worker Thread 2,5,main]) completed. Took 0.73 secs. :extractUserdev (Thread[Daemon worker Thread 2,5,main]) started. :extractUserdev Skipping task ':extractUserdev' as it is up-to-date (took 0.006 secs). :extractUserdev UP-TO-DATE :extractUserdev (Thread[Daemon worker Thread 2,5,main]) completed. Took 0.008 secs. :extractDependencyATs (Thread[Daemon worker Thread 2,5,main]) started. :extractDependencyATs Skipping task ':extractDependencyATs' as task onlyIf is false. :extractDependencyATs SKIPPED :extractDependencyATs (Thread[Daemon worker Thread 2,5,main]) completed. Took 0.0 secs. :extractMcpData (Thread[Daemon worker Thread 2,5,main]) started. :extractMcpData Skipping task ':extractMcpData' as task onlyIf is false. :extractMcpData SKIPPED :extractMcpData (Thread[Daemon worker Thread 2,5,main]) completed. Took 0.097 secs. :extractMcpMappings (Thread[Daemon worker Thread 2,5,main]) started. :extractMcpMappings Skipping task ':extractMcpMappings' as task onlyIf is false. :extractMcpMappings SKIPPED :extractMcpMappings (Thread[Daemon worker Thread 2,5,main]) completed. Took 0.142 secs. :genSrgs (Thread[Daemon worker Thread 2,5,main]) started. :genSrgs Skipping task ':genSrgs' as task onlyIf is false. :genSrgs SKIPPED :genSrgs (Thread[Daemon worker Thread 2,5,main]) completed. Took 0.396 secs. :downloadClient (Thread[Daemon worker Thread 2,5,main]) started. :downloadClient Skipping task ':downloadClient' as task onlyIf is false. :downloadClient SKIPPED :downloadClient (Thread[Daemon worker Thread 2,5,main]) completed. Took 0.25 secs. :downloadServer (Thread[Daemon worker Thread 2,5,main]) started. :downloadServer Skipping task ':downloadServer' as task onlyIf is false. :downloadServer SKIPPED :downloadServer (Thread[Daemon worker Thread 2,5,main]) completed. Took 0.951 secs. :splitServerJar (Thread[Daemon worker Thread 2,5,main]) started. :splitServerJar Skipping task ':splitServerJar' as task onlyIf is false. :splitServerJar SKIPPED :splitServerJar (Thread[Daemon worker Thread 2,5,main]) completed. Took 4.747 secs. :mergeJars (Thread[Daemon worker Thread 2,5,main]) started. :mergeJars Skipping task ':mergeJars' as task onlyIf is false. :mergeJars SKIPPED :mergeJars (Thread[Daemon worker Thread 2,5,main]) completed. Took 0.991 secs. :deobfMcSRG (Thread[Daemon worker Thread 2,5,main]) started. :deobfMcSRG Skipping task ':deobfMcSRG' as task onlyIf is false. :deobfMcSRG SKIPPED :deobfMcSRG (Thread[Daemon worker Thread 2,5,main]) completed. Took 0.837 secs. :decompileMc (Thread[Daemon worker Thread 2,5,main]) started. :decompileMc No output file found. Executing task ':decompileMc' (up-to-date check took 0.001 secs) due to: No history is available. Note: ForgeGradle is forking a new process to run decompilation. Starting process 'command 'C:\Program Files (x86)\Java\jdk1.8.0_181\bin\java.exe''. Working directory: F:\Minecraft\forge-1.12.2-14.23.5.2847-mdk Command: C:\Program Files (x86)\Java\jdk1.8.0_181\bin\java.exe -Xmx3G -Dfile.encoding=GBK -Duser.country=CN -Duser.language=zh -Duser.variant -cp C:\Users\GreenBean\.gradle\caches\modules-2\files-2.1\net.minecraftforge.gradle\ForgeGradle\2.3-SNAPSHOT\d28c0ecad9897902b3ba3aa6fd0c5c2fefebfc9c\ForgeGradle-2.3-SNAPSHOT.jar;C:\Users\GreenBean\.gradle\caches\modules-2\files-2.1\com.google.guava\guava\18.0\cce0823396aa693798f8882e64213b1772032b09\guava-18.0.jar;C:\Users\GreenBean\.gradle\caches\modules-2\files-2.1\net.sf.opencsv\opencsv\2.3\c23708cdb9e80a144db433e23344a788a1fd6599\opencsv-2.3.jar;C:\Users\GreenBean\.gradle\caches\modules-2\files-2.1\org.jvnet.localizer\localizer\1.12\6d456886a035b2c3f758059da1f91a823eaa4a62\localizer-1.12.jar;C:\Users\GreenBean\.gradle\caches\modules-2\files-2.1\commons-io\commons-io\1.4\a8762d07e76cfde2395257a5da47ba7c1dbd3dce\commons-io-1.4.jar;C:\Users\GreenBean\.gradle\caches\modules-2\files-2.1\com.cloudbees\diff4j\1.1\645329c0d4ebbea5f73758929c6e63bab9e77204\diff4j-1.1.jar;C:\Users\GreenBean\.gradle\caches\modules-2\files-2.1\com.github.abrarsyed.jastyle\jAstyle\1.3\42431e5834cfb184d60be4142e2806cf2d806ea\jAstyle-1.3.jar;C:\Users\GreenBean\.gradle\caches\modules-2\files-2.1\net.sf.trove4j\trove4j\2.1.0\c82f2749a460b95de4c9d2466b62f18c23c7c914\trove4j-2.1.0.jar;C:\Users\GreenBean\.gradle\caches\modules-2\files-2.1\com.github.jponge\lzma-java\1.3\a25db9d4d385ccda4825ae1b47a7a61d86e595af\lzma-java-1.3.jar;C:\Users\GreenBean\.gradle\caches\modules-2\files-2.1\trove\trove\1.0.2\112b40581ab9a4d3de4636d49985a7f686d181c8\trove-1.0.2.jar;C:\Users\GreenBean\.gradle\caches\modules-2\files-2.1\com.nothome\javaxdelta\2.0.1\d4f5d077f1b15c6f67595015d69572303ad3f66d\javaxdelta-2.0.1.jar;C:\Users\GreenBean\.gradle\caches\modules-2\files-2.1\com.google.code.gson\gson\2.2.4\a60a5e993c98c864010053cb901b7eab25306568\gson-2.2.4.jar;C:\Users\GreenBean\.gradle\caches\modules-2\files-2.1\com.github.tony19\named-regexp\0.2.3\370846bf3837952d981deb8f91e81da8c65b09e1\named-regexp-0.2.3.jar;C:\Users\GreenBean\.gradle\caches\modules-2\files-2.1\net.minecraftforge\forgeflower\1.0.342-SNAPSHOT\83b7d227aa011da5f140558240149ed26a0f5d76\forgeflower-1.0.342-SNAPSHOT.jar;C:\Users\GreenBean\.gradle\caches\modules-2\files-2.1\org.apache.httpcomponents\httpcore\4.3.2\31fbbff1ddbf98f3aa7377c94d33b0447c646b6e\httpcore-4.3.2.jar;C:\Users\GreenBean\.gradle\caches\modules-2\files-2.1\commons-logging\commons-logging\1.1.3\f6f66e966c70a83ffbdb6f17a0919eaf7c8aca7f\commons-logging-1.1.3.jar;C:\Users\GreenBean\.gradle\caches\modules-2\files-2.1\commons-codec\commons-codec\1.6\b7f0fc8f61ecadeb3695f0b9464755eee44374d4\commons-codec-1.6.jar;C:\Users\GreenBean\.gradle\caches\modules-2\files-2.1\org.apache.httpcomponents\httpclient\4.3.3\18f4247ff4572a074444572cee34647c43e7c9c7\httpclient-4.3.3.jar;C:\Users\GreenBean\.gradle\caches\modules-2\files-2.1\org.apache.httpcomponents\httpmime\4.3.3\e02368d7b56c0c376f227378a4f77de62864d020\httpmime-4.3.3.jar;C:\Users\GreenBean\.gradle\wrapper\dists\gradle-2.14-bin\76oc0mnc3ieqtsukq90mp0rxk\gradle-2.14\lib\groovy-all-2.4.4.jar net.minecraftforge.gradle.tasks.fernflower.FernFlowerInvoker C:\Users\GREENB~1\AppData\Local\Temp\fg-fernflowersettings1639615391671786174.ser Successfully started process 'command 'C:\Program Files (x86)\Java\jdk1.8.0_181\bin\java.exe'' Error occurred during initialization of VM Could not reserve enough space for 3145728KB object heap :decompileMc FAILED :decompileMc (Thread[Daemon worker Thread 2,5,main]) completed. Took 0.268 secs. FAILURE: Build failed with an exception. * What went wrong: Execution failed for task ':decompileMc'. > Process 'command 'C:\Program Files (x86)\Java\jdk1.8.0_181\bin\java.exe'' finished with non-zero exit value 1 * Try: Run with --stacktrace option to get the stack trace. Run with --debug option to get more log output. BUILD FAILED Total time: 12.394 secs Stopped 0 compiler daemon(s). Received result Failure[value=org.gradle.initialization.ReportedException: org.gradle.internal.exceptions.LocationAwareException: Execution failed for task ':decompileMc'.] from daemon DaemonInfo{pid=588, address=[ed09d76c-c085-404f-9945-493cfbc09dbf port:53511, addresses:[/127.0.0.1, /0:0:0:0:0:0:0:1]], idle=true, lastBusy=1583926017109, context=DefaultDaemonContext[uid=688c90f0-78e7-4940-8ae9-dd9a447ca176,javaHome=C:\Program Files (x86)\Java\jdk1.8.0_181,daemonRegistryDir=C:\Users\GreenBean\.gradle\daemon,pid=588,idleTimeout=10800000,daemonOpts=-Xmx512m,-Dfile.encoding=GBK,-Duser.country=CN,-Duser.language=zh,-Duser.variant]} (build should be done).
  5. It took me a day!! Error trying "setup DecompWorkspace": F:\Minecraft\forge-1.12.2-14.23.5.2847-mdk>gradlew.bat setupDecompWorkspace To honour the JVM settings for this build a new JVM will be forked. Please consider using the daemon: https://docs.gradle.org/2.14/userguide/gradle_daemon.html. This mapping 'snapshot_20171003' was designed for MC 1.12! Use at your own peril. ################################################# ForgeGradle 2.3-SNAPSHOT-6084129e https://github.com/MinecraftForge/ForgeGradle ################################################# Powered by MCP http://modcoderpack.com by: Searge, ProfMobius, R4wk, ZeuX Fesh0r, IngisKahn, bspkrs, LexManos ################################################# :deobfCompileDummyTask :deobfProvidedDummyTask :getVersionJson :extractUserdev Download https://files.minecraftforge.net/maven/net/minecraftforge/forge/1.12.2-14.23.5.2847/forge-1.12.2-14.23.5.2847.pom Download https://files.minecraftforge.net/maven/net/minecraftforge/forge/1.12.2-14.23.5.2847/forge-1.12.2-14.23.5.2847-userdev.jar :extractDependencyATs SKIPPED :extractMcpData Download https://files.minecraftforge.net/maven/de/oceanlabs/mcp/mcp/1.12.2/mcp-1.12.2-srg.zip :extractMcpMappings Download https://files.minecraftforge.net/maven/de/oceanlabs/mcp/mcp_snapshot/20171003-1.12/mcp_snapshot-20171003-1.12.zip :genSrgs :downloadClient :downloadServer :splitServerJar :mergeJars :deobfMcSRG Applying SpecialSource... Applying Exceptor... :decompileMc Download https://repo1.maven.org/maven2/com/google/code/findbugs/jsr305/3.0.1/jsr305-3.0.1.pom Download https://libraries.minecraft.net/com/mojang/patchy/1.1/patchy-1.1.pom Download https://libraries.minecraft.net/oshi-project/oshi-core/1.1/oshi-core-1.1.pom Download https://repo1.maven.org/maven2/net/java/dev/jna/jna/4.4.0/jna-4.4.0.pom Download https://repo1.maven.org/maven2/net/java/dev/jna/platform/3.4.0/platform-3.4.0.pom Download https://libraries.minecraft.net/com/ibm/icu/icu4j-core-mojang/51.2/icu4j-core-mojang-51.2.pom Download https://repo1.maven.org/maven2/net/sf/jopt-simple/jopt-simple/5.0.3/jopt-simple-5.0.3.pom Download https://repo1.maven.org/maven2/io/netty/netty-all/4.1.9.Final/netty-all-4.1.9.Final.pom Download https://repo1.maven.org/maven2/io/netty/netty-parent/4.1.9.Final/netty-parent-4.1.9.Final.pom Download https://repo1.maven.org/maven2/org/sonatype/oss/oss-parent/9/oss-parent-9.pom Download https://repo1.maven.org/maven2/com/google/guava/guava/21.0/guava-21.0.pom Download https://repo1.maven.org/maven2/com/google/guava/guava-parent/21.0/guava-parent-21.0.pom Download https://repo1.maven.org/maven2/org/apache/commons/commons-lang3/3.5/commons-lang3-3.5.pom Download https://repo1.maven.org/maven2/org/apache/commons/commons-parent/41/commons-parent-41.pom Download https://repo1.maven.org/maven2/org/apache/apache/18/apache-18.pom Download https://repo1.maven.org/maven2/commons-io/commons-io/2.5/commons-io-2.5.pom Download https://repo1.maven.org/maven2/org/apache/commons/commons-parent/39/commons-parent-39.pom Download https://repo1.maven.org/maven2/org/apache/apache/16/apache-16.pom Download https://repo1.maven.org/maven2/commons-codec/commons-codec/1.10/commons-codec-1.10.pom Download https://repo1.maven.org/maven2/org/apache/commons/commons-parent/35/commons-parent-35.pom Download https://repo1.maven.org/maven2/org/apache/apache/15/apache-15.pom Download https://repo1.maven.org/maven2/net/java/jutils/jutils/1.0.0/jutils-1.0.0.pom Download https://repo1.maven.org/maven2/com/google/code/gson/gson/2.8.0/gson-2.8.0.pom Download https://repo1.maven.org/maven2/com/google/code/gson/gson-parent/2.8.0/gson-parent-2.8.0.pom Download https://libraries.minecraft.net/com/mojang/authlib/1.5.25/authlib-1.5.25.pom Download https://libraries.minecraft.net/com/mojang/realms/1.10.22/realms-1.10.22.pom Download https://repo1.maven.org/maven2/org/apache/commons/commons-compress/1.8.1/commons-compress-1.8.1.pom Download https://repo1.maven.org/maven2/org/apache/commons/commons-parent/33/commons-parent-33.pom Download https://repo1.maven.org/maven2/it/unimi/dsi/fastutil/7.1.0/fastutil-7.1.0.pom Download https://repo1.maven.org/maven2/org/apache/logging/log4j/log4j-api/2.8.1/log4j-api-2.8.1.pom Download https://repo1.maven.org/maven2/org/apache/logging/log4j/log4j/2.8.1/log4j-2.8.1.pom Download https://repo1.maven.org/maven2/org/apache/logging/logging-parent/1/logging-parent-1.pom Download https://repo1.maven.org/maven2/org/apache/logging/log4j/log4j-core/2.8.1/log4j-core-2.8.1.pom Download https://libraries.minecraft.net/com/mojang/text2speech/1.10.3/text2speech-1.10.3.pom Download https://libraries.minecraft.net/net/minecraft/launchwrapper/1.12/launchwrapper-1.12.pom Download https://repo1.maven.org/maven2/org/jline/jline/3.5.1/jline-3.5.1.pom Download https://repo1.maven.org/maven2/org/jline/jline-parent/3.5.1/jline-parent-3.5.1.pom Download https://repo1.maven.org/maven2/org/ow2/asm/asm-debug-all/5.2/asm-debug-all-5.2.pom Download https://repo1.maven.org/maven2/org/ow2/asm/asm-parent/5.2/asm-parent-5.2.pom Download https://repo1.maven.org/maven2/org/ow2/ow2/1.3/ow2-1.3.pom Download https://repo1.maven.org/maven2/com/typesafe/akka/akka-actor_2.11/2.3.3/akka-actor_2.11-2.3.3.pom Download https://repo1.maven.org/maven2/com/typesafe/config/1.2.1/config-1.2.1.pom Download https://repo1.maven.org/maven2/org/scala-lang/scala-actors-migration_2.11/1.1.0/scala-actors-migration_2.11-1.1.0.pom Download https://repo1.maven.org/maven2/org/scala-lang/scala-compiler/2.11.1/scala-compiler-2.11.1.pom Download https://repo1.maven.org/maven2/org/scala-lang/plugins/scala-continuations-library_2.11/1.0.2/scala-continuations-library_2.11-1.0.2.pom Download https://repo1.maven.org/maven2/org/scala-lang/plugins/scala-continuations-plugin_2.11.1/1.0.2/scala-continuations-plugin_2.11.1-1.0.2.pom Download https://repo1.maven.org/maven2/org/scala-lang/scala-library/2.11.1/scala-library-2.11.1.pom Download https://repo1.maven.org/maven2/org/scala-lang/modules/scala-parser-combinators_2.11/1.0.1/scala-parser-combinators_2.11-1.0.1.pom Download https://repo1.maven.org/maven2/org/scala-lang/scala-reflect/2.11.1/scala-reflect-2.11.1.pom Download https://repo1.maven.org/maven2/org/scala-lang/modules/scala-swing_2.11/1.0.1/scala-swing_2.11-1.0.1.pom Download https://repo1.maven.org/maven2/org/scala-lang/modules/scala-xml_2.11/1.0.2/scala-xml_2.11-1.0.2.pom Download https://libraries.minecraft.net/lzma/lzma/0.0.1/lzma-0.0.1.pom Download https://repo1.maven.org/maven2/net/sf/trove4j/trove4j/3.0.3/trove4j-3.0.3.pom Download https://repo1.maven.org/maven2/org/apache/maven/maven-artifact/3.5.3/maven-artifact-3.5.3.pom Download https://repo1.maven.org/maven2/org/apache/maven/maven/3.5.3/maven-3.5.3.pom Download https://repo1.maven.org/maven2/org/apache/maven/maven-parent/31/maven-parent-31.pom Download https://repo1.maven.org/maven2/org/apache/apache/19/apache-19.pom Download https://libraries.minecraft.net/com/paulscode/codecjorbis/20101023/codecjorbis-20101023.pom Download https://libraries.minecraft.net/com/paulscode/codecwav/20101023/codecwav-20101023.pom Download https://libraries.minecraft.net/com/paulscode/libraryjavasound/20101123/libraryjavasound-20101123.pom Download https://libraries.minecraft.net/com/paulscode/librarylwjglopenal/20100824/librarylwjglopenal-20100824.pom Download https://libraries.minecraft.net/com/paulscode/soundsystem/20120107/soundsystem-20120107.pom Download https://repo1.maven.org/maven2/net/java/jinput/jinput/2.0.5/jinput-2.0.5.pom Download https://libraries.minecraft.net/org/lwjgl/lwjgl/lwjgl/2.9.4-nightly-20150209/lwjgl-2.9.4-nightly-20150209.pom Download https://libraries.minecraft.net/org/lwjgl/lwjgl/parent/2.9.4-nightly-20150209/parent-2.9.4-nightly-20150209.pom Download https://libraries.minecraft.net/org/lwjgl/lwjgl/lwjgl_util/2.9.4-nightly-20150209/lwjgl_util-2.9.4-nightly-20150209.pom Download https://libraries.minecraft.net/java3d/vecmath/1.5.2/vecmath-1.5.2.pom Download https://repo1.maven.org/maven2/ca/weblite/java-objc-bridge/1.0.0/java-objc-bridge-1.0.0.pom Download https://repo1.maven.org/maven2/org/scala-lang/scala-actors/2.11.0/scala-actors-2.11.0.pom Download https://repo1.maven.org/maven2/org/codehaus/plexus/plexus-utils/3.1.0/plexus-utils-3.1.0.pom Download https://repo1.maven.org/maven2/org/codehaus/plexus/plexus/4.0/plexus-4.0.pom Download https://repo1.maven.org/maven2/org/sonatype/forge/forge-parent/10/forge-parent-10.pom Download https://repo1.maven.org/maven2/net/java/jinput/jinput-platform/2.0.5/jinput-platform-2.0.5.pom Download https://libraries.minecraft.net/org/lwjgl/lwjgl/lwjgl-platform/2.9.4-nightly-20150209/lwjgl-platform-2.9.4-nightly-20150209.pom Download https://repo1.maven.org/maven2/com/google/code/findbugs/jsr305/3.0.1/jsr305-3.0.1.jar Download https://libraries.minecraft.net/com/mojang/patchy/1.1/patchy-1.1.jar Download https://libraries.minecraft.net/oshi-project/oshi-core/1.1/oshi-core-1.1.jar Download https://repo1.maven.org/maven2/net/java/dev/jna/jna/4.4.0/jna-4.4.0.jar Download https://repo1.maven.org/maven2/net/java/dev/jna/platform/3.4.0/platform-3.4.0.jar Download https://libraries.minecraft.net/com/ibm/icu/icu4j-core-mojang/51.2/icu4j-core-mojang-51.2.jar Download https://repo1.maven.org/maven2/net/sf/jopt-simple/jopt-simple/5.0.3/jopt-simple-5.0.3.jar Download https://repo1.maven.org/maven2/io/netty/netty-all/4.1.9.Final/netty-all-4.1.9.Final.jar > Building 56% > :decompileMc > 1.16 MB/3.35 MB downloaded Download https://repo1.maven.org/maven2/com/google/guava/guava/21.0/guava-21.0.jar Download https://repo1.maven.org/maven2/org/apache/commons/commons-lang3/3.5/commons-lang3-3.5.jar Download https://repo1.maven.org/maven2/commons-io/commons-io/2.5/commons-io-2.5.jar Download https://repo1.maven.org/maven2/commons-codec/commons-codec/1.10/commons-codec-1.10.jar Download https://repo1.maven.org/maven2/net/java/jutils/jutils/1.0.0/jutils-1.0.0.jar Download https://repo1.maven.org/maven2/com/google/code/gson/gson/2.8.0/gson-2.8.0.jar Download https://libraries.minecraft.net/com/mojang/authlib/1.5.25/authlib-1.5.25.jar Download https://libraries.minecraft.net/com/mojang/realms/1.10.22/realms-1.10.22.jar Download https://repo1.maven.org/maven2/org/apache/commons/commons-compress/1.8.1/commons-compress-1.8.1.jar Download https://repo1.maven.org/maven2/it/unimi/dsi/fastutil/7.1.0/fastutil-7.1.0.jar Download https://repo1.maven.org/maven2/org/apache/logging/log4j/log4j-api/2.8.1/log4j-api-2.8.1.jar Download https://repo1.maven.org/maven2/org/apache/logging/log4j/log4j-core/2.8.1/log4j-core-2.8.1.jar Download https://libraries.minecraft.net/com/mojang/text2speech/1.10.3/text2speech-1.10.3.jar Download https://libraries.minecraft.net/net/minecraft/launchwrapper/1.12/launchwrapper-1.12.jar Download https://repo1.maven.org/maven2/org/jline/jline/3.5.1/jline-3.5.1.jar Download https://repo1.maven.org/maven2/org/ow2/asm/asm-debug-all/5.2/asm-debug-all-5.2.jar Download https://repo1.maven.org/maven2/com/typesafe/akka/akka-actor_2.11/2.3.3/akka-actor_2.11-2.3.3.jar Download https://repo1.maven.org/maven2/com/typesafe/config/1.2.1/config-1.2.1.jar Download https://repo1.maven.org/maven2/org/scala-lang/scala-actors-migration_2.11/1.1.0/scala-actors-migration_2.11-1.1.0.jar Download https://repo1.maven.org/maven2/org/scala-lang/scala-compiler/2.11.1/scala-compiler-2.11.1.jar Download https://repo1.maven.org/maven2/org/scala-lang/plugins/scala-continuations-library_2.11/1.0.2/scala-continuations-library_2.11-1.0.2.jar Download https://repo1.maven.org/maven2/org/scala-lang/plugins/scala-continuations-plugin_2.11.1/1.0.2/scala-continuations-plugin_2.11.1-1.0.2.jar Download https://repo1.maven.org/maven2/org/scala-lang/scala-library/2.11.1/scala-library-2.11.1.jar > Building 56% > :decompileMc > 2.42 MB/5.28 MB downloaded Download https://repo1.maven.org/maven2/org/scala-lang/modules/scala-parser-combinators_2.11/1.0.1/scala-parser-combinators_2.11-1.0.1.jar Download https://repo1.maven.org/maven2/org/scala-lang/scala-reflect/2.11.1/scala-reflect-2.11.1.jar Download https://repo1.maven.org/maven2/org/scala-lang/modules/scala-swing_2.11/1.0.1/scala-swing_2.11-1.0.1.jar Download https://repo1.maven.org/maven2/org/scala-lang/modules/scala-xml_2.11/1.0.2/scala-xml_2.11-1.0.2.jar Download https://libraries.minecraft.net/lzma/lzma/0.0.1/lzma-0.0.1.jar Download https://repo1.maven.org/maven2/net/sf/trove4j/trove4j/3.0.3/trove4j-3.0.3.jar Download https://repo1.maven.org/maven2/org/apache/maven/maven-artifact/3.5.3/maven-artifact-3.5.3.jar Download https://libraries.minecraft.net/com/paulscode/codecjorbis/20101023/codecjorbis-20101023.jar Download https://libraries.minecraft.net/com/paulscode/codecwav/20101023/codecwav-20101023.jar Download https://libraries.minecraft.net/com/paulscode/libraryjavasound/20101123/libraryjavasound-20101123.jar Download https://libraries.minecraft.net/com/paulscode/librarylwjglopenal/20100824/librarylwjglopenal-20100824.jar Download https://libraries.minecraft.net/com/paulscode/soundsystem/20120107/soundsystem-20120107.jar Download https://repo1.maven.org/maven2/net/java/jinput/jinput/2.0.5/jinput-2.0.5.jar Download https://libraries.minecraft.net/org/lwjgl/lwjgl/lwjgl/2.9.4-nightly-20150209/lwjgl-2.9.4-nightly-20150209.jar Download https://libraries.minecraft.net/org/lwjgl/lwjgl/lwjgl_util/2.9.4-nightly-20150209/lwjgl_util-2.9.4-nightly-20150209.jar Download https://libraries.minecraft.net/java3d/vecmath/1.5.2/vecmath-1.5.2.jar Download https://repo1.maven.org/maven2/ca/weblite/java-objc-bridge/1.0.0/java-objc-bridge-1.0.0.jar Download https://repo1.maven.org/maven2/org/scala-lang/scala-actors/2.11.0/scala-actors-2.11.0.jar Download https://repo1.maven.org/maven2/org/codehaus/plexus/plexus-utils/3.1.0/plexus-utils-3.1.0.jar Download https://repo1.maven.org/maven2/net/java/jinput/jinput-platform/2.0.5/jinput-platform-2.0.5-natives-linux.jar Download https://repo1.maven.org/maven2/net/java/jinput/jinput-platform/2.0.5/jinput-platform-2.0.5-natives-windows.jar Download https://repo1.maven.org/maven2/net/java/jinput/jinput-platform/2.0.5/jinput-platform-2.0.5-natives-osx.jar Download https://libraries.minecraft.net/org/lwjgl/lwjgl/lwjgl-platform/2.9.4-nightly-20150209/lwjgl-platform-2.9.4-nightly-20150209-natives-windows.jar Download https://libraries.minecraft.net/org/lwjgl/lwjgl/lwjgl-platform/2.9.4-nightly-20150209/lwjgl-platform-2.9.4-nightly-20150209-natives-linux.jar Download https://libraries.minecraft.net/org/lwjgl/lwjgl/lwjgl-platform/2.9.4-nightly-20150209/lwjgl-platform-2.9.4-nightly-20150209-natives-osx.jar Error occurred during initialization of VM Could not reserve enough space for 3145728KB object heap :decompileMc FAILED FAILURE: Build failed with an exception. * What went wrong: Execution failed for task ':decompileMc'. > Process 'command 'C:\Program Files (x86)\Java\jdk1.8.0_181\bin\java.exe'' finished with non-zero exit value 1 * Try: Run with --stacktrace option to get the stack trace. Run with --info or --debug option to get more log output. BUILD FAILED Total time: 2 hrs 34 mins 45.231 secs
×
×
  • Create New...

Important Information

By using this site, you agree to our Privacy Policy.