Jump to content
Search In
  • More options...
Find results that contain...
Find results in...

GrandpaMizery

Members
  • Posts

    3
  • Joined

  • Last visited

Converted

  • Gender
    Undisclosed
  • Personal Text
    I am new!

GrandpaMizery's Achievements

Tree Puncher

Tree Puncher (2/8)

0

Reputation

  1. Thank you very much. I made the corrections in the mcmod.info file and the build was successful.
  2. Here is the stacktrace **************************** Powered By MCP: http://mcp.ocean-labs.de/ Searge, ProfMobius, Fesh0r, R4wk, ZeuX, IngisKahn, bspkrs MCP Data version : snapshot_nodoc_20141130 **************************** :compileApiJava UP-TO-DATE :processApiResources UP-TO-DATE :apiClasses UP-TO-DATE :sourceMainJava UP-TO-DATE :compileJava UP-TO-DATE :processResources FAILED FAILURE: Build failed with an exception. * What went wrong: Execution failed for task ':processResources'. > Could not copy file 'C:\Randy\java\forge mods\src\main\resources\mcmod.info' t o 'C:\Randy\java\forge mods\build\resources\main\mcmod.info'. * Try: Run with --info or --debug option to get more log output. * Exception is: org.gradle.api.tasks.TaskExecutionException: Execution failed for task ':process Resources'. at org.gradle.api.internal.tasks.execution.ExecuteActionsTaskExecuter.ex ecuteActions(ExecuteActionsTaskExecuter.java:69) at org.gradle.api.internal.tasks.execution.ExecuteActionsTaskExecuter.ex ecute(ExecuteActionsTaskExecuter.java:46) at org.gradle.api.internal.tasks.execution.PostExecutionAnalysisTaskExec uter.execute(PostExecutionAnalysisTaskExecuter.java:35) at org.gradle.api.internal.tasks.execution.SkipUpToDateTaskExecuter.exec ute(SkipUpToDateTaskExecuter.java:64) at org.gradle.api.internal.tasks.execution.ValidatingTaskExecuter.execut e(ValidatingTaskExecuter.java:58) at org.gradle.api.internal.tasks.execution.SkipEmptySourceFilesTaskExecu ter.execute(SkipEmptySourceFilesTaskExecuter.java:42) at org.gradle.api.internal.tasks.execution.SkipTaskWithNoActionsExecuter .execute(SkipTaskWithNoActionsExecuter.java:52) at org.gradle.api.internal.tasks.execution.SkipOnlyIfTaskExecuter.execut e(SkipOnlyIfTaskExecuter.java:53) at org.gradle.api.internal.tasks.execution.ExecuteAtMostOnceTaskExecuter .execute(ExecuteAtMostOnceTaskExecuter.java:43) at org.gradle.api.internal.AbstractTask.executeWithoutThrowingTaskFailur e(AbstractTask.java:296) at org.gradle.execution.taskgraph.AbstractTaskPlanExecutor$TaskExecutorW orker.executeTask(AbstractTaskPlanExecutor.java:79) at org.gradle.execution.taskgraph.AbstractTaskPlanExecutor$TaskExecutorW orker.processTask(AbstractTaskPlanExecutor.java:63) at org.gradle.execution.taskgraph.AbstractTaskPlanExecutor$TaskExecutorW orker.run(AbstractTaskPlanExecutor.java:51) at org.gradle.execution.taskgraph.DefaultTaskPlanExecutor.process(Defaul tTaskPlanExecutor.java:23) at org.gradle.execution.taskgraph.DefaultTaskGraphExecuter.execute(Defau ltTaskGraphExecuter.java:86) at org.gradle.execution.SelectedTaskExecutionAction.execute(SelectedTask ExecutionAction.java:29) at org.gradle.execution.DefaultBuildExecuter.execute(DefaultBuildExecute r.java:61) at org.gradle.execution.DefaultBuildExecuter.access$200(DefaultBuildExec uter.java:23) at org.gradle.execution.DefaultBuildExecuter$2.proceed(DefaultBuildExecu ter.java:67) at org.gradle.execution.DryRunBuildExecutionAction.execute(DryRunBuildEx ecutionAction.java:32) at org.gradle.execution.DefaultBuildExecuter.execute(DefaultBuildExecute r.java:61) at org.gradle.execution.DefaultBuildExecuter.execute(DefaultBuildExecute r.java:54) at org.gradle.initialization.DefaultGradleLauncher.doBuildStages(Default GradleLauncher.java:148) at org.gradle.initialization.DefaultGradleLauncher.doBuild(DefaultGradle Launcher.java:105) at org.gradle.initialization.DefaultGradleLauncher.run(DefaultGradleLaun cher.java:85) at org.gradle.launcher.exec.InProcessBuildActionExecuter$DefaultBuildCon troller.run(InProcessBuildActionExecuter.java:81) at org.gradle.launcher.cli.ExecuteBuildAction.run(ExecuteBuildAction.jav a:33) at org.gradle.launcher.cli.ExecuteBuildAction.run(ExecuteBuildAction.jav a:24) at org.gradle.launcher.exec.InProcessBuildActionExecuter.execute(InProce ssBuildActionExecuter.java:39) at org.gradle.launcher.exec.InProcessBuildActionExecuter.execute(InProce ssBuildActionExecuter.java:29) at org.gradle.launcher.cli.RunBuildAction.run(RunBuildAction.java:50) at org.gradle.internal.Actions$RunnableActionAdapter.execute(Actions.jav a:171) at org.gradle.launcher.cli.CommandLineActionFactory$ParseAndBuildAction. execute(CommandLineActionFactory.java:237) at org.gradle.launcher.cli.CommandLineActionFactory$ParseAndBuildAction. execute(CommandLineActionFactory.java:210) at org.gradle.launcher.cli.JavaRuntimeValidationAction.execute(JavaRunti meValidationAction.java:35) at org.gradle.launcher.cli.JavaRuntimeValidationAction.execute(JavaRunti meValidationAction.java:24) at org.gradle.launcher.cli.CommandLineActionFactory$WithLogging.execute( CommandLineActionFactory.java:206) at org.gradle.launcher.cli.CommandLineActionFactory$WithLogging.execute( CommandLineActionFactory.java:169) at org.gradle.launcher.cli.ExceptionReportingAction.execute(ExceptionRep ortingAction.java:33) at org.gradle.launcher.cli.ExceptionReportingAction.execute(ExceptionRep ortingAction.java:22) at org.gradle.launcher.Main.doAction(Main.java:33) at org.gradle.launcher.bootstrap.EntryPoint.run(EntryPoint.java:45) at sun.reflect.NativeMethodAccessorImpl.invoke0(Native Method) at sun.reflect.NativeMethodAccessorImpl.invoke(Unknown Source) at sun.reflect.DelegatingMethodAccessorImpl.invoke(Unknown Source) at java.lang.reflect.Method.invoke(Unknown Source) at org.gradle.launcher.bootstrap.ProcessBootstrap.runNoExit(ProcessBoots trap.java:54) at org.gradle.launcher.bootstrap.ProcessBootstrap.run(ProcessBootstrap.j ava:35) at org.gradle.launcher.GradleMain.main(GradleMain.java:23) at sun.reflect.NativeMethodAccessorImpl.invoke0(Native Method) at sun.reflect.NativeMethodAccessorImpl.invoke(Unknown Source) at sun.reflect.DelegatingMethodAccessorImpl.invoke(Unknown Source) at java.lang.reflect.Method.invoke(Unknown Source) at org.gradle.wrapper.BootstrapMainStarter.start(BootstrapMainStarter.ja va:30) at org.gradle.wrapper.WrapperExecutor.execute(WrapperExecutor.java:127) at org.gradle.wrapper.GradleWrapperMain.main(GradleWrapperMain.java:56) Caused by: org.gradle.api.GradleException: Could not copy file 'C:\Randy\java\fo rge mods\src\main\resources\mcmod.info' to 'C:\Randy\java\forge mods\build\resou rces\main\mcmod.info'. at org.gradle.api.internal.file.AbstractFileTreeElement.copyTo(AbstractF ileTreeElement.java:79) at org.gradle.api.internal.file.copy.DefaultFileCopyDetails.copyTo(Defau ltFileCopyDetails.java:102) at org.gradle.api.internal.file.copy.FileCopyAction$FileCopyDetailsInter nalAction.processFile(FileCopyAction.java:44) at org.gradle.api.internal.file.copy.NormalizingCopyActionDecorator$1$1. processFile(NormalizingCopyActionDecorator.java:65) at org.gradle.api.internal.file.copy.DuplicateHandlingCopyActionDecorato r$1$1.processFile(DuplicateHandlingCopyActionDecorator.java:60) at org.gradle.api.internal.file.copy.CopyFileVisitorImpl.processFile(Cop yFileVisitorImpl.java:60) at org.gradle.api.internal.file.copy.CopyFileVisitorImpl.visitFile(CopyF ileVisitorImpl.java:44) at org.gradle.api.internal.file.collections.DirectoryFileTree.walkDir(Di rectoryFileTree.java:157) at org.gradle.api.internal.file.collections.DirectoryFileTree.visitFrom( DirectoryFileTree.java:125) at org.gradle.api.internal.file.collections.DirectoryFileTree.visit(Dire ctoryFileTree.java:115) at org.gradle.api.internal.file.collections.FileTreeAdapter.visit(FileTr eeAdapter.java:96) at org.gradle.api.internal.file.CompositeFileTree.visit(CompositeFileTre e.java:54) at org.gradle.api.internal.file.copy.CopySpecActionImpl.execute(CopySpec ActionImpl.java:37) at org.gradle.api.internal.file.copy.CopySpecActionImpl.execute(CopySpec ActionImpl.java:24) at org.gradle.api.internal.file.copy.DefaultCopySpec$DefaultCopySpecReso lver.walk(DefaultCopySpec.java:498) at org.gradle.api.internal.file.copy.DefaultCopySpec$DefaultCopySpecReso lver.walk(DefaultCopySpec.java:500) at org.gradle.api.internal.file.copy.DefaultCopySpec$DefaultCopySpecReso lver.walk(DefaultCopySpec.java:500) at org.gradle.api.internal.file.copy.DefaultCopySpec.walk(DefaultCopySpe c.java:322) at org.gradle.api.internal.file.copy.DelegatingCopySpecInternal.walk(Del egatingCopySpecInternal.java:206) at org.gradle.api.internal.file.copy.CopySpecBackedCopyActionProcessingS tream.process(CopySpecBackedCopyActionProcessingStream.java:36) at org.gradle.api.internal.file.copy.DuplicateHandlingCopyActionDecorato r$1.process(DuplicateHandlingCopyActionDecorator.java:44) at org.gradle.api.internal.file.copy.NormalizingCopyActionDecorator$1.pr ocess(NormalizingCopyActionDecorator.java:56) at org.gradle.api.internal.file.copy.FileCopyAction.execute(FileCopyActi on.java:35) at org.gradle.api.internal.file.copy.NormalizingCopyActionDecorator.exec ute(NormalizingCopyActionDecorator.java:52) at org.gradle.api.internal.file.copy.DuplicateHandlingCopyActionDecorato r.execute(DuplicateHandlingCopyActionDecorator.java:42) at org.gradle.api.internal.file.copy.CopyActionExecuter.execute(CopyActi onExecuter.java:38) at org.gradle.api.tasks.AbstractCopyTask.copy(AbstractCopyTask.java:83) at org.gradle.language.jvm.tasks.ProcessResources.copy(ProcessResources. java:33) at sun.reflect.NativeMethodAccessorImpl.invoke0(Native Method) at sun.reflect.NativeMethodAccessorImpl.invoke(Unknown Source) at sun.reflect.DelegatingMethodAccessorImpl.invoke(Unknown Source) at java.lang.reflect.Method.invoke(Unknown Source) at org.gradle.internal.reflect.JavaMethod.invoke(JavaMethod.java:63) at org.gradle.api.internal.project.taskfactory.AnnotationProcessingTaskF actory$StandardTaskAction.doExecute(AnnotationProcessingTaskFactory.java:218) at org.gradle.api.internal.project.taskfactory.AnnotationProcessingTaskF actory$StandardTaskAction.execute(AnnotationProcessingTaskFactory.java:211) at org.gradle.api.internal.project.taskfactory.AnnotationProcessingTaskF actory$StandardTaskAction.execute(AnnotationProcessingTaskFactory.java:200) at org.gradle.api.internal.AbstractTask$TaskActionWrapper.execute(Abstra ctTask.java:570) at org.gradle.api.internal.AbstractTask$TaskActionWrapper.execute(Abstra ctTask.java:553) at org.gradle.api.internal.tasks.execution.ExecuteActionsTaskExecuter.ex ecuteAction(ExecuteActionsTaskExecuter.java:80) at org.gradle.api.internal.tasks.execution.ExecuteActionsTaskExecuter.ex ecuteActions(ExecuteActionsTaskExecuter.java:61) ... 55 more Caused by: groovy.lang.MissingPropertyException: No such property: modid for cla ss: SimpleTemplateScript1 at org.codehaus.groovy.runtime.ScriptBytecodeAdapter.unwrap(ScriptByteco deAdapter.java:50) at org.codehaus.groovy.runtime.callsite.PogoGetPropertySite.getProperty( PogoGetPropertySite.java:49) at org.codehaus.groovy.runtime.callsite.AbstractCallSite.callGroovyObjec tGetProperty(AbstractCallSite.java:231) at SimpleTemplateScript1.run(SimpleTemplateScript1.groovy:1) at groovy.text.SimpleTemplateEngine$SimpleTemplate$1.writeTo(SimpleTempl ateEngine.java:165) at org.gradle.api.internal.file.copy.FilterChain$3.transform(FilterChain .java:95) at org.gradle.api.internal.file.copy.FilterChain$3.transform(FilterChain .java:84) at org.gradle.api.internal.ChainingTransformer.transform(ChainingTransfo rmer.java:37) at org.gradle.api.internal.file.copy.FilterChain.transform(FilterChain.j ava:39) at org.gradle.api.internal.file.copy.FilterChain.transform(FilterChain.j ava:46) at org.gradle.api.internal.file.copy.DefaultFileCopyDetails.open(Default FileCopyDetails.java:86) at org.gradle.api.internal.file.AbstractFileTreeElement.copyTo(AbstractF ileTreeElement.java:56) at org.gradle.api.internal.file.copy.DefaultFileCopyDetails.copyTo(Defau ltFileCopyDetails.java:94) at org.gradle.api.internal.file.AbstractFileTreeElement.copyFile(Abstrac tFileTreeElement.java:93) at org.gradle.api.internal.file.AbstractFileTreeElement.copyTo(AbstractF ileTreeElement.java:74) ... 94 more BUILD FAILED Total time: 37.554 secs
  3. This is for Forge-1.8-11.14.0126-1.8 installation. When I try to build the project I get an this build failure Executing command: ":build" **************************** Powered By MCP: http://mcp.ocean-labs.de/ Searge, ProfMobius, Fesh0r, R4wk, ZeuX, IngisKahn, bspkrs MCP Data version : snapshot_nodoc_20141130 **************************** :compileApiJava UP-TO-DATE :processApiResources UP-TO-DATE :apiClasses UP-TO-DATE :sourceMainJava UP-TO-DATE :compileJava UP-TO-DATE :processResources FAILED FAILURE: Build failed with an exception. * What went wrong: Execution failed for task ':processResources'. > Could not copy file 'C:\Randy\java\forge mods\src\main\resources\mcmod.info' to 'C:\Randy\java\forge mods\build\resources\main\mcmod.info'. * Try: Run with --stacktrace option to get the stack trace. Run with --info or --debug option to get more log output. BUILD FAILED Total time: 27.133 secs The mcmod.info file does exist in the src/main/resources directory.
×
×
  • Create New...

Important Information

By using this site, you agree to our Privacy Policy.