Jump to content

[1.12.2] Gradlew SetupDecompWorkspace cannot complete


Lambda

Recommended Posts

Hello, so I've decided to start updating my mod to 1.12.2, however, I am running into an issue while trying to decompiling minecraft:

Spoiler

PS D:\Minecraft_Workspace\forge_versions\plentifulutils> ./gradlew setupDecompWorkspace
To honour the JVM settings for this build a new JVM will be forked. Please consider using the daemon: https://docs.gradle.org/2.14/userguide/gradle_daemon.html.

FAILURE: Build failed with an exception.

* What went wrong:
A problem occurred configuring root project 'plentifulutils'.
> Could not resolve all dependencies for configuration ':classpath'.
   > Could not resolve net.minecraftforge.gradle:ForgeGradle:2.3-SNAPSHOT.
     Required by:
         :plentifulutils:unspecified
      > Could not resolve net.minecraftforge.gradle:ForgeGradle:2.3-SNAPSHOT.
         > Unable to load Maven meta-data from https://files.minecraftforge.net/maven/net/minecraftforge/gradle/ForgeGradle/2.3-SNAPSHOT/maven-metadata.xml.
            > Could not GET 'https://files.minecraftforge.net/maven/net/minecraftforge/gradle/ForgeGradle/2.3-SNAPSHOT/maven-metadata.xml'.
               > sun.security.validator.ValidatorException: PKIX path building failed: sun.security.provider.certpath.SunCertPathBuilderException: unable to find valid certification path to requested target

* Try:
Run with --stacktrace option to get the stack trace. Run with --info or --debug option to get more log output.

BUILD FAILED

Total time: 5.261 secs

 

 

I looked at past threads posted early November about the servers being down, is this still the case? Can I do something about this, or do I have to wait?

 

Thanks.

Relatively new to modding.

Currently developing:

https://github.com/LambdaXV/DynamicGenerators

Link to comment
Share on other sites

2 hours ago, diesieben07 said:

This looks like you are using an outdated Java version without the latest SSL certificates (probably Let's Encrypt).

 Update Java.

I went and updated all of my java versions, however, the same error still persists.

 

Relatively new to modding.

Currently developing:

https://github.com/LambdaXV/DynamicGenerators

Link to comment
Share on other sites

Edit: Nevermind. %JAVA_HOME% was set to an older version of jdk. After pointing it to jdk1.8.0_191, everything worked fine. Sorry.

 

It seems I have a similar problem.

 

Output of "java -version"

java version "1.8.0_191"
Java(TM) SE Runtime Environment (build 1.8.0_191-b12)
Java HotSpot(TM) 64-Bit Server VM (build 25.191-b12, mixed mode)

 

Log of "gradlew setupDecompWorkspace"

To honour the JVM settings for this build a new JVM will be forked. Please consider using the daemon: https://docs.gradle.org/2.14/userguide/gradle_daemon.html.
javax.net.ssl.SSLHandshakeException: sun.security.validator.ValidatorException: PKIX path building failed: sun.security.provider.certpath.SunCertPathBuilderException: unable to find valid certification path to requested target
        at sun.security.ssl.Alerts.getSSLException(Alerts.java:192)
        at sun.security.ssl.SSLSocketImpl.fatal(SSLSocketImpl.java:1949)
        at sun.security.ssl.Handshaker.fatalSE(Handshaker.java:302)
        at sun.security.ssl.Handshaker.fatalSE(Handshaker.java:296)
        at sun.security.ssl.ClientHandshaker.serverCertificate(ClientHandshaker.java:1509)
        at sun.security.ssl.ClientHandshaker.processMessage(ClientHandshaker.java:216)
        at sun.security.ssl.Handshaker.processLoop(Handshaker.java:979)
        at sun.security.ssl.Handshaker.process_record(Handshaker.java:914)
        at sun.security.ssl.SSLSocketImpl.readRecord(SSLSocketImpl.java:1062)
        at sun.security.ssl.SSLSocketImpl.performInitialHandshake(SSLSocketImpl.java:1375)
        at sun.security.ssl.SSLSocketImpl.startHandshake(SSLSocketImpl.java:1403)
        at sun.security.ssl.SSLSocketImpl.startHandshake(SSLSocketImpl.java:1387)
        at sun.net.www.protocol.https.HttpsClient.afterConnect(HttpsClient.java:559)
        at sun.net.www.protocol.https.AbstractDelegateHttpsURLConnection.connect(AbstractDelegateHttpsURLConnection.java:185)
        at sun.net.www.protocol.https.HttpsURLConnectionImpl.connect(HttpsURLConnectionImpl.java:153)
        at net.minecraftforge.gradle.common.BasePlugin.getWithEtag(BasePlugin.java:723)
        at net.minecraftforge.gradle.common.BasePlugin.getRemoteJsons(BasePlugin.java:226)
        at net.minecraftforge.gradle.common.BasePlugin.apply(BasePlugin.java:182)
        at net.minecraftforge.gradle.common.BasePlugin.apply(BasePlugin.java:91)
        at org.gradle.api.internal.plugins.ImperativeOnlyPluginApplicator.applyImperative(ImperativeOnlyPluginApplicator.java:35)
        at org.gradle.api.internal.plugins.RuleBasedPluginApplicator.applyImperative(RuleBasedPluginApplicator.java:43)
        at org.gradle.api.internal.plugins.DefaultPluginManager.doApply(DefaultPluginManager.java:137)
        at org.gradle.api.internal.plugins.DefaultPluginManager.apply(DefaultPluginManager.java:112)
        at org.gradle.api.internal.plugins.DefaultObjectConfigurationAction.applyType(DefaultObjectConfigurationAction.java:113)
        at org.gradle.api.internal.plugins.DefaultObjectConfigurationAction.access$200(DefaultObjectConfigurationAction.java:36)
        at org.gradle.api.internal.plugins.DefaultObjectConfigurationAction$3.run(DefaultObjectConfigurationAction.java:80)
        at org.gradle.api.internal.plugins.DefaultObjectConfigurationAction.execute(DefaultObjectConfigurationAction.java:136)
        at org.gradle.api.internal.project.AbstractPluginAware.apply(AbstractPluginAware.java:46)
        at org.gradle.api.internal.project.ProjectScript.apply(ProjectScript.java:34)
        at org.gradle.api.Script$apply$0.callCurrent(Unknown Source)
        at org.codehaus.groovy.runtime.callsite.CallSiteArray.defaultCallCurrent(CallSiteArray.java:52)
        at org.codehaus.groovy.runtime.callsite.AbstractCallSite.callCurrent(AbstractCallSite.java:154)
        at org.codehaus.groovy.runtime.callsite.AbstractCallSite.callCurrent(AbstractCallSite.java:166)
        at build_8i5zvxltfwmhv4vmq204dbmbn.run(D:\Bibliotheken\Dokumente\Minecraft Mod Projects\TestMod\build.gradle:10)
        at org.gradle.groovy.scripts.internal.DefaultScriptRunnerFactory$ScriptRunnerImpl.run(DefaultScriptRunnerFactory.java:91)
        at org.gradle.configuration.DefaultScriptPluginFactory$ScriptPluginImpl$2.run(DefaultScriptPluginFactory.java:177)
        at org.gradle.configuration.ProjectScriptTarget.addConfiguration(ProjectScriptTarget.java:77)
        at org.gradle.configuration.DefaultScriptPluginFactory$ScriptPluginImpl.apply(DefaultScriptPluginFactory.java:182)
        at org.gradle.configuration.project.BuildScriptProcessor.execute(BuildScriptProcessor.java:38)
        at org.gradle.configuration.project.BuildScriptProcessor.execute(BuildScriptProcessor.java:25)
        at org.gradle.configuration.project.ConfigureActionsProjectEvaluator.evaluate(ConfigureActionsProjectEvaluator.java:34)
        at org.gradle.configuration.project.LifecycleProjectEvaluator.evaluate(LifecycleProjectEvaluator.java:55)
        at org.gradle.api.internal.project.AbstractProject.evaluate(AbstractProject.java:540)
        at org.gradle.api.internal.project.AbstractProject.evaluate(AbstractProject.java:93)
        at org.gradle.execution.TaskPathProjectEvaluator.configureHierarchy(TaskPathProjectEvaluator.java:42)
        at org.gradle.configuration.DefaultBuildConfigurer.configure(DefaultBuildConfigurer.java:35)
        at org.gradle.initialization.DefaultGradleLauncher$2.run(DefaultGradleLauncher.java:124)
        at org.gradle.internal.Factories$1.create(Factories.java:22)
        at org.gradle.internal.progress.DefaultBuildOperationExecutor.run(DefaultBuildOperationExecutor.java:91)
        at org.gradle.internal.progress.DefaultBuildOperationExecutor.run(DefaultBuildOperationExecutor.java:53)
        at org.gradle.initialization.DefaultGradleLauncher.doBuildStages(DefaultGradleLauncher.java:121)
        at org.gradle.initialization.DefaultGradleLauncher.access$200(DefaultGradleLauncher.java:32)
        at org.gradle.initialization.DefaultGradleLauncher$1.create(DefaultGradleLauncher.java:98)
        at org.gradle.initialization.DefaultGradleLauncher$1.create(DefaultGradleLauncher.java:92)
        at org.gradle.internal.progress.DefaultBuildOperationExecutor.run(DefaultBuildOperationExecutor.java:91)
        at org.gradle.internal.progress.DefaultBuildOperationExecutor.run(DefaultBuildOperationExecutor.java:63)
        at org.gradle.initialization.DefaultGradleLauncher.doBuild(DefaultGradleLauncher.java:92)
        at org.gradle.initialization.DefaultGradleLauncher.run(DefaultGradleLauncher.java:83)
        at org.gradle.launcher.exec.InProcessBuildActionExecuter$DefaultBuildController.run(InProcessBuildActionExecuter.java:99)
        at org.gradle.tooling.internal.provider.ExecuteBuildActionRunner.run(ExecuteBuildActionRunner.java:28)
        at org.gradle.launcher.exec.ChainingBuildActionRunner.run(ChainingBuildActionRunner.java:35)
        at org.gradle.launcher.exec.InProcessBuildActionExecuter.execute(InProcessBuildActionExecuter.java:48)
        at org.gradle.launcher.exec.InProcessBuildActionExecuter.execute(InProcessBuildActionExecuter.java:30)
        at org.gradle.launcher.exec.ContinuousBuildActionExecuter.execute(ContinuousBuildActionExecuter.java:81)
        at org.gradle.launcher.exec.ContinuousBuildActionExecuter.execute(ContinuousBuildActionExecuter.java:46)
        at org.gradle.launcher.daemon.server.exec.ExecuteBuild.doBuild(ExecuteBuild.java:52)
        at org.gradle.launcher.daemon.server.exec.BuildCommandOnly.execute(BuildCommandOnly.java:36)
        at org.gradle.launcher.daemon.server.api.DaemonCommandExecution.proceed(DaemonCommandExecution.java:120)
        at org.gradle.launcher.daemon.server.exec.WatchForDisconnection.execute(WatchForDisconnection.java:37)
        at org.gradle.launcher.daemon.server.api.DaemonCommandExecution.proceed(DaemonCommandExecution.java:120)
        at org.gradle.launcher.daemon.server.exec.ResetDeprecationLogger.execute(ResetDeprecationLogger.java:26)
        at org.gradle.launcher.daemon.server.api.DaemonCommandExecution.proceed(DaemonCommandExecution.java:120)
        at org.gradle.launcher.daemon.server.exec.RequestStopIfSingleUsedDaemon.execute(RequestStopIfSingleUsedDaemon.java:34)
        at org.gradle.launcher.daemon.server.api.DaemonCommandExecution.proceed(DaemonCommandExecution.java:120)
        at org.gradle.launcher.daemon.server.exec.ForwardClientInput$2.call(ForwardClientInput.java:74)
        at org.gradle.launcher.daemon.server.exec.ForwardClientInput$2.call(ForwardClientInput.java:72)
        at org.gradle.util.Swapper.swap(Swapper.java:38)
        at org.gradle.launcher.daemon.server.exec.ForwardClientInput.execute(ForwardClientInput.java:72)
        at org.gradle.launcher.daemon.server.api.DaemonCommandExecution.proceed(DaemonCommandExecution.java:120)
        at org.gradle.launcher.daemon.server.health.DaemonHealthTracker.execute(DaemonHealthTracker.java:40)
        at org.gradle.launcher.daemon.server.api.DaemonCommandExecution.proceed(DaemonCommandExecution.java:120)
        at org.gradle.launcher.daemon.server.exec.LogToClient.doBuild(LogToClient.java:60)
        at org.gradle.launcher.daemon.server.exec.BuildCommandOnly.execute(BuildCommandOnly.java:36)
        at org.gradle.launcher.daemon.server.api.DaemonCommandExecution.proceed(DaemonCommandExecution.java:120)
        at org.gradle.launcher.daemon.server.exec.EstablishBuildEnvironment.doBuild(EstablishBuildEnvironment.java:72)
        at org.gradle.launcher.daemon.server.exec.BuildCommandOnly.execute(BuildCommandOnly.java:36)
        at org.gradle.launcher.daemon.server.api.DaemonCommandExecution.proceed(DaemonCommandExecution.java:120)
        at org.gradle.launcher.daemon.server.health.HintGCAfterBuild.execute(HintGCAfterBuild.java:41)
        at org.gradle.launcher.daemon.server.api.DaemonCommandExecution.proceed(DaemonCommandExecution.java:120)
        at org.gradle.launcher.daemon.server.exec.StartBuildOrRespondWithBusy$1.run(StartBuildOrRespondWithBusy.java:50)
        at org.gradle.launcher.daemon.server.DaemonStateCoordinator$1.run(DaemonStateCoordinator.java:237)
        at org.gradle.internal.concurrent.ExecutorPolicy$CatchAndRecordFailures.onExecute(ExecutorPolicy.java:54)
        at org.gradle.internal.concurrent.StoppableExecutorImpl$1.run(StoppableExecutorImpl.java:40)
        at java.util.concurrent.ThreadPoolExecutor.runWorker(ThreadPoolExecutor.java:1142)
        at java.util.concurrent.ThreadPoolExecutor$Worker.run(ThreadPoolExecutor.java:617)
        at java.lang.Thread.run(Thread.java:745)
Caused by: sun.security.validator.ValidatorException: PKIX path building failed: sun.security.provider.certpath.SunCertPathBuilderException: unable to find valid certification path to requested target
        at sun.security.validator.PKIXValidator.doBuild(PKIXValidator.java:387)
        at sun.security.validator.PKIXValidator.engineValidate(PKIXValidator.java:292)
        at sun.security.validator.Validator.validate(Validator.java:260)
        at sun.security.ssl.X509TrustManagerImpl.validate(X509TrustManagerImpl.java:324)
        at sun.security.ssl.X509TrustManagerImpl.checkTrusted(X509TrustManagerImpl.java:229)
        at sun.security.ssl.X509TrustManagerImpl.checkServerTrusted(X509TrustManagerImpl.java:124)
        at sun.security.ssl.ClientHandshaker.serverCertificate(ClientHandshaker.java:1491)
        ... 91 more
Caused by: sun.security.provider.certpath.SunCertPathBuilderException: unable to find valid certification path to requested target
        at sun.security.provider.certpath.SunCertPathBuilder.build(SunCertPathBuilder.java:146)
        at sun.security.provider.certpath.SunCertPathBuilder.engineBuild(SunCertPathBuilder.java:131)
        at java.security.cert.CertPathBuilder.build(CertPathBuilder.java:280)
        at sun.security.validator.PKIXValidator.doBuild(PKIXValidator.java:382)
        ... 97 more
javax.net.ssl.SSLHandshakeException: sun.security.validator.ValidatorException: PKIX path building failed: sun.security.provider.certpath.SunCertPathBuilderException: unable to find valid certification path to requested target
        at sun.security.ssl.Alerts.getSSLException(Alerts.java:192)
        at sun.security.ssl.SSLSocketImpl.fatal(SSLSocketImpl.java:1949)
        at sun.security.ssl.Handshaker.fatalSE(Handshaker.java:302)
        at sun.security.ssl.Handshaker.fatalSE(Handshaker.java:296)
        at sun.security.ssl.ClientHandshaker.serverCertificate(ClientHandshaker.java:1509)
        at sun.security.ssl.ClientHandshaker.processMessage(ClientHandshaker.java:216)
        at sun.security.ssl.Handshaker.processLoop(Handshaker.java:979)
        at sun.security.ssl.Handshaker.process_record(Handshaker.java:914)
        at sun.security.ssl.SSLSocketImpl.readRecord(SSLSocketImpl.java:1062)
        at sun.security.ssl.SSLSocketImpl.performInitialHandshake(SSLSocketImpl.java:1375)
        at sun.security.ssl.SSLSocketImpl.startHandshake(SSLSocketImpl.java:1403)
        at sun.security.ssl.SSLSocketImpl.startHandshake(SSLSocketImpl.java:1387)
        at sun.net.www.protocol.https.HttpsClient.afterConnect(HttpsClient.java:559)
        at sun.net.www.protocol.https.AbstractDelegateHttpsURLConnection.connect(AbstractDelegateHttpsURLConnection.java:185)
        at sun.net.www.protocol.https.HttpsURLConnectionImpl.connect(HttpsURLConnectionImpl.java:153)
        at net.minecraftforge.gradle.common.BasePlugin.getWithEtag(BasePlugin.java:723)
        at net.minecraftforge.gradle.common.BasePlugin.getWithEtag(BasePlugin.java:684)
        at net.minecraftforge.gradle.user.patcherUser.forge.ForgePlugin.setForgeVersionJson(ForgePlugin.java:159)
        at net.minecraftforge.gradle.user.patcherUser.forge.ForgePlugin.applyUserPlugin(ForgePlugin.java:56)
        at net.minecraftforge.gradle.user.UserBasePlugin.applyPlugin(UserBasePlugin.java:171)
        at net.minecraftforge.gradle.common.BasePlugin.apply(BasePlugin.java:214)
        at net.minecraftforge.gradle.common.BasePlugin.apply(BasePlugin.java:91)
        at org.gradle.api.internal.plugins.ImperativeOnlyPluginApplicator.applyImperative(ImperativeOnlyPluginApplicator.java:35)
        at org.gradle.api.internal.plugins.RuleBasedPluginApplicator.applyImperative(RuleBasedPluginApplicator.java:43)
        at org.gradle.api.internal.plugins.DefaultPluginManager.doApply(DefaultPluginManager.java:137)
        at org.gradle.api.internal.plugins.DefaultPluginManager.apply(DefaultPluginManager.java:112)
        at org.gradle.api.internal.plugins.DefaultObjectConfigurationAction.applyType(DefaultObjectConfigurationAction.java:113)
        at org.gradle.api.internal.plugins.DefaultObjectConfigurationAction.access$200(DefaultObjectConfigurationAction.java:36)
        at org.gradle.api.internal.plugins.DefaultObjectConfigurationAction$3.run(DefaultObjectConfigurationAction.java:80)
        at org.gradle.api.internal.plugins.DefaultObjectConfigurationAction.execute(DefaultObjectConfigurationAction.java:136)
        at org.gradle.api.internal.project.AbstractPluginAware.apply(AbstractPluginAware.java:46)
        at org.gradle.api.internal.project.ProjectScript.apply(ProjectScript.java:34)
        at org.gradle.api.Script$apply$0.callCurrent(Unknown Source)
        at org.codehaus.groovy.runtime.callsite.CallSiteArray.defaultCallCurrent(CallSiteArray.java:52)
        at org.codehaus.groovy.runtime.callsite.AbstractCallSite.callCurrent(AbstractCallSite.java:154)
        at org.codehaus.groovy.runtime.callsite.AbstractCallSite.callCurrent(AbstractCallSite.java:166)
        at build_8i5zvxltfwmhv4vmq204dbmbn.run(D:\Bibliotheken\Dokumente\Minecraft Mod Projects\TestMod\build.gradle:10)
        at org.gradle.groovy.scripts.internal.DefaultScriptRunnerFactory$ScriptRunnerImpl.run(DefaultScriptRunnerFactory.java:91)
        at org.gradle.configuration.DefaultScriptPluginFactory$ScriptPluginImpl$2.run(DefaultScriptPluginFactory.java:177)
        at org.gradle.configuration.ProjectScriptTarget.addConfiguration(ProjectScriptTarget.java:77)
        at org.gradle.configuration.DefaultScriptPluginFactory$ScriptPluginImpl.apply(DefaultScriptPluginFactory.java:182)
        at org.gradle.configuration.project.BuildScriptProcessor.execute(BuildScriptProcessor.java:38)
        at org.gradle.configuration.project.BuildScriptProcessor.execute(BuildScriptProcessor.java:25)
        at org.gradle.configuration.project.ConfigureActionsProjectEvaluator.evaluate(ConfigureActionsProjectEvaluator.java:34)
        at org.gradle.configuration.project.LifecycleProjectEvaluator.evaluate(LifecycleProjectEvaluator.java:55)
        at org.gradle.api.internal.project.AbstractProject.evaluate(AbstractProject.java:540)
        at org.gradle.api.internal.project.AbstractProject.evaluate(AbstractProject.java:93)
        at org.gradle.execution.TaskPathProjectEvaluator.configureHierarchy(TaskPathProjectEvaluator.java:42)
        at org.gradle.configuration.DefaultBuildConfigurer.configure(DefaultBuildConfigurer.java:35)
        at org.gradle.initialization.DefaultGradleLauncher$2.run(DefaultGradleLauncher.java:124)
        at org.gradle.internal.Factories$1.create(Factories.java:22)
        at org.gradle.internal.progress.DefaultBuildOperationExecutor.run(DefaultBuildOperationExecutor.java:91)
        at org.gradle.internal.progress.DefaultBuildOperationExecutor.run(DefaultBuildOperationExecutor.java:53)
        at org.gradle.initialization.DefaultGradleLauncher.doBuildStages(DefaultGradleLauncher.java:121)
        at org.gradle.initialization.DefaultGradleLauncher.access$200(DefaultGradleLauncher.java:32)
        at org.gradle.initialization.DefaultGradleLauncher$1.create(DefaultGradleLauncher.java:98)
        at org.gradle.initialization.DefaultGradleLauncher$1.create(DefaultGradleLauncher.java:92)
        at org.gradle.internal.progress.DefaultBuildOperationExecutor.run(DefaultBuildOperationExecutor.java:91)
        at org.gradle.internal.progress.DefaultBuildOperationExecutor.run(DefaultBuildOperationExecutor.java:63)
        at org.gradle.initialization.DefaultGradleLauncher.doBuild(DefaultGradleLauncher.java:92)
        at org.gradle.initialization.DefaultGradleLauncher.run(DefaultGradleLauncher.java:83)
        at org.gradle.launcher.exec.InProcessBuildActionExecuter$DefaultBuildController.run(InProcessBuildActionExecuter.java:99)
        at org.gradle.tooling.internal.provider.ExecuteBuildActionRunner.run(ExecuteBuildActionRunner.java:28)
        at org.gradle.launcher.exec.ChainingBuildActionRunner.run(ChainingBuildActionRunner.java:35)
        at org.gradle.launcher.exec.InProcessBuildActionExecuter.execute(InProcessBuildActionExecuter.java:48)
        at org.gradle.launcher.exec.InProcessBuildActionExecuter.execute(InProcessBuildActionExecuter.java:30)
        at org.gradle.launcher.exec.ContinuousBuildActionExecuter.execute(ContinuousBuildActionExecuter.java:81)
        at org.gradle.launcher.exec.ContinuousBuildActionExecuter.execute(ContinuousBuildActionExecuter.java:46)
        at org.gradle.launcher.daemon.server.exec.ExecuteBuild.doBuild(ExecuteBuild.java:52)
        at org.gradle.launcher.daemon.server.exec.BuildCommandOnly.execute(BuildCommandOnly.java:36)
        at org.gradle.launcher.daemon.server.api.DaemonCommandExecution.proceed(DaemonCommandExecution.java:120)
        at org.gradle.launcher.daemon.server.exec.WatchForDisconnection.execute(WatchForDisconnection.java:37)
        at org.gradle.launcher.daemon.server.api.DaemonCommandExecution.proceed(DaemonCommandExecution.java:120)
        at org.gradle.launcher.daemon.server.exec.ResetDeprecationLogger.execute(ResetDeprecationLogger.java:26)
        at org.gradle.launcher.daemon.server.api.DaemonCommandExecution.proceed(DaemonCommandExecution.java:120)
        at org.gradle.launcher.daemon.server.exec.RequestStopIfSingleUsedDaemon.execute(RequestStopIfSingleUsedDaemon.java:34)
        at org.gradle.launcher.daemon.server.api.DaemonCommandExecution.proceed(DaemonCommandExecution.java:120)
        at org.gradle.launcher.daemon.server.exec.ForwardClientInput$2.call(ForwardClientInput.java:74)
        at org.gradle.launcher.daemon.server.exec.ForwardClientInput$2.call(ForwardClientInput.java:72)
        at org.gradle.util.Swapper.swap(Swapper.java:38)
        at org.gradle.launcher.daemon.server.exec.ForwardClientInput.execute(ForwardClientInput.java:72)
        at org.gradle.launcher.daemon.server.api.DaemonCommandExecution.proceed(DaemonCommandExecution.java:120)
        at org.gradle.launcher.daemon.server.health.DaemonHealthTracker.execute(DaemonHealthTracker.java:40)
        at org.gradle.launcher.daemon.server.api.DaemonCommandExecution.proceed(DaemonCommandExecution.java:120)
        at org.gradle.launcher.daemon.server.exec.LogToClient.doBuild(LogToClient.java:60)
        at org.gradle.launcher.daemon.server.exec.BuildCommandOnly.execute(BuildCommandOnly.java:36)
        at org.gradle.launcher.daemon.server.api.DaemonCommandExecution.proceed(DaemonCommandExecution.java:120)
        at org.gradle.launcher.daemon.server.exec.EstablishBuildEnvironment.doBuild(EstablishBuildEnvironment.java:72)
        at org.gradle.launcher.daemon.server.exec.BuildCommandOnly.execute(BuildCommandOnly.java:36)
        at org.gradle.launcher.daemon.server.api.DaemonCommandExecution.proceed(DaemonCommandExecution.java:120)
        at org.gradle.launcher.daemon.server.health.HintGCAfterBuild.execute(HintGCAfterBuild.java:41)
        at org.gradle.launcher.daemon.server.api.DaemonCommandExecution.proceed(DaemonCommandExecution.java:120)
        at org.gradle.launcher.daemon.server.exec.StartBuildOrRespondWithBusy$1.run(StartBuildOrRespondWithBusy.java:50)
        at org.gradle.launcher.daemon.server.DaemonStateCoordinator$1.run(DaemonStateCoordinator.java:237)
        at org.gradle.internal.concurrent.ExecutorPolicy$CatchAndRecordFailures.onExecute(ExecutorPolicy.java:54)
        at org.gradle.internal.concurrent.StoppableExecutorImpl$1.run(StoppableExecutorImpl.java:40)
        at java.util.concurrent.ThreadPoolExecutor.runWorker(ThreadPoolExecutor.java:1142)
        at java.util.concurrent.ThreadPoolExecutor$Worker.run(ThreadPoolExecutor.java:617)
        at java.lang.Thread.run(Thread.java:745)
Caused by: sun.security.validator.ValidatorException: PKIX path building failed: sun.security.provider.certpath.SunCertPathBuilderException: unable to find valid certification path to requested target
        at sun.security.validator.PKIXValidator.doBuild(PKIXValidator.java:387)
        at sun.security.validator.PKIXValidator.engineValidate(PKIXValidator.java:292)
        at sun.security.validator.Validator.validate(Validator.java:260)
        at sun.security.ssl.X509TrustManagerImpl.validate(X509TrustManagerImpl.java:324)
        at sun.security.ssl.X509TrustManagerImpl.checkTrusted(X509TrustManagerImpl.java:229)
        at sun.security.ssl.X509TrustManagerImpl.checkServerTrusted(X509TrustManagerImpl.java:124)
        at sun.security.ssl.ClientHandshaker.serverCertificate(ClientHandshaker.java:1491)
        ... 94 more
Caused by: sun.security.provider.certpath.SunCertPathBuilderException: unable to find valid certification path to requested target
        at sun.security.provider.certpath.SunCertPathBuilder.build(SunCertPathBuilder.java:146)
        at sun.security.provider.certpath.SunCertPathBuilder.engineBuild(SunCertPathBuilder.java:131)
        at java.security.cert.CertPathBuilder.build(CertPathBuilder.java:280)
        at sun.security.validator.PKIXValidator.doBuild(PKIXValidator.java:382)
        ... 100 more

FAILURE: Build failed with an exception.

* Where:
Build file 'D:\Bibliotheken\Dokumente\Minecraft Mod Projects\TestMod\build.gradle' line: 10

* What went wrong:
A problem occurred evaluating root project 'TestMod'.
> Failed to apply plugin [id 'net.minecraftforge.gradle.forge']
   > Unable to obtain url ([https://files.minecraftforge.net/maven/net/minecraftforge/forge/json]) with etag!

* Try:
Run with --stacktrace option to get the stack trace. Run with --info or --debug option to get more log output.

BUILD FAILED

Total time: 8.226 secs

 

I was using the unchanged MDK from https://files.minecraftforge.net/.

 

I have no experience with certificates, but it seems that the root certificate "DST Root CA X3" is in my java certificate store, so that shouldn't be the problem, right?

Edited by snowrabbit007
Link to comment
Share on other sites

1 hour ago, snowrabbit007 said:

Edit: Nevermind. %JAVA_HOME% was set to an older version of jdk. After pointing it to jdk1.8.0_191, everything worked fine. Sorry.

 

It seems I have a similar problem.

 

Output of "java -version"


java version "1.8.0_191"
Java(TM) SE Runtime Environment (build 1.8.0_191-b12)
Java HotSpot(TM) 64-Bit Server VM (build 25.191-b12, mixed mode)

 

Log of "gradlew setupDecompWorkspace"


To honour the JVM settings for this build a new JVM will be forked. Please consider using the daemon: https://docs.gradle.org/2.14/userguide/gradle_daemon.html.
javax.net.ssl.SSLHandshakeException: sun.security.validator.ValidatorException: PKIX path building failed: sun.security.provider.certpath.SunCertPathBuilderException: unable to find valid certification path to requested target
        at sun.security.ssl.Alerts.getSSLException(Alerts.java:192)
        at sun.security.ssl.SSLSocketImpl.fatal(SSLSocketImpl.java:1949)
        at sun.security.ssl.Handshaker.fatalSE(Handshaker.java:302)
        at sun.security.ssl.Handshaker.fatalSE(Handshaker.java:296)
        at sun.security.ssl.ClientHandshaker.serverCertificate(ClientHandshaker.java:1509)
        at sun.security.ssl.ClientHandshaker.processMessage(ClientHandshaker.java:216)
        at sun.security.ssl.Handshaker.processLoop(Handshaker.java:979)
        at sun.security.ssl.Handshaker.process_record(Handshaker.java:914)
        at sun.security.ssl.SSLSocketImpl.readRecord(SSLSocketImpl.java:1062)
        at sun.security.ssl.SSLSocketImpl.performInitialHandshake(SSLSocketImpl.java:1375)
        at sun.security.ssl.SSLSocketImpl.startHandshake(SSLSocketImpl.java:1403)
        at sun.security.ssl.SSLSocketImpl.startHandshake(SSLSocketImpl.java:1387)
        at sun.net.www.protocol.https.HttpsClient.afterConnect(HttpsClient.java:559)
        at sun.net.www.protocol.https.AbstractDelegateHttpsURLConnection.connect(AbstractDelegateHttpsURLConnection.java:185)
        at sun.net.www.protocol.https.HttpsURLConnectionImpl.connect(HttpsURLConnectionImpl.java:153)
        at net.minecraftforge.gradle.common.BasePlugin.getWithEtag(BasePlugin.java:723)
        at net.minecraftforge.gradle.common.BasePlugin.getRemoteJsons(BasePlugin.java:226)
        at net.minecraftforge.gradle.common.BasePlugin.apply(BasePlugin.java:182)
        at net.minecraftforge.gradle.common.BasePlugin.apply(BasePlugin.java:91)
        at org.gradle.api.internal.plugins.ImperativeOnlyPluginApplicator.applyImperative(ImperativeOnlyPluginApplicator.java:35)
        at org.gradle.api.internal.plugins.RuleBasedPluginApplicator.applyImperative(RuleBasedPluginApplicator.java:43)
        at org.gradle.api.internal.plugins.DefaultPluginManager.doApply(DefaultPluginManager.java:137)
        at org.gradle.api.internal.plugins.DefaultPluginManager.apply(DefaultPluginManager.java:112)
        at org.gradle.api.internal.plugins.DefaultObjectConfigurationAction.applyType(DefaultObjectConfigurationAction.java:113)
        at org.gradle.api.internal.plugins.DefaultObjectConfigurationAction.access$200(DefaultObjectConfigurationAction.java:36)
        at org.gradle.api.internal.plugins.DefaultObjectConfigurationAction$3.run(DefaultObjectConfigurationAction.java:80)
        at org.gradle.api.internal.plugins.DefaultObjectConfigurationAction.execute(DefaultObjectConfigurationAction.java:136)
        at org.gradle.api.internal.project.AbstractPluginAware.apply(AbstractPluginAware.java:46)
        at org.gradle.api.internal.project.ProjectScript.apply(ProjectScript.java:34)
        at org.gradle.api.Script$apply$0.callCurrent(Unknown Source)
        at org.codehaus.groovy.runtime.callsite.CallSiteArray.defaultCallCurrent(CallSiteArray.java:52)
        at org.codehaus.groovy.runtime.callsite.AbstractCallSite.callCurrent(AbstractCallSite.java:154)
        at org.codehaus.groovy.runtime.callsite.AbstractCallSite.callCurrent(AbstractCallSite.java:166)
        at build_8i5zvxltfwmhv4vmq204dbmbn.run(D:\Bibliotheken\Dokumente\Minecraft Mod Projects\TestMod\build.gradle:10)
        at org.gradle.groovy.scripts.internal.DefaultScriptRunnerFactory$ScriptRunnerImpl.run(DefaultScriptRunnerFactory.java:91)
        at org.gradle.configuration.DefaultScriptPluginFactory$ScriptPluginImpl$2.run(DefaultScriptPluginFactory.java:177)
        at org.gradle.configuration.ProjectScriptTarget.addConfiguration(ProjectScriptTarget.java:77)
        at org.gradle.configuration.DefaultScriptPluginFactory$ScriptPluginImpl.apply(DefaultScriptPluginFactory.java:182)
        at org.gradle.configuration.project.BuildScriptProcessor.execute(BuildScriptProcessor.java:38)
        at org.gradle.configuration.project.BuildScriptProcessor.execute(BuildScriptProcessor.java:25)
        at org.gradle.configuration.project.ConfigureActionsProjectEvaluator.evaluate(ConfigureActionsProjectEvaluator.java:34)
        at org.gradle.configuration.project.LifecycleProjectEvaluator.evaluate(LifecycleProjectEvaluator.java:55)
        at org.gradle.api.internal.project.AbstractProject.evaluate(AbstractProject.java:540)
        at org.gradle.api.internal.project.AbstractProject.evaluate(AbstractProject.java:93)
        at org.gradle.execution.TaskPathProjectEvaluator.configureHierarchy(TaskPathProjectEvaluator.java:42)
        at org.gradle.configuration.DefaultBuildConfigurer.configure(DefaultBuildConfigurer.java:35)
        at org.gradle.initialization.DefaultGradleLauncher$2.run(DefaultGradleLauncher.java:124)
        at org.gradle.internal.Factories$1.create(Factories.java:22)
        at org.gradle.internal.progress.DefaultBuildOperationExecutor.run(DefaultBuildOperationExecutor.java:91)
        at org.gradle.internal.progress.DefaultBuildOperationExecutor.run(DefaultBuildOperationExecutor.java:53)
        at org.gradle.initialization.DefaultGradleLauncher.doBuildStages(DefaultGradleLauncher.java:121)
        at org.gradle.initialization.DefaultGradleLauncher.access$200(DefaultGradleLauncher.java:32)
        at org.gradle.initialization.DefaultGradleLauncher$1.create(DefaultGradleLauncher.java:98)
        at org.gradle.initialization.DefaultGradleLauncher$1.create(DefaultGradleLauncher.java:92)
        at org.gradle.internal.progress.DefaultBuildOperationExecutor.run(DefaultBuildOperationExecutor.java:91)
        at org.gradle.internal.progress.DefaultBuildOperationExecutor.run(DefaultBuildOperationExecutor.java:63)
        at org.gradle.initialization.DefaultGradleLauncher.doBuild(DefaultGradleLauncher.java:92)
        at org.gradle.initialization.DefaultGradleLauncher.run(DefaultGradleLauncher.java:83)
        at org.gradle.launcher.exec.InProcessBuildActionExecuter$DefaultBuildController.run(InProcessBuildActionExecuter.java:99)
        at org.gradle.tooling.internal.provider.ExecuteBuildActionRunner.run(ExecuteBuildActionRunner.java:28)
        at org.gradle.launcher.exec.ChainingBuildActionRunner.run(ChainingBuildActionRunner.java:35)
        at org.gradle.launcher.exec.InProcessBuildActionExecuter.execute(InProcessBuildActionExecuter.java:48)
        at org.gradle.launcher.exec.InProcessBuildActionExecuter.execute(InProcessBuildActionExecuter.java:30)
        at org.gradle.launcher.exec.ContinuousBuildActionExecuter.execute(ContinuousBuildActionExecuter.java:81)
        at org.gradle.launcher.exec.ContinuousBuildActionExecuter.execute(ContinuousBuildActionExecuter.java:46)
        at org.gradle.launcher.daemon.server.exec.ExecuteBuild.doBuild(ExecuteBuild.java:52)
        at org.gradle.launcher.daemon.server.exec.BuildCommandOnly.execute(BuildCommandOnly.java:36)
        at org.gradle.launcher.daemon.server.api.DaemonCommandExecution.proceed(DaemonCommandExecution.java:120)
        at org.gradle.launcher.daemon.server.exec.WatchForDisconnection.execute(WatchForDisconnection.java:37)
        at org.gradle.launcher.daemon.server.api.DaemonCommandExecution.proceed(DaemonCommandExecution.java:120)
        at org.gradle.launcher.daemon.server.exec.ResetDeprecationLogger.execute(ResetDeprecationLogger.java:26)
        at org.gradle.launcher.daemon.server.api.DaemonCommandExecution.proceed(DaemonCommandExecution.java:120)
        at org.gradle.launcher.daemon.server.exec.RequestStopIfSingleUsedDaemon.execute(RequestStopIfSingleUsedDaemon.java:34)
        at org.gradle.launcher.daemon.server.api.DaemonCommandExecution.proceed(DaemonCommandExecution.java:120)
        at org.gradle.launcher.daemon.server.exec.ForwardClientInput$2.call(ForwardClientInput.java:74)
        at org.gradle.launcher.daemon.server.exec.ForwardClientInput$2.call(ForwardClientInput.java:72)
        at org.gradle.util.Swapper.swap(Swapper.java:38)
        at org.gradle.launcher.daemon.server.exec.ForwardClientInput.execute(ForwardClientInput.java:72)
        at org.gradle.launcher.daemon.server.api.DaemonCommandExecution.proceed(DaemonCommandExecution.java:120)
        at org.gradle.launcher.daemon.server.health.DaemonHealthTracker.execute(DaemonHealthTracker.java:40)
        at org.gradle.launcher.daemon.server.api.DaemonCommandExecution.proceed(DaemonCommandExecution.java:120)
        at org.gradle.launcher.daemon.server.exec.LogToClient.doBuild(LogToClient.java:60)
        at org.gradle.launcher.daemon.server.exec.BuildCommandOnly.execute(BuildCommandOnly.java:36)
        at org.gradle.launcher.daemon.server.api.DaemonCommandExecution.proceed(DaemonCommandExecution.java:120)
        at org.gradle.launcher.daemon.server.exec.EstablishBuildEnvironment.doBuild(EstablishBuildEnvironment.java:72)
        at org.gradle.launcher.daemon.server.exec.BuildCommandOnly.execute(BuildCommandOnly.java:36)
        at org.gradle.launcher.daemon.server.api.DaemonCommandExecution.proceed(DaemonCommandExecution.java:120)
        at org.gradle.launcher.daemon.server.health.HintGCAfterBuild.execute(HintGCAfterBuild.java:41)
        at org.gradle.launcher.daemon.server.api.DaemonCommandExecution.proceed(DaemonCommandExecution.java:120)
        at org.gradle.launcher.daemon.server.exec.StartBuildOrRespondWithBusy$1.run(StartBuildOrRespondWithBusy.java:50)
        at org.gradle.launcher.daemon.server.DaemonStateCoordinator$1.run(DaemonStateCoordinator.java:237)
        at org.gradle.internal.concurrent.ExecutorPolicy$CatchAndRecordFailures.onExecute(ExecutorPolicy.java:54)
        at org.gradle.internal.concurrent.StoppableExecutorImpl$1.run(StoppableExecutorImpl.java:40)
        at java.util.concurrent.ThreadPoolExecutor.runWorker(ThreadPoolExecutor.java:1142)
        at java.util.concurrent.ThreadPoolExecutor$Worker.run(ThreadPoolExecutor.java:617)
        at java.lang.Thread.run(Thread.java:745)
Caused by: sun.security.validator.ValidatorException: PKIX path building failed: sun.security.provider.certpath.SunCertPathBuilderException: unable to find valid certification path to requested target
        at sun.security.validator.PKIXValidator.doBuild(PKIXValidator.java:387)
        at sun.security.validator.PKIXValidator.engineValidate(PKIXValidator.java:292)
        at sun.security.validator.Validator.validate(Validator.java:260)
        at sun.security.ssl.X509TrustManagerImpl.validate(X509TrustManagerImpl.java:324)
        at sun.security.ssl.X509TrustManagerImpl.checkTrusted(X509TrustManagerImpl.java:229)
        at sun.security.ssl.X509TrustManagerImpl.checkServerTrusted(X509TrustManagerImpl.java:124)
        at sun.security.ssl.ClientHandshaker.serverCertificate(ClientHandshaker.java:1491)
        ... 91 more
Caused by: sun.security.provider.certpath.SunCertPathBuilderException: unable to find valid certification path to requested target
        at sun.security.provider.certpath.SunCertPathBuilder.build(SunCertPathBuilder.java:146)
        at sun.security.provider.certpath.SunCertPathBuilder.engineBuild(SunCertPathBuilder.java:131)
        at java.security.cert.CertPathBuilder.build(CertPathBuilder.java:280)
        at sun.security.validator.PKIXValidator.doBuild(PKIXValidator.java:382)
        ... 97 more
javax.net.ssl.SSLHandshakeException: sun.security.validator.ValidatorException: PKIX path building failed: sun.security.provider.certpath.SunCertPathBuilderException: unable to find valid certification path to requested target
        at sun.security.ssl.Alerts.getSSLException(Alerts.java:192)
        at sun.security.ssl.SSLSocketImpl.fatal(SSLSocketImpl.java:1949)
        at sun.security.ssl.Handshaker.fatalSE(Handshaker.java:302)
        at sun.security.ssl.Handshaker.fatalSE(Handshaker.java:296)
        at sun.security.ssl.ClientHandshaker.serverCertificate(ClientHandshaker.java:1509)
        at sun.security.ssl.ClientHandshaker.processMessage(ClientHandshaker.java:216)
        at sun.security.ssl.Handshaker.processLoop(Handshaker.java:979)
        at sun.security.ssl.Handshaker.process_record(Handshaker.java:914)
        at sun.security.ssl.SSLSocketImpl.readRecord(SSLSocketImpl.java:1062)
        at sun.security.ssl.SSLSocketImpl.performInitialHandshake(SSLSocketImpl.java:1375)
        at sun.security.ssl.SSLSocketImpl.startHandshake(SSLSocketImpl.java:1403)
        at sun.security.ssl.SSLSocketImpl.startHandshake(SSLSocketImpl.java:1387)
        at sun.net.www.protocol.https.HttpsClient.afterConnect(HttpsClient.java:559)
        at sun.net.www.protocol.https.AbstractDelegateHttpsURLConnection.connect(AbstractDelegateHttpsURLConnection.java:185)
        at sun.net.www.protocol.https.HttpsURLConnectionImpl.connect(HttpsURLConnectionImpl.java:153)
        at net.minecraftforge.gradle.common.BasePlugin.getWithEtag(BasePlugin.java:723)
        at net.minecraftforge.gradle.common.BasePlugin.getWithEtag(BasePlugin.java:684)
        at net.minecraftforge.gradle.user.patcherUser.forge.ForgePlugin.setForgeVersionJson(ForgePlugin.java:159)
        at net.minecraftforge.gradle.user.patcherUser.forge.ForgePlugin.applyUserPlugin(ForgePlugin.java:56)
        at net.minecraftforge.gradle.user.UserBasePlugin.applyPlugin(UserBasePlugin.java:171)
        at net.minecraftforge.gradle.common.BasePlugin.apply(BasePlugin.java:214)
        at net.minecraftforge.gradle.common.BasePlugin.apply(BasePlugin.java:91)
        at org.gradle.api.internal.plugins.ImperativeOnlyPluginApplicator.applyImperative(ImperativeOnlyPluginApplicator.java:35)
        at org.gradle.api.internal.plugins.RuleBasedPluginApplicator.applyImperative(RuleBasedPluginApplicator.java:43)
        at org.gradle.api.internal.plugins.DefaultPluginManager.doApply(DefaultPluginManager.java:137)
        at org.gradle.api.internal.plugins.DefaultPluginManager.apply(DefaultPluginManager.java:112)
        at org.gradle.api.internal.plugins.DefaultObjectConfigurationAction.applyType(DefaultObjectConfigurationAction.java:113)
        at org.gradle.api.internal.plugins.DefaultObjectConfigurationAction.access$200(DefaultObjectConfigurationAction.java:36)
        at org.gradle.api.internal.plugins.DefaultObjectConfigurationAction$3.run(DefaultObjectConfigurationAction.java:80)
        at org.gradle.api.internal.plugins.DefaultObjectConfigurationAction.execute(DefaultObjectConfigurationAction.java:136)
        at org.gradle.api.internal.project.AbstractPluginAware.apply(AbstractPluginAware.java:46)
        at org.gradle.api.internal.project.ProjectScript.apply(ProjectScript.java:34)
        at org.gradle.api.Script$apply$0.callCurrent(Unknown Source)
        at org.codehaus.groovy.runtime.callsite.CallSiteArray.defaultCallCurrent(CallSiteArray.java:52)
        at org.codehaus.groovy.runtime.callsite.AbstractCallSite.callCurrent(AbstractCallSite.java:154)
        at org.codehaus.groovy.runtime.callsite.AbstractCallSite.callCurrent(AbstractCallSite.java:166)
        at build_8i5zvxltfwmhv4vmq204dbmbn.run(D:\Bibliotheken\Dokumente\Minecraft Mod Projects\TestMod\build.gradle:10)
        at org.gradle.groovy.scripts.internal.DefaultScriptRunnerFactory$ScriptRunnerImpl.run(DefaultScriptRunnerFactory.java:91)
        at org.gradle.configuration.DefaultScriptPluginFactory$ScriptPluginImpl$2.run(DefaultScriptPluginFactory.java:177)
        at org.gradle.configuration.ProjectScriptTarget.addConfiguration(ProjectScriptTarget.java:77)
        at org.gradle.configuration.DefaultScriptPluginFactory$ScriptPluginImpl.apply(DefaultScriptPluginFactory.java:182)
        at org.gradle.configuration.project.BuildScriptProcessor.execute(BuildScriptProcessor.java:38)
        at org.gradle.configuration.project.BuildScriptProcessor.execute(BuildScriptProcessor.java:25)
        at org.gradle.configuration.project.ConfigureActionsProjectEvaluator.evaluate(ConfigureActionsProjectEvaluator.java:34)
        at org.gradle.configuration.project.LifecycleProjectEvaluator.evaluate(LifecycleProjectEvaluator.java:55)
        at org.gradle.api.internal.project.AbstractProject.evaluate(AbstractProject.java:540)
        at org.gradle.api.internal.project.AbstractProject.evaluate(AbstractProject.java:93)
        at org.gradle.execution.TaskPathProjectEvaluator.configureHierarchy(TaskPathProjectEvaluator.java:42)
        at org.gradle.configuration.DefaultBuildConfigurer.configure(DefaultBuildConfigurer.java:35)
        at org.gradle.initialization.DefaultGradleLauncher$2.run(DefaultGradleLauncher.java:124)
        at org.gradle.internal.Factories$1.create(Factories.java:22)
        at org.gradle.internal.progress.DefaultBuildOperationExecutor.run(DefaultBuildOperationExecutor.java:91)
        at org.gradle.internal.progress.DefaultBuildOperationExecutor.run(DefaultBuildOperationExecutor.java:53)
        at org.gradle.initialization.DefaultGradleLauncher.doBuildStages(DefaultGradleLauncher.java:121)
        at org.gradle.initialization.DefaultGradleLauncher.access$200(DefaultGradleLauncher.java:32)
        at org.gradle.initialization.DefaultGradleLauncher$1.create(DefaultGradleLauncher.java:98)
        at org.gradle.initialization.DefaultGradleLauncher$1.create(DefaultGradleLauncher.java:92)
        at org.gradle.internal.progress.DefaultBuildOperationExecutor.run(DefaultBuildOperationExecutor.java:91)
        at org.gradle.internal.progress.DefaultBuildOperationExecutor.run(DefaultBuildOperationExecutor.java:63)
        at org.gradle.initialization.DefaultGradleLauncher.doBuild(DefaultGradleLauncher.java:92)
        at org.gradle.initialization.DefaultGradleLauncher.run(DefaultGradleLauncher.java:83)
        at org.gradle.launcher.exec.InProcessBuildActionExecuter$DefaultBuildController.run(InProcessBuildActionExecuter.java:99)
        at org.gradle.tooling.internal.provider.ExecuteBuildActionRunner.run(ExecuteBuildActionRunner.java:28)
        at org.gradle.launcher.exec.ChainingBuildActionRunner.run(ChainingBuildActionRunner.java:35)
        at org.gradle.launcher.exec.InProcessBuildActionExecuter.execute(InProcessBuildActionExecuter.java:48)
        at org.gradle.launcher.exec.InProcessBuildActionExecuter.execute(InProcessBuildActionExecuter.java:30)
        at org.gradle.launcher.exec.ContinuousBuildActionExecuter.execute(ContinuousBuildActionExecuter.java:81)
        at org.gradle.launcher.exec.ContinuousBuildActionExecuter.execute(ContinuousBuildActionExecuter.java:46)
        at org.gradle.launcher.daemon.server.exec.ExecuteBuild.doBuild(ExecuteBuild.java:52)
        at org.gradle.launcher.daemon.server.exec.BuildCommandOnly.execute(BuildCommandOnly.java:36)
        at org.gradle.launcher.daemon.server.api.DaemonCommandExecution.proceed(DaemonCommandExecution.java:120)
        at org.gradle.launcher.daemon.server.exec.WatchForDisconnection.execute(WatchForDisconnection.java:37)
        at org.gradle.launcher.daemon.server.api.DaemonCommandExecution.proceed(DaemonCommandExecution.java:120)
        at org.gradle.launcher.daemon.server.exec.ResetDeprecationLogger.execute(ResetDeprecationLogger.java:26)
        at org.gradle.launcher.daemon.server.api.DaemonCommandExecution.proceed(DaemonCommandExecution.java:120)
        at org.gradle.launcher.daemon.server.exec.RequestStopIfSingleUsedDaemon.execute(RequestStopIfSingleUsedDaemon.java:34)
        at org.gradle.launcher.daemon.server.api.DaemonCommandExecution.proceed(DaemonCommandExecution.java:120)
        at org.gradle.launcher.daemon.server.exec.ForwardClientInput$2.call(ForwardClientInput.java:74)
        at org.gradle.launcher.daemon.server.exec.ForwardClientInput$2.call(ForwardClientInput.java:72)
        at org.gradle.util.Swapper.swap(Swapper.java:38)
        at org.gradle.launcher.daemon.server.exec.ForwardClientInput.execute(ForwardClientInput.java:72)
        at org.gradle.launcher.daemon.server.api.DaemonCommandExecution.proceed(DaemonCommandExecution.java:120)
        at org.gradle.launcher.daemon.server.health.DaemonHealthTracker.execute(DaemonHealthTracker.java:40)
        at org.gradle.launcher.daemon.server.api.DaemonCommandExecution.proceed(DaemonCommandExecution.java:120)
        at org.gradle.launcher.daemon.server.exec.LogToClient.doBuild(LogToClient.java:60)
        at org.gradle.launcher.daemon.server.exec.BuildCommandOnly.execute(BuildCommandOnly.java:36)
        at org.gradle.launcher.daemon.server.api.DaemonCommandExecution.proceed(DaemonCommandExecution.java:120)
        at org.gradle.launcher.daemon.server.exec.EstablishBuildEnvironment.doBuild(EstablishBuildEnvironment.java:72)
        at org.gradle.launcher.daemon.server.exec.BuildCommandOnly.execute(BuildCommandOnly.java:36)
        at org.gradle.launcher.daemon.server.api.DaemonCommandExecution.proceed(DaemonCommandExecution.java:120)
        at org.gradle.launcher.daemon.server.health.HintGCAfterBuild.execute(HintGCAfterBuild.java:41)
        at org.gradle.launcher.daemon.server.api.DaemonCommandExecution.proceed(DaemonCommandExecution.java:120)
        at org.gradle.launcher.daemon.server.exec.StartBuildOrRespondWithBusy$1.run(StartBuildOrRespondWithBusy.java:50)
        at org.gradle.launcher.daemon.server.DaemonStateCoordinator$1.run(DaemonStateCoordinator.java:237)
        at org.gradle.internal.concurrent.ExecutorPolicy$CatchAndRecordFailures.onExecute(ExecutorPolicy.java:54)
        at org.gradle.internal.concurrent.StoppableExecutorImpl$1.run(StoppableExecutorImpl.java:40)
        at java.util.concurrent.ThreadPoolExecutor.runWorker(ThreadPoolExecutor.java:1142)
        at java.util.concurrent.ThreadPoolExecutor$Worker.run(ThreadPoolExecutor.java:617)
        at java.lang.Thread.run(Thread.java:745)
Caused by: sun.security.validator.ValidatorException: PKIX path building failed: sun.security.provider.certpath.SunCertPathBuilderException: unable to find valid certification path to requested target
        at sun.security.validator.PKIXValidator.doBuild(PKIXValidator.java:387)
        at sun.security.validator.PKIXValidator.engineValidate(PKIXValidator.java:292)
        at sun.security.validator.Validator.validate(Validator.java:260)
        at sun.security.ssl.X509TrustManagerImpl.validate(X509TrustManagerImpl.java:324)
        at sun.security.ssl.X509TrustManagerImpl.checkTrusted(X509TrustManagerImpl.java:229)
        at sun.security.ssl.X509TrustManagerImpl.checkServerTrusted(X509TrustManagerImpl.java:124)
        at sun.security.ssl.ClientHandshaker.serverCertificate(ClientHandshaker.java:1491)
        ... 94 more
Caused by: sun.security.provider.certpath.SunCertPathBuilderException: unable to find valid certification path to requested target
        at sun.security.provider.certpath.SunCertPathBuilder.build(SunCertPathBuilder.java:146)
        at sun.security.provider.certpath.SunCertPathBuilder.engineBuild(SunCertPathBuilder.java:131)
        at java.security.cert.CertPathBuilder.build(CertPathBuilder.java:280)
        at sun.security.validator.PKIXValidator.doBuild(PKIXValidator.java:382)
        ... 100 more

FAILURE: Build failed with an exception.

* Where:
Build file 'D:\Bibliotheken\Dokumente\Minecraft Mod Projects\TestMod\build.gradle' line: 10

* What went wrong:
A problem occurred evaluating root project 'TestMod'.
> Failed to apply plugin [id 'net.minecraftforge.gradle.forge']
   > Unable to obtain url ([https://files.minecraftforge.net/maven/net/minecraftforge/forge/json]) with etag!

* Try:
Run with --stacktrace option to get the stack trace. Run with --info or --debug option to get more log output.

BUILD FAILED

Total time: 8.226 secs

 

I was using the unchanged MDK from https://files.minecraftforge.net/.

 

I have no experience with certificates, but it seems that the root certificate "DST Root CA X3" is in my java certificate store, so that shouldn't be the problem, right?

 

 

This also solved my problem. I appreciate you posting back on this. Thanks.

 

Relatively new to modding.

Currently developing:

https://github.com/LambdaXV/DynamicGenerators

Link to comment
Share on other sites

Join the conversation

You can post now and register later. If you have an account, sign in now to post with your account.
Note: Your post will require moderator approval before it will be visible.

Guest
Unfortunately, your content contains terms that we do not allow. Please edit your content to remove the highlighted words below.
Reply to this topic...

×   Pasted as rich text.   Restore formatting

  Only 75 emoji are allowed.

×   Your link has been automatically embedded.   Display as a link instead

×   Your previous content has been restored.   Clear editor

×   You cannot paste images directly. Upload or insert images from URL.



×
×
  • Create New...

Important Information

By using this site, you agree to our Terms of Use.