Jump to content

Recommended Posts

Posted

hey! i'm quite new to modding for minecraft but decided i wanted to try it out. i was following a tutorial and it all went well until i tried the runClient task. how do i fix this?

 

FAILURE: Build failed with an exception.

* What went wrong:
Execution failed for task ':runClient'.
> Process 'command 'C:\Users\Ryan-James\.gradle\jdks\jdk8u322-b06\bin\java.exe'' finished with non-zero exit value 1

* Try:
Run with --stacktrace option to get the stack trace. Run with --info or --debug option to get more log output. Run with --scan to get full insights.

* Get more help at https://help.gradle.org

BUILD FAILED in 5s

Posted
3 hours ago, Luis_ST said:

do this and post full output

this is the output

Execution failed for task ':runClient'.
> Process 'command 'C:\Users\Ryan-James\.gradle\jdks\jdk8u322-b06\bin\java.exe'' finished with non-zero exit value 1

* Try:
Run with --info or --debug option to get more log output. Run with --scan to get full insights.

* Exception is:
org.gradle.api.tasks.TaskExecutionException: Execution failed for task ':runClient'.
    at org.gradle.api.internal.tasks.execution.ExecuteActionsTaskExecuter.lambda$executeIfValid$1(ExecuteActionsTaskExecuter.java:188)
    at org.gradle.internal.Try$Failure.ifSuccessfulOrElse(Try.java:263)
    at org.gradle.api.internal.tasks.execution.ExecuteActionsTaskExecuter.executeIfValid(ExecuteActionsTaskExecuter.java:186)
    at org.gradle.api.internal.tasks.execution.ExecuteActionsTaskExecuter.execute(ExecuteActionsTaskExecuter.java:174)
    at org.gradle.api.internal.tasks.execution.CleanupStaleOutputsExecuter.execute(CleanupStaleOutputsExecuter.java:109)
    at org.gradle.api.internal.tasks.execution.FinalizePropertiesTaskExecuter.execute(FinalizePropertiesTaskExecuter.java:46)
    at org.gradle.api.internal.tasks.execution.ResolveTaskExecutionModeExecuter.execute(ResolveTaskExecutionModeExecuter.java:51)
    at org.gradle.api.internal.tasks.execution.SkipTaskWithNoActionsExecuter.execute(SkipTaskWithNoActionsExecuter.java:57)
    at org.gradle.api.internal.tasks.execution.SkipOnlyIfTaskExecuter.execute(SkipOnlyIfTaskExecuter.java:56)
    at org.gradle.api.internal.tasks.execution.CatchExceptionTaskExecuter.execute(CatchExceptionTaskExecuter.java:36)
    at org.gradle.api.internal.tasks.execution.EventFiringTaskExecuter$1.executeTask(EventFiringTaskExecuter.java:77)
    at org.gradle.api.internal.tasks.execution.EventFiringTaskExecuter$1.call(EventFiringTaskExecuter.java:55)
    at org.gradle.api.internal.tasks.execution.EventFiringTaskExecuter$1.call(EventFiringTaskExecuter.java:52)
    at org.gradle.internal.operations.DefaultBuildOperationRunner$CallableBuildOperationWorker.execute(DefaultBuildOperationRunner.java:200)
    at org.gradle.internal.operations.DefaultBuildOperationRunner$CallableBuildOperationWorker.execute(DefaultBuildOperationRunner.java:195)
    at org.gradle.internal.operations.DefaultBuildOperationRunner$3.execute(DefaultBuildOperationRunner.java:75)
    at org.gradle.internal.operations.DefaultBuildOperationRunner$3.execute(DefaultBuildOperationRunner.java:68)
    at org.gradle.internal.operations.DefaultBuildOperationRunner.execute(DefaultBuildOperationRunner.java:153)
    at org.gradle.internal.operations.DefaultBuildOperationRunner.execute(DefaultBuildOperationRunner.java:68)
    at org.gradle.internal.operations.DefaultBuildOperationRunner.call(DefaultBuildOperationRunner.java:62)
    at org.gradle.internal.operations.DefaultBuildOperationExecutor.lambda$call$2(DefaultBuildOperationExecutor.java:79)
    at org.gradle.internal.operations.UnmanagedBuildOperationWrapper.callWithUnmanagedSupport(UnmanagedBuildOperationWrapper.java:54)
    at org.gradle.internal.operations.DefaultBuildOperationExecutor.call(DefaultBuildOperationExecutor.java:79)
    at org.gradle.api.internal.tasks.execution.EventFiringTaskExecuter.execute(EventFiringTaskExecuter.java:52)
    at org.gradle.execution.plan.LocalTaskNodeExecutor.execute(LocalTaskNodeExecutor.java:74)
    at org.gradle.execution.taskgraph.DefaultTaskExecutionGraph$InvokeNodeExecutorsAction.execute(DefaultTaskExecutionGraph.java:408)
    at org.gradle.execution.taskgraph.DefaultTaskExecutionGraph$InvokeNodeExecutorsAction.execute(DefaultTaskExecutionGraph.java:395)
    at org.gradle.execution.taskgraph.DefaultTaskExecutionGraph$BuildOperationAwareExecutionAction.execute(DefaultTaskExecutionGraph.java:388)
    at org.gradle.execution.taskgraph.DefaultTaskExecutionGraph$BuildOperationAwareExecutionAction.execute(DefaultTaskExecutionGraph.java:374)
    at org.gradle.execution.plan.DefaultPlanExecutor$ExecutorWorker.lambda$run$0(DefaultPlanExecutor.java:127)
    at org.gradle.execution.plan.DefaultPlanExecutor$ExecutorWorker.execute(DefaultPlanExecutor.java:191)
    at org.gradle.execution.plan.DefaultPlanExecutor$ExecutorWorker.executeNextNode(DefaultPlanExecutor.java:182)
    at org.gradle.execution.plan.DefaultPlanExecutor$ExecutorWorker.run(DefaultPlanExecutor.java:124)
    at org.gradle.internal.concurrent.ExecutorPolicy$CatchAndRecordFailures.onExecute(ExecutorPolicy.java:64)
    at org.gradle.internal.concurrent.ManagedExecutorImpl$1.run(ManagedExecutorImpl.java:48)
    at org.gradle.internal.concurrent.ThreadFactoryImpl$ManagedThreadRunnable.run(ThreadFactoryImpl.java:56)
Caused by: org.gradle.process.internal.ExecException: Process 'command 'C:\Users\Ryan-James\.gradle\jdks\jdk8u322-b06\bin\java.exe'' finished with non-zero exit value 1
    at org.gradle.process.internal.DefaultExecHandle$ExecResultImpl.assertNormalExitValue(DefaultExecHandle.java:414)
    at org.gradle.process.internal.DefaultJavaExecAction.execute(DefaultJavaExecAction.java:52)
    at org.gradle.api.tasks.JavaExec.exec(JavaExec.java:156)
    at java.base/jdk.internal.reflect.NativeMethodAccessorImpl.invoke0(Native Method)
    at java.base/jdk.internal.reflect.NativeMethodAccessorImpl.invoke(NativeMethodAccessorImpl.java:78)
    at java.base/jdk.internal.reflect.DelegatingMethodAccessorImpl.invoke(DelegatingMethodAccessorImpl.java:43)
    at org.gradle.internal.reflect.JavaMethod.invoke(JavaMethod.java:104)
    at org.gradle.api.internal.project.taskfactory.StandardTaskAction.doExecute(StandardTaskAction.java:58)
    at org.gradle.api.internal.project.taskfactory.StandardTaskAction.execute(StandardTaskAction.java:51)
    at org.gradle.api.internal.project.taskfactory.StandardTaskAction.execute(StandardTaskAction.java:29)
    at org.gradle.api.internal.tasks.execution.ExecuteActionsTaskExecuter$2.run(ExecuteActionsTaskExecuter.java:506)
    at org.gradle.internal.operations.DefaultBuildOperationRunner$1.execute(DefaultBuildOperationRunner.java:29)
    at org.gradle.internal.operations.DefaultBuildOperationRunner$1.execute(DefaultBuildOperationRunner.java:26)
    at org.gradle.internal.operations.DefaultBuildOperationRunner$3.execute(DefaultBuildOperationRunner.java:75)
    at org.gradle.internal.operations.DefaultBuildOperationRunner$3.execute(DefaultBuildOperationRunner.java:68)
    at org.gradle.internal.operations.DefaultBuildOperationRunner.execute(DefaultBuildOperationRunner.java:153)
    at org.gradle.internal.operations.DefaultBuildOperationRunner.execute(DefaultBuildOperationRunner.java:68)
    at org.gradle.internal.operations.DefaultBuildOperationRunner.run(DefaultBuildOperationRunner.java:56)
    at org.gradle.internal.operations.DefaultBuildOperationExecutor.lambda$run$1(DefaultBuildOperationExecutor.java:74)
    at org.gradle.internal.operations.UnmanagedBuildOperationWrapper.runWithUnmanagedSupport(UnmanagedBuildOperationWrapper.java:45)
    at org.gradle.internal.operations.DefaultBuildOperationExecutor.run(DefaultBuildOperationExecutor.java:74)
    at org.gradle.api.internal.tasks.execution.ExecuteActionsTaskExecuter.executeAction(ExecuteActionsTaskExecuter.java:491)
    at org.gradle.api.internal.tasks.execution.ExecuteActionsTaskExecuter.executeActions(ExecuteActionsTaskExecuter.java:474)
    at org.gradle.api.internal.tasks.execution.ExecuteActionsTaskExecuter.access$300(ExecuteActionsTaskExecuter.java:106)
    at org.gradle.api.internal.tasks.execution.ExecuteActionsTaskExecuter$TaskExecution.executeWithPreviousOutputFiles(ExecuteActionsTaskExecuter.java:271)
    at org.gradle.api.internal.tasks.execution.ExecuteActionsTaskExecuter$TaskExecution.execute(ExecuteActionsTaskExecuter.java:249)
    at org.gradle.internal.execution.steps.ExecuteStep.executeInternal(ExecuteStep.java:83)
    at org.gradle.internal.execution.steps.ExecuteStep.access$000(ExecuteStep.java:37)
    at org.gradle.internal.execution.steps.ExecuteStep$1.call(ExecuteStep.java:50)
    at org.gradle.internal.execution.steps.ExecuteStep$1.call(ExecuteStep.java:47)
    at org.gradle.internal.operations.DefaultBuildOperationRunner$CallableBuildOperationWorker.execute(DefaultBuildOperationRunner.java:200)
    at org.gradle.internal.operations.DefaultBuildOperationRunner$CallableBuildOperationWorker.execute(DefaultBuildOperationRunner.java:195)
    at org.gradle.internal.operations.DefaultBuildOperationRunner$3.execute(DefaultBuildOperationRunner.java:75)
    at org.gradle.internal.operations.DefaultBuildOperationRunner$3.execute(DefaultBuildOperationRunner.java:68)
    at org.gradle.internal.operations.DefaultBuildOperationRunner.execute(DefaultBuildOperationRunner.java:153)
    at org.gradle.internal.operations.DefaultBuildOperationRunner.execute(DefaultBuildOperationRunner.java:68)
    at org.gradle.internal.operations.DefaultBuildOperationRunner.call(DefaultBuildOperationRunner.java:62)
    at org.gradle.internal.operations.DefaultBuildOperationExecutor.lambda$call$2(DefaultBuildOperationExecutor.java:79)
    at org.gradle.internal.operations.UnmanagedBuildOperationWrapper.callWithUnmanagedSupport(UnmanagedBuildOperationWrapper.java:54)
    at org.gradle.internal.operations.DefaultBuildOperationExecutor.call(DefaultBuildOperationExecutor.java:79)
    at org.gradle.internal.execution.steps.ExecuteStep.execute(ExecuteStep.java:47)
    at org.gradle.internal.execution.steps.ExecuteStep.execute(ExecuteStep.java:37)
    at org.gradle.internal.execution.steps.RemovePreviousOutputsStep.execute(RemovePreviousOutputsStep.java:68)
    at org.gradle.internal.execution.steps.RemovePreviousOutputsStep.execute(RemovePreviousOutputsStep.java:38)
    at org.gradle.internal.execution.steps.ResolveInputChangesStep.execute(ResolveInputChangesStep.java:50)
    at org.gradle.internal.execution.steps.ResolveInputChangesStep.execute(ResolveInputChangesStep.java:36)
    at org.gradle.internal.execution.steps.CancelExecutionStep.execute(CancelExecutionStep.java:41)
    at org.gradle.internal.execution.steps.TimeoutStep.executeWithoutTimeout(TimeoutStep.java:74)
    at org.gradle.internal.execution.steps.TimeoutStep.execute(TimeoutStep.java:55)
    at org.gradle.internal.execution.steps.CreateOutputsStep.execute(CreateOutputsStep.java:51)
    at org.gradle.internal.execution.steps.CreateOutputsStep.execute(CreateOutputsStep.java:29)
    at org.gradle.internal.execution.steps.CaptureStateAfterExecutionStep.execute(CaptureStateAfterExecutionStep.java:54)
    at org.gradle.internal.execution.steps.CaptureStateAfterExecutionStep.execute(CaptureStateAfterExecutionStep.java:35)
    at org.gradle.internal.execution.steps.BroadcastChangingOutputsStep.execute(BroadcastChangingOutputsStep.java:60)
    at org.gradle.internal.execution.steps.BroadcastChangingOutputsStep.execute(BroadcastChangingOutputsStep.java:27)
    at org.gradle.internal.execution.steps.BuildCacheStep.executeWithoutCache(BuildCacheStep.java:174)
    at org.gradle.internal.execution.steps.BuildCacheStep.execute(BuildCacheStep.java:74)
    at org.gradle.internal.execution.steps.BuildCacheStep.execute(BuildCacheStep.java:45)
    at org.gradle.internal.execution.steps.StoreExecutionStateStep.execute(StoreExecutionStateStep.java:40)
    at org.gradle.internal.execution.steps.StoreExecutionStateStep.execute(StoreExecutionStateStep.java:29)
    at org.gradle.internal.execution.steps.RecordOutputsStep.execute(RecordOutputsStep.java:36)
    at org.gradle.internal.execution.steps.RecordOutputsStep.execute(RecordOutputsStep.java:22)
    at org.gradle.internal.execution.steps.SkipUpToDateStep.executeBecause(SkipUpToDateStep.java:99)
    at org.gradle.internal.execution.steps.SkipUpToDateStep.lambda$execute$0(SkipUpToDateStep.java:92)
    at org.gradle.internal.execution.steps.SkipUpToDateStep.execute(SkipUpToDateStep.java:52)
    at org.gradle.internal.execution.steps.SkipUpToDateStep.execute(SkipUpToDateStep.java:36)
    at org.gradle.internal.execution.steps.ResolveChangesStep.execute(ResolveChangesStep.java:85)
    at org.gradle.internal.execution.steps.ResolveChangesStep.execute(ResolveChangesStep.java:42)
    at org.gradle.internal.execution.steps.legacy.MarkSnapshottingInputsFinishedStep.execute(MarkSnapshottingInputsFinishedStep.java:37)
    at org.gradle.internal.execution.steps.legacy.MarkSnapshottingInputsFinishedStep.execute(MarkSnapshottingInputsFinishedStep.java:27)
    at org.gradle.internal.execution.steps.ResolveCachingStateStep.execute(ResolveCachingStateStep.java:91)
    at org.gradle.internal.execution.steps.ResolveCachingStateStep.execute(ResolveCachingStateStep.java:49)
    at org.gradle.internal.execution.steps.ValidateStep.execute(ValidateStep.java:106)
    at org.gradle.internal.execution.steps.ValidateStep.execute(ValidateStep.java:51)
    at org.gradle.internal.execution.steps.CaptureStateBeforeExecutionStep.execute(CaptureStateBeforeExecutionStep.java:72)
    at org.gradle.internal.execution.steps.CaptureStateBeforeExecutionStep.execute(CaptureStateBeforeExecutionStep.java:46)
    at org.gradle.internal.execution.steps.SkipEmptyWorkStep.lambda$execute$2(SkipEmptyWorkStep.java:86)
    at org.gradle.internal.execution.steps.SkipEmptyWorkStep.execute(SkipEmptyWorkStep.java:86)
    at org.gradle.internal.execution.steps.SkipEmptyWorkStep.execute(SkipEmptyWorkStep.java:32)
    at org.gradle.internal.execution.steps.legacy.MarkSnapshottingInputsStartedStep.execute(MarkSnapshottingInputsStartedStep.java:38)
    at org.gradle.internal.execution.steps.LoadExecutionStateStep.execute(LoadExecutionStateStep.java:43)
    at org.gradle.internal.execution.steps.LoadExecutionStateStep.execute(LoadExecutionStateStep.java:31)
    at org.gradle.internal.execution.steps.AssignWorkspaceStep.lambda$execute$0(AssignWorkspaceStep.java:40)
    at org.gradle.api.internal.tasks.execution.ExecuteActionsTaskExecuter$TaskExecution$2.withWorkspace(ExecuteActionsTaskExecuter.java:284)
    at org.gradle.internal.execution.steps.AssignWorkspaceStep.execute(AssignWorkspaceStep.java:40)
    at org.gradle.internal.execution.steps.AssignWorkspaceStep.execute(AssignWorkspaceStep.java:30)
    at org.gradle.internal.execution.steps.IdentityCacheStep.execute(IdentityCacheStep.java:37)
    at org.gradle.internal.execution.steps.IdentityCacheStep.execute(IdentityCacheStep.java:27)
    at org.gradle.internal.execution.steps.IdentifyStep.execute(IdentifyStep.java:44)
    at org.gradle.internal.execution.steps.IdentifyStep.execute(IdentifyStep.java:33)
    at org.gradle.internal.execution.impl.DefaultExecutionEngine$1.execute(DefaultExecutionEngine.java:76)
    at org.gradle.api.internal.tasks.execution.ExecuteActionsTaskExecuter.executeIfValid(ExecuteActionsTaskExecuter.java:185)
    at org.gradle.api.internal.tasks.execution.ExecuteActionsTaskExecuter.execute(ExecuteActionsTaskExecuter.java:174)
    at org.gradle.api.internal.tasks.execution.CleanupStaleOutputsExecuter.execute(CleanupStaleOutputsExecuter.java:109)
    at org.gradle.api.internal.tasks.execution.FinalizePropertiesTaskExecuter.execute(FinalizePropertiesTaskExecuter.java:46)
    at org.gradle.api.internal.tasks.execution.ResolveTaskExecutionModeExecuter.execute(ResolveTaskExecutionModeExecuter.java:51)
    at org.gradle.api.internal.tasks.execution.SkipTaskWithNoActionsExecuter.execute(SkipTaskWithNoActionsExecuter.java:57)
    at org.gradle.api.internal.tasks.execution.SkipOnlyIfTaskExecuter.execute(SkipOnlyIfTaskExecuter.java:56)
    at org.gradle.api.internal.tasks.execution.CatchExceptionTaskExecuter.execute(CatchExceptionTaskExecuter.java:36)
    at org.gradle.api.internal.tasks.execution.EventFiringTaskExecuter$1.executeTask(EventFiringTaskExecuter.java:77)
    at org.gradle.api.internal.tasks.execution.EventFiringTaskExecuter$1.call(EventFiringTaskExecuter.java:55)
    at org.gradle.api.internal.tasks.execution.EventFiringTaskExecuter$1.call(EventFiringTaskExecuter.java:52)
    at org.gradle.internal.operations.DefaultBuildOperationRunner$CallableBuildOperationWorker.execute(DefaultBuildOperationRunner.java:200)
    at org.gradle.internal.operations.DefaultBuildOperationRunner$CallableBuildOperationWorker.execute(DefaultBuildOperationRunner.java:195)
    at org.gradle.internal.operations.DefaultBuildOperationRunner$3.execute(DefaultBuildOperationRunner.java:75)
    at org.gradle.internal.operations.DefaultBuildOperationRunner$3.execute(DefaultBuildOperationRunner.java:68)
    at org.gradle.internal.operations.DefaultBuildOperationRunner.execute(DefaultBuildOperationRunner.java:153)
    at org.gradle.internal.operations.DefaultBuildOperationRunner.execute(DefaultBuildOperationRunner.java:68)
    at org.gradle.internal.operations.DefaultBuildOperationRunner.call(DefaultBuildOperationRunner.java:62)
    at org.gradle.internal.operations.DefaultBuildOperationExecutor.lambda$call$2(DefaultBuildOperationExecutor.java:79)
    at org.gradle.internal.operations.UnmanagedBuildOperationWrapper.callWithUnmanagedSupport(UnmanagedBuildOperationWrapper.java:54)
    at org.gradle.internal.operations.DefaultBuildOperationExecutor.call(DefaultBuildOperationExecutor.java:79)
    at org.gradle.api.internal.tasks.execution.EventFiringTaskExecuter.execute(EventFiringTaskExecuter.java:52)
    at org.gradle.execution.plan.LocalTaskNodeExecutor.execute(LocalTaskNodeExecutor.java:74)
    at org.gradle.execution.taskgraph.DefaultTaskExecutionGraph$InvokeNodeExecutorsAction.execute(DefaultTaskExecutionGraph.java:408)
    at org.gradle.execution.taskgraph.DefaultTaskExecutionGraph$InvokeNodeExecutorsAction.execute(DefaultTaskExecutionGraph.java:395)
    at org.gradle.execution.taskgraph.DefaultTaskExecutionGraph$BuildOperationAwareExecutionAction.execute(DefaultTaskExecutionGraph.java:388)
    at org.gradle.execution.taskgraph.DefaultTaskExecutionGraph$BuildOperationAwareExecutionAction.execute(DefaultTaskExecutionGraph.java:374)
    at org.gradle.execution.plan.DefaultPlanExecutor$ExecutorWorker.lambda$run$0(DefaultPlanExecutor.java:127)
    at org.gradle.execution.plan.DefaultPlanExecutor$ExecutorWorker.execute(DefaultPlanExecutor.java:191)
    at org.gradle.execution.plan.DefaultPlanExecutor$ExecutorWorker.executeNextNode(DefaultPlanExecutor.java:182)
    at org.gradle.execution.plan.DefaultPlanExecutor$ExecutorWorker.run(DefaultPlanExecutor.java:124)
    at org.gradle.internal.concurrent.ExecutorPolicy$CatchAndRecordFailures.onExecute(ExecutorPolicy.java:64)
    at org.gradle.internal.concurrent.ManagedExecutorImpl$1.run(ManagedExecutorImpl.java:48)
    at org.gradle.internal.concurrent.ThreadFactoryImpl$ManagedThreadRunnable.run(ThreadFactoryImpl.java:56)

Posted
On 4/15/2022 at 7:25 PM, diesieben07 said:

Post the full output.

11:38:05 am: Executing 'runClient --scan --scan --stacktrace'...


> Configure project :
Java: 16.0.2 JVM: 16.0.2+7-67(Oracle Corporation) Arch: amd64

> Task :compileJava UP-TO-DATE
> Task :processResources UP-TO-DATE
> Task :classes UP-TO-DATE
> Task :downloadMcpConfig
> Task :extractSrg UP-TO-DATE
> Task :createSrgToMcp UP-TO-DATE
> Task :downloadMCMeta UP-TO-DATE
> Task :downloadAssets UP-TO-DATE
> Task :extractNatives UP-TO-DATE
> Task :makeSrcDirs
> Task :prepareRuns
> Task :prepareRunClient

> Task :runClient
2022-04-19 11:38:10,294 main WARN Advanced terminal features are not available in this environment
[11:38:10] [main/INFO] [cp.mo.mo.Launcher/MODLAUNCHER]: ModLauncher running: args [--gameDir, ., --launchTarget, fmluserdevclient, --fml.mcpVersion, 20210115.111550, --fml.mcVersion, 1.16.5, --fml.forgeGroup, net.minecraftforge, --fml.forgeVersion, 36.2.20, --assetIndex, 1.16, --assetsDir, C:\Users\Ryan-James\.gradle\caches\forge_gradle\assets, --version, MOD_DEV, --username, Dev, --accessToken, ????????, --userProperties, {}]
[11:38:10] [main/INFO] [cp.mo.mo.Launcher/MODLAUNCHER]: ModLauncher 8.0.9+86+master.3cf110c starting: java version 1.8.0_322 by Temurin
[11:38:10] [main/DEBUG] [cp.mo.mo.LaunchServiceHandler/MODLAUNCHER]: Found launch services [minecraft,fmldevdata,fmldevclient,fmldevserver,fmluserdevserver,testharness,fmluserdevdata,fmlclient,fmluserdevclient,fmlserver]
[11:38:10] [main/DEBUG] [cp.mo.mo.NameMappingServiceHandler/MODLAUNCHER]: Found naming services : [srgtomcp]
[11:38:10] [main/DEBUG] [cp.mo.mo.LaunchPluginHandler/MODLAUNCHER]: Found launch plugins: [mixin,eventbus,object_holder_definalize,runtime_enum_extender,accesstransformer,capability_inject_definalize,runtimedistcleaner]
[11:38:11] [main/DEBUG] [cp.mo.mo.TransformationServicesHandler/MODLAUNCHER]: Discovering transformation services
[11:38:11] [main/DEBUG] [cp.mo.mo.TransformationServicesHandler/MODLAUNCHER]: Found additional transformation services from discovery services: []
[11:38:11] [main/DEBUG] [cp.mo.mo.TransformationServicesHandler/MODLAUNCHER]: Found transformer services : [mixin,fml]
[11:38:11] [main/DEBUG] [cp.mo.mo.TransformationServicesHandler/MODLAUNCHER]: Transformation services loading
[11:38:11] [main/DEBUG] [cp.mo.mo.TransformationServiceDecorator/MODLAUNCHER]: Loading service mixin
[11:38:11] [main/DEBUG] [cp.mo.mo.TransformationServiceDecorator/MODLAUNCHER]: Loaded service mixin
[11:38:11] [main/DEBUG] [cp.mo.mo.TransformationServiceDecorator/MODLAUNCHER]: Loading service fml
[11:38:11] [main/DEBUG] [ne.mi.fm.lo.FMLServiceProvider/]: Injecting tracing printstreams for STDOUT/STDERR.
[11:38:11] [main/DEBUG] [ne.mi.fm.lo.LauncherVersion/CORE]: Found FMLLauncher version 36.2
[11:38:11] [main/DEBUG] [ne.mi.fm.lo.FMLLoader/CORE]: FML 36.2 loading
[11:38:11] [main/DEBUG] [ne.mi.fm.lo.FMLLoader/CORE]: FML found ModLauncher version : 8.0.9+86+master.3cf110c
[11:38:11] [main/DEBUG] [ne.mi.fm.lo.FMLLoader/CORE]: Initializing modjar URL handler
[11:38:11] [main/DEBUG] [ne.mi.fm.lo.FMLLoader/CORE]: FML found AccessTransformer version : 3.0.1+61+master.47bca0e
[11:38:11] [main/DEBUG] [ne.mi.fm.lo.FMLLoader/CORE]: FML found EventBus version : 4.0.0+65+master.6080a3f
[11:38:11] [main/DEBUG] [ne.mi.fm.lo.FMLLoader/CORE]: Found Runtime Dist Cleaner
[11:38:11] [main/DEBUG] [ne.mi.fm.lo.FMLLoader/CORE]: FML found CoreMod version : 4.0.6+14+master.c21a551
[11:38:11] [main/DEBUG] [ne.mi.fm.lo.FMLLoader/CORE]: Found ForgeSPI package implementation version 3.2.0+13+master.8ddb2cc
[11:38:11] [main/DEBUG] [ne.mi.fm.lo.FMLLoader/CORE]: Found ForgeSPI package specification 3
[11:38:11] [main/INFO] [ne.mi.fm.lo.FixSSL/CORE]: Added Lets Encrypt root certificates as additional trust
[11:38:11] [main/DEBUG] [cp.mo.mo.TransformationServiceDecorator/MODLAUNCHER]: Loaded service fml
[11:38:11] [main/DEBUG] [cp.mo.mo.TransformationServicesHandler/MODLAUNCHER]: Configuring option handling for services
[11:38:11] [main/DEBUG] [cp.mo.mo.TransformationServicesHandler/MODLAUNCHER]: Transformation services initializing
[11:38:11] [main/DEBUG] [cp.mo.mo.TransformationServiceDecorator/MODLAUNCHER]: Initializing transformation service mixin
[11:38:11] [main/DEBUG] [mixin/]: Mixin bootstrap service org.spongepowered.asm.service.mojang.MixinServiceLaunchWrapperBootstrap is not available: LaunchWrapper is not available
[11:38:11] [main/DEBUG] [mixin/]: MixinService [ModLauncher] was successfully booted in sun.misc.Launcher$AppClassLoader@7852e922
[11:38:11] [main/INFO] [mixin/]: SpongePowered MIXIN Subsystem Version=0.8.4 Source=file:/C:/Users/Ryan-James/.gradle/caches/modules-2/files-2.1/org.spongepowered/mixin/0.8.4/4ec7d77d9ab32596ca0b78bb123956734767e3a/mixin-0.8.4.jar Service=ModLauncher Env=CLIENT
[11:38:11] [main/DEBUG] [mixin/]: Initialising Mixin Platform Manager
[11:38:11] [main/DEBUG] [mixin/]: Adding mixin platform agents for container ModLauncher Root Container(ModLauncher:4f56a0a2)
[11:38:11] [main/DEBUG] [mixin/]: Instancing new MixinPlatformAgentMinecraftForge for ModLauncher Root Container(ModLauncher:4f56a0a2)
[11:38:11] [main/DEBUG] [mixin/]: MixinPlatformAgentMinecraftForge rejected container ModLauncher Root Container(ModLauncher:4f56a0a2)
[11:38:11] [main/DEBUG] [mixin/]: Instancing new MixinPlatformAgentDefault for ModLauncher Root Container(ModLauncher:4f56a0a2)
[11:38:11] [main/DEBUG] [mixin/]: MixinPlatformAgentDefault accepted container ModLauncher Root Container(ModLauncher:4f56a0a2)
[11:38:11] [main/DEBUG] [cp.mo.mo.TransformationServiceDecorator/MODLAUNCHER]: Initialized transformation service mixin
[11:38:11] [main/DEBUG] [cp.mo.mo.TransformationServiceDecorator/MODLAUNCHER]: Initializing transformation service fml
[11:38:11] [main/DEBUG] [ne.mi.fm.lo.FMLServiceProvider/CORE]: Setting up basic FML game directories
[11:38:11] [main/DEBUG] [ne.mi.fm.lo.FileUtils/CORE]: Found existing GAMEDIR directory : C:\Users\Ryan-James\Desktop\mc mod\run
[11:38:11] [main/DEBUG] [ne.mi.fm.lo.FMLPaths/CORE]: Path GAMEDIR is C:\Users\Ryan-James\Desktop\mc mod\run
[11:38:11] [main/DEBUG] [ne.mi.fm.lo.FileUtils/CORE]: Found existing MODSDIR directory : C:\Users\Ryan-James\Desktop\mc mod\run\mods
[11:38:11] [main/DEBUG] [ne.mi.fm.lo.FMLPaths/CORE]: Path MODSDIR is C:\Users\Ryan-James\Desktop\mc mod\run\mods
[11:38:11] [main/DEBUG] [ne.mi.fm.lo.FileUtils/CORE]: Found existing CONFIGDIR directory : C:\Users\Ryan-James\Desktop\mc mod\run\config
[11:38:11] [main/DEBUG] [ne.mi.fm.lo.FMLPaths/CORE]: Path CONFIGDIR is C:\Users\Ryan-James\Desktop\mc mod\run\config
[11:38:11] [main/DEBUG] [ne.mi.fm.lo.FMLPaths/CORE]: Path FMLCONFIG is C:\Users\Ryan-James\Desktop\mc mod\run\config\fml.toml
[11:38:11] [main/DEBUG] [ne.mi.fm.lo.FMLServiceProvider/CORE]: Loading configuration
[11:38:11] [main/DEBUG] [ne.mi.fm.lo.FileUtils/CORE]: Found existing default config directory directory : C:\Users\Ryan-James\Desktop\mc mod\run\defaultconfigs
[11:38:11] [main/DEBUG] [ne.mi.fm.lo.FMLServiceProvider/CORE]: Preparing ModFile
[11:38:11] [main/DEBUG] [ne.mi.fm.lo.FMLServiceProvider/CORE]: Preparing launch handler
[11:38:11] [main/DEBUG] [ne.mi.fm.lo.FMLLoader/CORE]: Using fmluserdevclient as launch service
[11:38:12] [main/DEBUG] [ne.mi.fm.lo.FMLLoader/CORE]: Received command line version data  : MC Version: '1.16.5' MCP Version: '20210115.111550' Forge Version: '36.2.20' Forge group: 'net.minecraftforge'
[11:38:12] [main/DEBUG] [ne.mi.fm.lo.LibraryFinder/CORE]: Found JAR forge at path C:\Users\Ryan-James\.gradle\caches\forge_gradle\minecraft_user_repo\net\minecraftforge\forge\1.16.5-36.2.20_mapped_snapshot_20210309-1.16.5\forge-1.16.5-36.2.20_mapped_snapshot_20210309-1.16.5-recomp.jar
[11:38:12] [main/DEBUG] [ne.mi.fm.lo.LibraryFinder/CORE]: Found JAR mcdata at path C:\Users\Ryan-James\.gradle\caches\forge_gradle\minecraft_repo\versions\1.16.5\client-extra.jar
[11:38:12] [main/DEBUG] [ne.mi.us.FMLUserdevLaunchProvider/CORE]: Injecting maven path C:\Users\Ryan-James\.gradle\caches\forge_gradle\minecraft_user_repo
[11:38:12] [main/DEBUG] [ne.mi.fm.lo.FMLCommonLaunchHandler/CORE]: Got mod coordinates tutorialmod%%C:\Users\Ryan-James\Desktop\mc mod\build\resources\main;tutorialmod%%C:\Users\Ryan-James\Desktop\mc mod\build\classes\java\main from env
[11:38:12] [main/DEBUG] [ne.mi.fm.lo.FMLCommonLaunchHandler/CORE]: Found supplied mod coordinates [{tutorialmod=[C:\Users\Ryan-James\Desktop\mc mod\build\resources\main, C:\Users\Ryan-James\Desktop\mc mod\build\classes\java\main]}]
[11:38:12] [main/DEBUG] [ne.mi.fm.lo.LanguageLoadingProvider/CORE]: Found 2 language providers
[11:38:12] [main/DEBUG] [ne.mi.fm.lo.LanguageLoadingProvider/CORE]: Found language provider javafml, version 36.2
[11:38:12] [main/DEBUG] [ne.mi.fm.lo.LanguageLoadingProvider/CORE]: Found language provider minecraft, version 1
[11:38:12] [main/DEBUG] [ne.mi.fm.lo.LanguageLoadingProvider/CORE]: Skipping adding forge jar - javafml is already present
[11:38:12] [main/DEBUG] [cp.mo.mo.TransformationServiceDecorator/MODLAUNCHER]: Initialized transformation service fml
[11:38:12] [main/DEBUG] [cp.mo.mo.NameMappingServiceHandler/MODLAUNCHER]: Current naming domain is 'mcp'
[11:38:12] [main/DEBUG] [cp.mo.mo.NameMappingServiceHandler/MODLAUNCHER]: Identified name mapping providers {srg=srgtomcp:1234}
[11:38:12] [main/DEBUG] [cp.mo.mo.TransformationServicesHandler/MODLAUNCHER]: Transformation services begin scanning
[11:38:12] [main/DEBUG] [cp.mo.mo.TransformationServiceDecorator/MODLAUNCHER]: Beginning scan trigger - transformation service mixin
[11:38:12] [main/DEBUG] [cp.mo.mo.TransformationServiceDecorator/MODLAUNCHER]: End scan trigger - transformation service mixin
[11:38:12] [main/DEBUG] [cp.mo.mo.TransformationServiceDecorator/MODLAUNCHER]: Beginning scan trigger - transformation service fml
[11:38:12] [main/DEBUG] [ne.mi.fm.lo.FMLServiceProvider/CORE]: Initiating mod scan
[11:38:12] [main/DEBUG] [ne.mi.fm.lo.LibraryFinder/CORE]: Found JAR classpath_mod at path C:\Users\Ryan-James\Desktop\mc mod\build\resources\main
[11:38:12] [main/DEBUG] [ne.mi.fm.lo.LibraryFinder/CORE]: Found JAR classpath_mod at path C:\Users\Ryan-James\.gradle\caches\forge_gradle\minecraft_user_repo\net\minecraftforge\forge\1.16.5-36.2.20_mapped_snapshot_20210309-1.16.5\forge-1.16.5-36.2.20_mapped_snapshot_20210309-1.16.5-recomp.jar
[11:38:12] [main/DEBUG] [ne.mi.us.ClasspathLocator/CORE]: Found classpath mod: C:\Users\Ryan-James\.gradle\caches\forge_gradle\minecraft_user_repo\net\minecraftforge\forge\1.16.5-36.2.20_mapped_snapshot_20210309-1.16.5\forge-1.16.5-36.2.20_mapped_snapshot_20210309-1.16.5-recomp.jar
[11:38:12] [main/DEBUG] [ne.mi.fm.lo.LibraryFinder/CORE]: Found JAR manifest_jar at path C:\Users\Ryan-James\.gradle\caches\forge_gradle\minecraft_user_repo\net\minecraftforge\forge\1.16.5-36.2.20_mapped_snapshot_20210309-1.16.5\forge-1.16.5-36.2.20_mapped_snapshot_20210309-1.16.5-recomp.jar
[11:38:12] [main/DEBUG] [ne.mi.fm.lo.LibraryFinder/CORE]: Found JAR manifest_jar at path C:\Users\Ryan-James\.gradle\caches\forge_gradle\minecraft_user_repo\net\minecraftforge\forge\1.16.5-36.2.20_mapped_snapshot_20210309-1.16.5\forge-1.16.5-36.2.20_mapped_snapshot_20210309-1.16.5-launcher.jar
[11:38:12] [main/DEBUG] [ne.mi.fm.lo.LibraryFinder/CORE]: Found JAR manifest_jar at path C:\Users\Ryan-James\.gradle\caches\forge_gradle\minecraft_repo\versions\1.16.5\client-extra.jar
[11:38:12] [main/DEBUG] [ne.mi.fm.lo.LibraryFinder/CORE]: Found JAR manifest_jar at path C:\Users\Ryan-James\.gradle\caches\modules-2\files-2.1\net.minecraftforge\accesstransformers\3.0.1\6d23c1b9cb0607fddc38d09730796f68db96f546\accesstransformers-3.0.1.jar
[11:38:12] [main/DEBUG] [ne.mi.fm.lo.LibraryFinder/CORE]: Found JAR manifest_jar at path C:\Users\Ryan-James\.gradle\caches\modules-2\files-2.1\net.minecraftforge\eventbus\4.0.0\260e34800723e4c098c4e247cf2b900535e01b6d\eventbus-4.0.0.jar
[11:38:12] [main/DEBUG] [ne.mi.fm.lo.LibraryFinder/CORE]: Found JAR manifest_jar at path C:\Users\Ryan-James\.gradle\caches\modules-2\files-2.1\net.minecraftforge\coremods\4.0.6\d6d761379c841e2610abebcbf70ed20b65f728f0\coremods-4.0.6.jar
[11:38:12] [main/DEBUG] [ne.mi.fm.lo.LibraryFinder/CORE]: Found JAR manifest_jar at path C:\Users\Ryan-James\.gradle\caches\modules-2\files-2.1\net.minecraftforge\forgespi\3.2.0\c6ca4e4e4a0343701407c760e642537b613b543\forgespi-3.2.0.jar
[11:38:12] [main/DEBUG] [ne.mi.fm.lo.LibraryFinder/CORE]: Found JAR manifest_jar at path C:\Users\Ryan-James\.gradle\caches\modules-2\files-2.1\cpw.mods\modlauncher\8.0.9\bb848f57758808692b9108df61c909c0a961ba81\modlauncher-8.0.9.jar
[11:38:12] [main/DEBUG] [ne.mi.fm.lo.LibraryFinder/CORE]: Found JAR manifest_jar at path C:\Users\Ryan-James\.gradle\caches\modules-2\files-2.1\cpw.mods\modlauncher\8.0.9\476a62d2a2ebd3573134b8bcd8f0bc21bbdf29ac\modlauncher-8.0.9-api.jar
[11:38:12] [main/DEBUG] [ne.mi.fm.lo.LibraryFinder/CORE]: Found JAR manifest_jar at path C:\Users\Ryan-James\.gradle\caches\modules-2\files-2.1\com.google.code.findbugs\jsr305\3.0.2\25ea2e8b0c338a877313bd4672d3fe056ea78f0d\jsr305-3.0.2.jar
[11:38:12] [main/DEBUG] [ne.mi.fm.lo.LibraryFinder/CORE]: Found JAR manifest_jar at path C:\Users\Ryan-James\.gradle\caches\modules-2\files-2.1\net.minecraftforge\mergetool\1.0.9\d1e1ba354a40b5703340b5cb02fdca489cff3646\mergetool-1.0.9-api.jar
[11:38:12] [main/DEBUG] [ne.mi.fm.lo.LibraryFinder/CORE]: Found JAR manifest_jar at path C:\Users\Ryan-James\.gradle\caches\modules-2\files-2.1\org.ow2.asm\asm-commons\9.1\8b971b182eb5cf100b9e8d4119152d83e00e0fdd\asm-commons-9.1.jar
[11:38:12] [main/DEBUG] [ne.mi.fm.lo.LibraryFinder/CORE]: Found JAR manifest_jar at path C:\Users\Ryan-James\.gradle\caches\modules-2\files-2.1\org.ow2.asm\asm-util\9.1\36464a45d871779f3383a8a9aba2b26562a86729\asm-util-9.1.jar
[11:38:12] [main/DEBUG] [ne.mi.fm.lo.LibraryFinder/CORE]: Found JAR manifest_jar at path C:\Users\Ryan-James\.gradle\caches\modules-2\files-2.1\org.ow2.asm\asm-analysis\9.1\4f61b83b81d8b659958f4bcc48907e93ecea55a0\asm-analysis-9.1.jar
[11:38:12] [main/DEBUG] [ne.mi.fm.lo.LibraryFinder/CORE]: Found JAR manifest_jar at path C:\Users\Ryan-James\.gradle\caches\modules-2\files-2.1\org.ow2.asm\asm-tree\9.1\c333f2a855069cb8eb17a40a3eb8b1b67755d0eb\asm-tree-9.1.jar
[11:38:12] [main/DEBUG] [ne.mi.fm.lo.LibraryFinder/CORE]: Found JAR manifest_jar at path C:\Users\Ryan-James\.gradle\caches\modules-2\files-2.1\org.ow2.asm\asm\9.1\a99500cf6eea30535eeac6be73899d048f8d12a8\asm-9.1.jar
[11:38:12] [main/DEBUG] [ne.mi.fm.lo.LibraryFinder/CORE]: Found JAR manifest_jar at path C:\Users\Ryan-James\.gradle\caches\modules-2\files-2.1\cpw.mods\grossjava9hacks\1.3.3\e49222512ea6cabdd8b49761cef1d5a207b1f0d9\grossjava9hacks-1.3.3.jar
[11:38:12] [main/DEBUG] [ne.mi.fm.lo.LibraryFinder/CORE]: Found JAR manifest_jar at path C:\Users\Ryan-James\.gradle\caches\modules-2\files-2.1\org.antlr\antlr4-runtime\4.9.1\428664f05d2b7f7b7610204b5aa7c1763f62011a\antlr4-runtime-4.9.1.jar
[11:38:12] [main/DEBUG] [ne.mi.fm.lo.LibraryFinder/CORE]: Found JAR manifest_jar at path C:\Users\Ryan-James\.gradle\caches\modules-2\files-2.1\net.minecraftforge\unsafe\0.2.0\54d7a0a5e8fdb71b973025caa46f341ae5904f39\unsafe-0.2.0.jar
[11:38:12] [main/DEBUG] [ne.mi.fm.lo.LibraryFinder/CORE]: Found JAR manifest_jar at path C:\Users\Ryan-James\.gradle\caches\modules-2\files-2.1\com.electronwill.night-config\toml\3.6.3\2b05b4d606c517da4d1a7b6d2b97d751c92887d7\toml-3.6.3.jar
[11:38:12] [main/DEBUG] [ne.mi.fm.lo.LibraryFinder/CORE]: Found JAR manifest_jar at path C:\Users\Ryan-James\.gradle\caches\modules-2\files-2.1\com.electronwill.night-config\core\3.6.3\c601bfeaeb2c0abe7aaa901b0bbe6d1beff49281\core-3.6.3.jar
[11:38:12] [main/DEBUG] [ne.mi.fm.lo.LibraryFinder/CORE]: Found JAR manifest_jar at path C:\Users\Ryan-James\.gradle\caches\modules-2\files-2.1\org.jline\jline\3.12.1\de2bd909cb9f8eaa741bd03df4a1bd3f6eb593c7\jline-3.12.1.jar
[11:38:12] [main/DEBUG] [ne.mi.fm.lo.LibraryFinder/CORE]: Found JAR manifest_jar at path C:\Users\Ryan-James\.gradle\caches\modules-2\files-2.1\org.apache.maven\maven-artifact\3.6.3\f8ff8032903882376e8d000c51e3e16d20fc7df7\maven-artifact-3.6.3.jar
[11:38:12] [main/DEBUG] [ne.mi.fm.lo.LibraryFinder/CORE]: Found JAR manifest_jar at path C:\Users\Ryan-James\.gradle\caches\modules-2\files-2.1\net.jodah\typetools\0.8.3\98f84f353457629e81cc6827224871b1a8faa7af\typetools-0.8.3.jar
[11:38:12] [main/DEBUG] [ne.mi.fm.lo.LibraryFinder/CORE]: Found JAR manifest_jar at path C:\Users\Ryan-James\.gradle\caches\modules-2\files-2.1\org.apache.logging.log4j\log4j-slf4j18-impl\2.15.0\88f72ad364bfc3a7cf43186fc17212f2b4bb8d97\log4j-slf4j18-impl-2.15.0.jar
[11:38:12] [main/DEBUG] [ne.mi.fm.lo.LibraryFinder/CORE]: Found JAR manifest_jar at path C:\Users\Ryan-James\.gradle\caches\modules-2\files-2.1\net.minecrell\terminalconsoleappender\1.2.0\96d02cd3b384ff015a8fef4223bcb4ccf1717c95\terminalconsoleappender-1.2.0.jar
[11:38:12] [main/DEBUG] [ne.mi.fm.lo.LibraryFinder/CORE]: Found JAR manifest_jar at path C:\Users\Ryan-James\.gradle\caches\modules-2\files-2.1\org.apache.logging.log4j\log4j-core\2.15.0\ba55c13d7ac2fd44df9cc8074455719a33f375b9\log4j-core-2.15.0.jar
[11:38:12] [main/DEBUG] [ne.mi.fm.lo.LibraryFinder/CORE]: Found JAR manifest_jar at path C:\Users\Ryan-James\.gradle\caches\modules-2\files-2.1\org.apache.logging.log4j\log4j-api\2.15.0\4a5aa7e55a29391c6f66e0b259d5189aa11e45d0\log4j-api-2.15.0.jar
[11:38:12] [main/DEBUG] [ne.mi.fm.lo.LibraryFinder/CORE]: Found JAR manifest_jar at path C:\Users\Ryan-James\.gradle\caches\modules-2\files-2.1\net.sf.jopt-simple\jopt-simple\5.0.4\4fdac2fbe92dfad86aa6e9301736f6b4342a3f5c\jopt-simple-5.0.4.jar
[11:38:12] [main/DEBUG] [ne.mi.fm.lo.LibraryFinder/CORE]: Found JAR manifest_jar at path C:\Users\Ryan-James\.gradle\caches\modules-2\files-2.1\org.spongepowered\mixin\0.8.4\4ec7d77d9ab32596ca0b78bb123956734767e3a\mixin-0.8.4.jar
[11:38:12] [main/DEBUG] [ne.mi.fm.lo.LibraryFinder/CORE]: Found JAR manifest_jar at path C:\Users\Ryan-James\.gradle\caches\modules-2\files-2.1\net.minecraftforge\nashorn-core-compat\15.1.1.1\1817deb38a5a8811148dca0d23161d92bdbd6184\nashorn-core-compat-15.1.1.1.jar
[11:38:12] [main/DEBUG] [ne.mi.fm.lo.LibraryFinder/CORE]: Found JAR manifest_jar at path C:\Users\Ryan-James\.gradle\caches\modules-2\files-2.1\com.mojang\patchy\1.3.9\eb8bb7b66fa0e2152b1b40b3856e82f7619439ee\patchy-1.3.9.jar
[11:38:12] [main/DEBUG] [ne.mi.fm.lo.LibraryFinder/CORE]: Found JAR manifest_jar at path C:\Users\Ryan-James\.gradle\caches\modules-2\files-2.1\oshi-project\oshi-core\1.1\9ddf7b048a8d701be231c0f4f95fd986198fd2d8\oshi-core-1.1.jar
[11:38:12] [main/DEBUG] [ne.mi.fm.lo.LibraryFinder/CORE]: Found JAR manifest_jar at path C:\Users\Ryan-James\.gradle\caches\modules-2\files-2.1\net.java.dev.jna\jna\4.4.0\cb208278274bf12ebdb56c61bd7407e6f774d65a\jna-4.4.0.jar
[11:38:12] [main/DEBUG] [ne.mi.fm.lo.LibraryFinder/CORE]: Found JAR manifest_jar at path C:\Users\Ryan-James\.gradle\caches\modules-2\files-2.1\net.java.dev.jna\platform\3.4.0\e3f70017be8100d3d6923f50b3d2ee17714e9c13\platform-3.4.0.jar
[11:38:12] [main/DEBUG] [ne.mi.fm.lo.LibraryFinder/CORE]: Found JAR manifest_jar at path C:\Users\Ryan-James\.gradle\caches\modules-2\files-2.1\com.ibm.icu\icu4j\66.1\72c7519b6d91f7a1f993bd44a99fe95d67211b27\icu4j-66.1.jar
[11:38:12] [main/DEBUG] [ne.mi.fm.lo.LibraryFinder/CORE]: Found JAR manifest_jar at path C:\Users\Ryan-James\.gradle\caches\modules-2\files-2.1\com.mojang\javabridge\1.0.22\6aa6453aa99a52a5cd91749da1af6ab70e082ab3\javabridge-1.0.22.jar
[11:38:12] [main/DEBUG] [ne.mi.fm.lo.LibraryFinder/CORE]: Found JAR manifest_jar at path C:\Users\Ryan-James\.gradle\caches\modules-2\files-2.1\io.netty\netty-all\4.1.25.Final\d0626cd3108294d1d58c05859add27b4ef21f83b\netty-all-4.1.25.Final.jar
[11:38:12] [main/DEBUG] [ne.mi.fm.lo.LibraryFinder/CORE]: Found JAR manifest_jar at path C:\Users\Ryan-James\.gradle\caches\modules-2\files-2.1\com.google.guava\guava\21.0\3a3d111be1be1b745edfa7d91678a12d7ed38709\guava-21.0.jar
[11:38:12] [main/DEBUG] [ne.mi.fm.lo.LibraryFinder/CORE]: Found JAR manifest_jar at path C:\Users\Ryan-James\.gradle\caches\modules-2\files-2.1\org.apache.commons\commons-lang3\3.8.1\6505a72a097d9270f7a9e7bf42c4238283247755\commons-lang3-3.8.1.jar
[11:38:12] [main/DEBUG] [ne.mi.fm.lo.LibraryFinder/CORE]: Found JAR manifest_jar at path C:\Users\Ryan-James\.gradle\caches\modules-2\files-2.1\commons-io\commons-io\2.5\2852e6e05fbb95076fc091f6d1780f1f8fe35e0f\commons-io-2.5.jar
[11:38:12] [main/DEBUG] [ne.mi.fm.lo.LibraryFinder/CORE]: Found JAR manifest_jar at path C:\Users\Ryan-James\.gradle\caches\modules-2\files-2.1\org.apache.httpcomponents\httpclient\4.3.3\18f4247ff4572a074444572cee34647c43e7c9c7\httpclient-4.3.3.jar
[11:38:12] [main/DEBUG] [ne.mi.fm.lo.LibraryFinder/CORE]: Found JAR manifest_jar at path C:\Users\Ryan-James\.gradle\caches\modules-2\files-2.1\commons-codec\commons-codec\1.10\4b95f4897fa13f2cd904aee711aeafc0c5295cd8\commons-codec-1.10.jar
[11:38:12] [main/DEBUG] [ne.mi.fm.lo.LibraryFinder/CORE]: Found JAR manifest_jar at path C:\Users\Ryan-James\.gradle\caches\modules-2\files-2.1\net.java.jinput\jinput\2.0.5\39c7796b469a600f72380316f6b1f11db6c2c7c4\jinput-2.0.5.jar
[11:38:12] [main/DEBUG] [ne.mi.fm.lo.LibraryFinder/CORE]: Found JAR manifest_jar at path C:\Users\Ryan-James\.gradle\caches\modules-2\files-2.1\net.java.jutils\jutils\1.0.0\e12fe1fda814bd348c1579329c86943d2cd3c6a6\jutils-1.0.0.jar
[11:38:12] [main/DEBUG] [ne.mi.fm.lo.LibraryFinder/CORE]: Found JAR manifest_jar at path C:\Users\Ryan-James\.gradle\caches\modules-2\files-2.1\com.mojang\brigadier\1.0.17\c6b7dc51dd44379cc751b7504816006e9be4b1e6\brigadier-1.0.17.jar
[11:38:12] [main/DEBUG] [ne.mi.fm.lo.LibraryFinder/CORE]: Found JAR manifest_jar at path C:\Users\Ryan-James\.gradle\caches\modules-2\files-2.1\com.mojang\datafixerupper\4.0.26\ebd6690f33871ccee9b6132c6480668ee2e35020\datafixerupper-4.0.26.jar
[11:38:12] [main/DEBUG] [ne.mi.fm.lo.LibraryFinder/CORE]: Found JAR manifest_jar at path C:\Users\Ryan-James\.gradle\caches\modules-2\files-2.1\com.google.code.gson\gson\2.8.0\c4ba5371a29ac9b2ad6129b1d39ea38750043eff\gson-2.8.0.jar
[11:38:12] [main/DEBUG] [ne.mi.fm.lo.LibraryFinder/CORE]: Found JAR manifest_jar at path C:\Users\Ryan-James\.gradle\caches\modules-2\files-2.1\com.mojang\authlib\2.1.28\ad54da276bf59983d02d5ed16fc14541354c71fd\authlib-2.1.28.jar
[11:38:12] [main/DEBUG] [ne.mi.fm.lo.LibraryFinder/CORE]: Found JAR manifest_jar at path C:\Users\Ryan-James\.gradle\caches\modules-2\files-2.1\org.apache.commons\commons-compress\1.8.1\a698750c16740fd5b3871425f4cb3bbaa87f529d\commons-compress-1.8.1.jar
[11:38:12] [main/DEBUG] [ne.mi.fm.lo.LibraryFinder/CORE]: Found JAR manifest_jar at path C:\Users\Ryan-James\.gradle\caches\modules-2\files-2.1\commons-logging\commons-logging\1.1.3\f6f66e966c70a83ffbdb6f17a0919eaf7c8aca7f\commons-logging-1.1.3.jar
[11:38:12] [main/DEBUG] [ne.mi.fm.lo.LibraryFinder/CORE]: Found JAR manifest_jar at path C:\Users\Ryan-James\.gradle\caches\modules-2\files-2.1\org.apache.httpcomponents\httpcore\4.3.2\31fbbff1ddbf98f3aa7377c94d33b0447c646b6e\httpcore-4.3.2.jar
[11:38:12] [main/DEBUG] [ne.mi.fm.lo.LibraryFinder/CORE]: Found JAR manifest_jar at path C:\Users\Ryan-James\.gradle\caches\modules-2\files-2.1\it.unimi.dsi\fastutil\8.2.1\5ad88f325e424f8dbc2be5459e21ea5cab3864e9\fastutil-8.2.1.jar
[11:38:12] [main/DEBUG] [ne.mi.fm.lo.LibraryFinder/CORE]: Found JAR manifest_jar at path C:\Users\Ryan-James\.gradle\caches\modules-2\files-2.1\org.lwjgl\lwjgl-jemalloc\3.2.2\ee8e57a79300f78294576d87c4a587f8c99402e2\lwjgl-jemalloc-3.2.2.jar
[11:38:12] [main/DEBUG] [ne.mi.fm.lo.LibraryFinder/CORE]: Found JAR manifest_jar at path C:\Users\Ryan-James\.gradle\caches\modules-2\files-2.1\org.lwjgl\lwjgl-jemalloc\3.2.2\338b25b99da3ba5f441f6492f2ce2a9c608860ed\lwjgl-jemalloc-3.2.2-natives-windows.jar
[11:38:12] [main/DEBUG] [ne.mi.fm.lo.LibraryFinder/CORE]: Found JAR manifest_jar at path C:\Users\Ryan-James\.gradle\caches\modules-2\files-2.1\org.lwjgl\lwjgl-openal\3.2.2\2b772a102b0a11ee5f2109a5b136f4dc7c630827\lwjgl-openal-3.2.2.jar
[11:38:12] [main/DEBUG] [ne.mi.fm.lo.LibraryFinder/CORE]: Found JAR manifest_jar at path C:\Users\Ryan-James\.gradle\caches\modules-2\files-2.1\org.lwjgl\lwjgl-openal\3.2.2\ec20a7d42a2438528fca87e60b1705f1e2339ddb\lwjgl-openal-3.2.2-natives-windows.jar
[11:38:12] [main/DEBUG] [ne.mi.fm.lo.LibraryFinder/CORE]: Found JAR manifest_jar at path C:\Users\Ryan-James\.gradle\caches\modules-2\files-2.1\org.lwjgl\lwjgl-opengl\3.2.2\6ac5bb88b44c43ea195a570aab059f63da004cd8\lwjgl-opengl-3.2.2.jar
[11:38:12] [main/DEBUG] [ne.mi.fm.lo.LibraryFinder/CORE]: Found JAR manifest_jar at path C:\Users\Ryan-James\.gradle\caches\modules-2\files-2.1\org.lwjgl\lwjgl-opengl\3.2.2\d8dcdc91066cae2d2d8279cb4a9f9f05d9525826\lwjgl-opengl-3.2.2-natives-windows.jar
[11:38:12] [main/DEBUG] [ne.mi.fm.lo.LibraryFinder/CORE]: Found JAR manifest_jar at path C:\Users\Ryan-James\.gradle\caches\modules-2\files-2.1\org.lwjgl\lwjgl-glfw\3.2.2\d3ad4df38e400b8afba1de63f84338809399df5b\lwjgl-glfw-3.2.2.jar
[11:38:12] [main/DEBUG] [ne.mi.fm.lo.LibraryFinder/CORE]: Found JAR manifest_jar at path C:\Users\Ryan-James\.gradle\caches\modules-2\files-2.1\org.lwjgl\lwjgl-glfw\3.2.2\dc6826d636bf796b33a49038c354210e661bfc17\lwjgl-glfw-3.2.2-natives-windows.jar
[11:38:12] [main/DEBUG] [ne.mi.fm.lo.LibraryFinder/CORE]: Found JAR manifest_jar at path C:\Users\Ryan-James\.gradle\caches\modules-2\files-2.1\org.lwjgl\lwjgl-stb\3.2.2\3b8e6ebc5851dd3d17e37e5cadce2eff2a429f0f\lwjgl-stb-3.2.2.jar
[11:38:12] [main/DEBUG] [ne.mi.fm.lo.LibraryFinder/CORE]: Found JAR manifest_jar at path C:\Users\Ryan-James\.gradle\caches\modules-2\files-2.1\org.lwjgl\lwjgl-stb\3.2.2\811f705cbb29e8ae8d60bdf8fdd38c0c123ad3ef\lwjgl-stb-3.2.2-natives-windows.jar
[11:38:12] [main/DEBUG] [ne.mi.fm.lo.LibraryFinder/CORE]: Found JAR manifest_jar at path C:\Users\Ryan-James\.gradle\caches\modules-2\files-2.1\org.lwjgl\lwjgl-tinyfd\3.2.2\fcbe606c8f8da6f8f9a05e2c540eb1ee8632b0e9\lwjgl-tinyfd-3.2.2.jar
[11:38:12] [main/DEBUG] [ne.mi.fm.lo.LibraryFinder/CORE]: Found JAR manifest_jar at path C:\Users\Ryan-James\.gradle\caches\modules-2\files-2.1\org.lwjgl\lwjgl-tinyfd\3.2.2\e9115958773644e863332a6a06488d26f9e1fc9f\lwjgl-tinyfd-3.2.2-natives-windows.jar
[11:38:12] [main/DEBUG] [ne.mi.fm.lo.LibraryFinder/CORE]: Found JAR manifest_jar at path C:\Users\Ryan-James\.gradle\caches\modules-2\files-2.1\org.lwjgl\lwjgl\3.2.2\8ad6294407e15780b43e84929c40e4c5e997972e\lwjgl-3.2.2.jar
[11:38:12] [main/DEBUG] [ne.mi.fm.lo.LibraryFinder/CORE]: Found JAR manifest_jar at path C:\Users\Ryan-James\.gradle\caches\modules-2\files-2.1\org.lwjgl\lwjgl\3.2.2\5359f3aa50d36352815fc662ea73e1c00d22170\lwjgl-3.2.2-natives-windows.jar
[11:38:12] [main/DEBUG] [ne.mi.fm.lo.LibraryFinder/CORE]: Found JAR manifest_jar at path C:\Users\Ryan-James\.gradle\caches\modules-2\files-2.1\com.mojang\text2speech\1.11.3\f378f889797edd7df8d32272c06ca80a1b6b0f58\text2speech-1.11.3.jar
[11:38:12] [main/DEBUG] [ne.mi.fm.lo.LibraryFinder/CORE]: Found JAR manifest_jar at path C:\Users\Ryan-James\.gradle\caches\modules-2\files-2.1\com.mojang\text2speech\1.11.3\c0b242c0091be5acbf303263c7eeeaedd70544c7\text2speech-1.11.3-natives-windows.jar
[11:38:12] [main/DEBUG] [ne.mi.fm.lo.LibraryFinder/CORE]: Found JAR manifest_jar at path C:\Users\Ryan-James\.gradle\caches\modules-2\files-2.1\org.codehaus.plexus\plexus-utils\3.2.1\13b015768e0d04849d2794e4c47eb02d01a0de32\plexus-utils-3.2.1.jar
[11:38:12] [main/DEBUG] [ne.mi.fm.lo.LibraryFinder/CORE]: Found JAR manifest_jar at path C:\Users\Ryan-James\.gradle\caches\modules-2\files-2.1\org.slf4j\slf4j-api\1.8.0-beta4\83b0359d847ee053d745be7ec0d8e9e8a44304b4\slf4j-api-1.8.0-beta4.jar
[11:38:12] [main/DEBUG] [ne.mi.fm.lo.LibraryFinder/CORE]: Found JAR manifest_jar at path C:\Users\Ryan-James\.gradle\caches\modules-2\files-2.1\org.jline\jline-reader\3.12.1\4382ab1382c7b6f379377ed5f665dc2f6e1218bc\jline-reader-3.12.1.jar
[11:38:12] [main/DEBUG] [ne.mi.fm.lo.LibraryFinder/CORE]: Found JAR manifest_jar at path C:\Users\Ryan-James\.gradle\caches\modules-2\files-2.1\org.jline\jline-terminal\3.12.1\c777448314e050d980a6b697c140f3bfe9eb7416\jline-terminal-3.12.1.jar
[11:38:13] [main/DEBUG] [ne.mi.fm.lo.mo.ModListHandler/CORE]: Found mod coordinates from lists: []
[11:38:13] [main/DEBUG] [ne.mi.fm.lo.mo.ModDiscoverer/CORE]: Found Mod Locators : (userdev classpath:null),(mods folder:null),(maven libs:null),(exploded directory:null),(minecraft:null)
[11:38:13] [main/DEBUG] [ne.mi.fm.lo.mo.ExplodedDirectoryLocator/LOADING]: Found exploded directory mod manifest at C:\Users\Ryan-James\Desktop\mc mod\build\resources\main\META-INF\mods.toml
[11:38:13] [main/DEBUG] [ne.mi.fm.lo.mo.ModFileParser/LOADING]: Considering mod file candidate C:\Users\Ryan-James\.gradle\caches\forge_gradle\minecraft_user_repo\net\minecraftforge\forge\1.16.5-36.2.20_mapped_snapshot_20210309-1.16.5\forge-1.16.5-36.2.20_mapped_snapshot_20210309-1.16.5-recomp.jar
[11:38:13] [main/DEBUG] [ne.mi.fm.lo.mo.ModFileInfo/LOADING]: Found valid mod file forge-1.16.5-36.2.20_mapped_snapshot_20210309-1.16.5-recomp.jar with {forge} mods - versions {36.2.20}
[11:38:13] [main/DEBUG] [ne.mi.fm.lo.mo.ModFile/LOADING]: Loading mod file C:\Users\Ryan-James\.gradle\caches\forge_gradle\minecraft_user_repo\net\minecraftforge\forge\1.16.5-36.2.20_mapped_snapshot_20210309-1.16.5\forge-1.16.5-36.2.20_mapped_snapshot_20210309-1.16.5-recomp.jar with language javafml
[11:38:13] [main/DEBUG] [ne.mi.fm.lo.mo.ModFileParser/LOADING]: Found coremod fieldtomethodtransformers with Javascript path META-INF/fieldtomethodtransformers.js
[11:38:13] [main/DEBUG] [ne.mi.fm.lo.mo.ModFileParser/LOADING]: Found coremod field_to_instanceof with Javascript path coremods/field_to_instanceof.js
[11:38:13] [main/DEBUG] [ne.mi.fm.lo.mo.ModFileParser/LOADING]: Found coremod add_bouncer_method with Javascript path coremods/add_bouncer_method.js
[11:38:13] [main/DEBUG] [ne.mi.fm.lo.mo.ModFile/LOADING]: Found coremod META-INF/fieldtomethodtransformers.js
[11:38:13] [main/DEBUG] [ne.mi.fm.lo.mo.ModFile/LOADING]: Found coremod coremods/field_to_instanceof.js
[11:38:13] [main/DEBUG] [ne.mi.fm.lo.mo.ModFile/LOADING]: Found coremod coremods/add_bouncer_method.js
[11:38:13] [main/DEBUG] [ne.mi.fm.lo.mo.ModFileParser/LOADING]: Considering mod file candidate C:\Users\Ryan-James\Desktop\mc mod\build\resources\main
[11:38:13] [main/DEBUG] [ne.mi.fm.lo.mo.ModFileInfo/LOADING]: Found valid mod file main with {tutorialmod} mods - versions {NONE}
[11:38:13] [main/DEBUG] [ne.mi.fm.lo.mo.ModFile/LOADING]: Loading mod file C:\Users\Ryan-James\Desktop\mc mod\build\resources\main with language javafml
[11:38:13] [main/DEBUG] [ne.mi.fm.lo.mo.ModFileParser/LOADING]: Considering mod file candidate C:\Users\Ryan-James\.gradle\caches\forge_gradle\minecraft_repo\versions\1.16.5\client-extra.jar
[11:38:13] [main/DEBUG] [ne.mi.fm.lo.mo.ModFileInfo/LOADING]: Found valid mod file client-extra.jar with {minecraft} mods - versions {1.16.5}
[11:38:13] [main/DEBUG] [ne.mi.fm.lo.mo.ModFile/LOADING]: Loading mod file C:\Users\Ryan-James\.gradle\caches\forge_gradle\minecraft_repo\versions\1.16.5\client-extra.jar with language minecraft
[11:38:13] [main/DEBUG] [ne.mi.fm.lo.ModSorter/LOADING]: Found 0 mod requirements (0 mandatory, 0 optional)
[11:38:13] [main/DEBUG] [ne.mi.fm.lo.ModSorter/LOADING]: Found 0 mod requirements missing (0 mandatory, 0 optional)
[11:38:14] [main/DEBUG] [ne.mi.us.MCPNamingService/CORE]: Loaded 13368 method mappings from methods.csv
[11:38:14] [main/DEBUG] [ne.mi.us.MCPNamingService/CORE]: Loaded 16530 field mappings from fields.csv
[11:38:14] [main/DEBUG] [cp.mo.mo.TransformationServiceDecorator/MODLAUNCHER]: End scan trigger - transformation service fml
[11:38:14] [main/DEBUG] [cp.mo.mo.TransformationServicesHandler/MODLAUNCHER]: Transformation services loading transformers
[11:38:14] [main/DEBUG] [cp.mo.mo.TransformationServiceDecorator/MODLAUNCHER]: Initializing transformers for transformation service mixin
[11:38:14] [main/DEBUG] [cp.mo.mo.TransformationServiceDecorator/MODLAUNCHER]: Initialized transformers for transformation service mixin
[11:38:14] [main/DEBUG] [cp.mo.mo.TransformationServiceDecorator/MODLAUNCHER]: Initializing transformers for transformation service fml
[11:38:14] [main/DEBUG] [ne.mi.fm.lo.FMLServiceProvider/CORE]: Loading coremod transformers
[11:38:14] [main/DEBUG] [ne.mi.co.CoreModEngine/COREMOD]: Loading CoreMod from META-INF/fieldtomethodtransformers.js
[11:38:14] [main/DEBUG] [ne.mi.co.CoreModEngine/COREMOD]: CoreMod loaded successfully
[11:38:14] [main/DEBUG] [ne.mi.co.CoreModEngine/COREMOD]: Loading CoreMod from coremods/field_to_instanceof.js
[11:38:14] [main/DEBUG] [ne.mi.co.CoreModEngine/COREMOD]: CoreMod loaded successfully
[11:38:14] [main/DEBUG] [ne.mi.co.CoreModEngine/COREMOD]: Loading CoreMod from coremods/add_bouncer_method.js
[11:38:14] [main/DEBUG] [ne.mi.co.CoreModEngine/COREMOD]: CoreMod loaded successfully
[11:38:14] [main/DEBUG] [cp.mo.mo.TransformStore/MODLAUNCHER]: Adding transformer net.minecraftforge.coremod.transformer.CoreModMethodTransformer@6b63d445 to Target : METHOD {Lnet/minecraft/client/entity/player/AbstractClientPlayerEntity;} {getFovModifier} {()F}
[11:38:14] [main/DEBUG] [cp.mo.mo.TransformStore/MODLAUNCHER]: Adding transformer net.minecraftforge.coremod.transformer.CoreModMethodTransformer@340b7ef6 to Target : METHOD {Lnet/minecraft/client/renderer/FirstPersonRenderer;} {renderItemInFirstPerson} {(FLcom/mojang/blaze3d/matrix/MatrixStack;Lnet/minecraft/client/renderer/IRenderTypeBuffer$Impl;Lnet/minecraft/client/entity/player/ClientPlayerEntity;I)V}
[11:38:14] [main/DEBUG] [cp.mo.mo.TransformStore/MODLAUNCHER]: Adding transformer net.minecraftforge.coremod.transformer.CoreModMethodTransformer@30404dba to Target : METHOD {Lnet/minecraft/client/renderer/entity/model/SkeletonModel;} {setLivingAnimations} {(Lnet/minecraft/entity/MobEntity;FFF)V}
[11:38:14] [main/DEBUG] [cp.mo.mo.TransformStore/MODLAUNCHER]: Adding transformer net.minecraftforge.coremod.transformer.CoreModMethodTransformer@6050462a to Target : METHOD {Lnet/minecraft/client/renderer/entity/model/SkeletonModel;} {setRotationAngles} {(Lnet/minecraft/entity/MobEntity;FFFFF)V}
[11:38:14] [main/DEBUG] [cp.mo.mo.TransformStore/MODLAUNCHER]: Adding transformer net.minecraftforge.coremod.transformer.CoreModMethodTransformer@4c0884e8 to Target : METHOD {Lnet/minecraft/entity/monster/AbstractSkeletonEntity;} {func_230280_a_} {(Lnet/minecraft/item/ShootableItem;)Z}
[11:38:14] [main/DEBUG] [cp.mo.mo.TransformStore/MODLAUNCHER]: Adding transformer net.minecraftforge.coremod.transformer.CoreModMethodTransformer@231baf51 to Target : METHOD {Lnet/minecraft/entity/monster/AbstractSkeletonEntity;} {setCombatTask} {()V}
[11:38:14] [main/DEBUG] [cp.mo.mo.TransformStore/MODLAUNCHER]: Adding transformer net.minecraftforge.coremod.transformer.CoreModMethodTransformer@11841b15 to Target : METHOD {Lnet/minecraft/client/renderer/FirstPersonRenderer;} {renderItemInFirstPerson} {(FLcom/mojang/blaze3d/matrix/MatrixStack;Lnet/minecraft/client/renderer/IRenderTypeBuffer$Impl;Lnet/minecraft/client/entity/player/ClientPlayerEntity;I)V}
[11:38:14] [main/DEBUG] [cp.mo.mo.TransformStore/MODLAUNCHER]: Adding transformer net.minecraftforge.coremod.transformer.CoreModMethodTransformer@73877e19 to Target : METHOD {Lnet/minecraft/client/renderer/FirstPersonRenderer;} {renderItemInFirstPerson} {(Lnet/minecraft/client/entity/player/AbstractClientPlayerEntity;FFLnet/minecraft/util/Hand;FLnet/minecraft/item/ItemStack;FLcom/mojang/blaze3d/matrix/MatrixStack;Lnet/minecraft/client/renderer/IRenderTypeBuffer;I)V}
[11:38:14] [main/DEBUG] [cp.mo.mo.TransformStore/MODLAUNCHER]: Adding transformer net.minecraftforge.coremod.transformer.CoreModMethodTransformer@7b208b45 to Target : METHOD {Lnet/minecraft/client/renderer/entity/PlayerRenderer;} {func_241741_a_} {(Lnet/minecraft/client/entity/player/AbstractClientPlayerEntity;Lnet/minecraft/util/Hand;)Lnet/minecraft/client/renderer/entity/model/BipedModel$ArmPose;}
[11:38:14] [main/DEBUG] [cp.mo.mo.TransformStore/MODLAUNCHER]: Adding transformer net.minecraftforge.coremod.transformer.CoreModMethodTransformer@5bfc257 to Target : METHOD {Lnet/minecraft/entity/monster/PillagerEntity;} {func_230280_a_} {(Lnet/minecraft/item/ShootableItem;)Z}
[11:38:14] [main/DEBUG] [cp.mo.mo.TransformStore/MODLAUNCHER]: Adding transformer net.minecraftforge.coremod.transformer.CoreModMethodTransformer@34523d46 to Target : METHOD {Lnet/minecraft/entity/monster/PillagerEntity;} {func_241844_w} {(F)V}
[11:38:14] [main/DEBUG] [cp.mo.mo.TransformStore/MODLAUNCHER]: Adding transformer net.minecraftforge.coremod.transformer.CoreModMethodTransformer@7cedfa63 to Target : METHOD {Lnet/minecraft/entity/monster/piglin/PiglinEntity;} {shouldExchangeEquipment} {(Lnet/minecraft/item/ItemStack;Lnet/minecraft/item/ItemStack;)Z}
[11:38:14] [main/DEBUG] [cp.mo.mo.TransformStore/MODLAUNCHER]: Adding transformer net.minecraftforge.coremod.transformer.CoreModMethodTransformer@3e83c18 to Target : METHOD {Lnet/minecraft/entity/monster/piglin/PiglinEntity;} {func_230280_a_} {(Lnet/minecraft/item/ShootableItem;)Z}
[11:38:14] [main/DEBUG] [cp.mo.mo.TransformStore/MODLAUNCHER]: Adding transformer net.minecraftforge.coremod.transformer.CoreModMethodTransformer@783efb48 to Target : METHOD {Lnet/minecraft/item/CrossbowItem;} {func_220013_l} {(Lnet/minecraft/item/ItemStack;)F}
[11:38:14] [main/DEBUG] [cp.mo.mo.TransformStore/MODLAUNCHER]: Adding transformer net.minecraftforge.coremod.transformer.CoreModMethodTransformer@5d235104 to Target : METHOD {Lnet/minecraft/item/Item;} {isCrossbow} {(Lnet/minecraft/item/ItemStack;)Z}
[11:38:14] [main/DEBUG] [cp.mo.mo.TransformStore/MODLAUNCHER]: Adding transformer net.minecraftforge.coremod.transformer.CoreModMethodTransformer@4e8e8621 to Target : METHOD {Lnet/minecraft/client/renderer/FirstPersonRenderer;} {renderItemInFirstPerson} {(Lnet/minecraft/client/entity/player/AbstractClientPlayerEntity;FFLnet/minecraft/util/Hand;FLnet/minecraft/item/ItemStack;FLcom/mojang/blaze3d/matrix/MatrixStack;Lnet/minecraft/client/renderer/IRenderTypeBuffer;I)V}
[11:38:14] [main/DEBUG] [cp.mo.mo.TransformStore/MODLAUNCHER]: Adding transformer net.minecraftforge.coremod.transformer.CoreModMethodTransformer@c446b14 to Target : METHOD {Lnet/minecraft/entity/item/ItemFrameEntity;} {removeItem} {(Lnet/minecraft/item/ItemStack;)V}
[11:38:14] [main/DEBUG] [cp.mo.mo.TransformStore/MODLAUNCHER]: Adding transformer net.minecraftforge.coremod.transformer.CoreModMethodTransformer@3af356f to Target : METHOD {Lnet/minecraft/inventory/container/CartographyContainer$3;} {isItemValid} {(Lnet/minecraft/item/ItemStack;)Z}
[11:38:14] [main/DEBUG] [cp.mo.mo.TransformStore/MODLAUNCHER]: Adding transformer net.minecraftforge.coremod.transformer.CoreModMethodTransformer@4443ef6f to Target : METHOD {Lnet/minecraft/inventory/container/CartographyContainer;} {transferStackInSlot} {(Lnet/minecraft/entity/player/PlayerEntity;I)Lnet/minecraft/item/ItemStack;}
[11:38:14] [main/DEBUG] [cp.mo.mo.TransformStore/MODLAUNCHER]: Adding transformer net.minecraftforge.coremod.transformer.CoreModMethodTransformer@7e46d648 to Target : METHOD {Lnet/minecraft/item/ItemStack;} {getTooltip} {(Lnet/minecraft/entity/player/PlayerEntity;Lnet/minecraft/client/util/ITooltipFlag;)Ljava/util/List;}
[11:38:14] [main/DEBUG] [cp.mo.mo.TransformStore/MODLAUNCHER]: Adding transformer net.minecraftforge.coremod.transformer.CoreModMethodTransformer@51751e5f to Target : METHOD {Lnet/minecraft/client/renderer/entity/FishRenderer;} {render} {(Lnet/minecraft/entity/projectile/FishingBobberEntity;FFLcom/mojang/blaze3d/matrix/MatrixStack;Lnet/minecraft/client/renderer/IRenderTypeBuffer;I)V}
[11:38:14] [main/DEBUG] [cp.mo.mo.TransformStore/MODLAUNCHER]: Adding transformer net.minecraftforge.coremod.transformer.CoreModMethodTransformer@2b0b4d53 to Target : METHOD {Lnet/minecraft/entity/projectile/FishingBobberEntity;} {func_234600_a_} {(Lnet/minecraft/entity/player/PlayerEntity;)Z}
[11:38:14] [main/DEBUG] [cp.mo.mo.TransformStore/MODLAUNCHER]: Adding transformer net.minecraftforge.coremod.transformer.CoreModMethodTransformer@7068f7ca to Target : METHOD {Lnet/minecraft/block/BeehiveBlock;} {onBlockActivated} {(Lnet/minecraft/block/BlockState;Lnet/minecraft/world/World;Lnet/minecraft/util/math/BlockPos;Lnet/minecraft/entity/player/PlayerEntity;Lnet/minecraft/util/Hand;Lnet/minecraft/util/math/BlockRayTraceResult;)Lnet/minecraft/util/ActionResultType;}
[11:38:14] [main/DEBUG] [cp.mo.mo.TransformStore/MODLAUNCHER]: Adding transformer net.minecraftforge.coremod.transformer.CoreModMethodTransformer@38548b19 to Target : METHOD {Lnet/minecraft/block/PumpkinBlock;} {onBlockActivated} {(Lnet/minecraft/block/BlockState;Lnet/minecraft/world/World;Lnet/minecraft/util/math/BlockPos;Lnet/minecraft/entity/player/PlayerEntity;Lnet/minecraft/util/Hand;Lnet/minecraft/util/math/BlockRayTraceResult;)Lnet/minecraft/util/ActionResultType;}
[11:38:14] [main/DEBUG] [cp.mo.mo.TransformStore/MODLAUNCHER]: Adding transformer net.minecraftforge.coremod.transformer.CoreModMethodTransformer@41aaedaa to Target : METHOD {Lnet/minecraft/block/TripWireBlock;} {onBlockHarvested} {(Lnet/minecraft/world/World;Lnet/minecraft/util/math/BlockPos;Lnet/minecraft/block/BlockState;Lnet/minecraft/entity/player/PlayerEntity;)V}
[11:38:14] [main/DEBUG] [cp.mo.mo.TransformStore/MODLAUNCHER]: Adding transformer net.minecraftforge.coremod.transformer.CoreModMethodTransformer@303a5119 to Target : METHOD {Lnet/minecraft/enchantment/EfficiencyEnchantment;} {canApply} {(Lnet/minecraft/item/ItemStack;)Z}
[11:38:14] [main/DEBUG] [cp.mo.mo.TransformStore/MODLAUNCHER]: Adding transformer net.minecraftforge.coremod.transformer.CoreModMethodTransformer@75b3673 to Target : METHOD {Lnet/minecraft/entity/passive/MooshroomEntity;} {getEntityInteractionResult} {(Lnet/minecraft/entity/player/PlayerEntity;Lnet/minecraft/util/Hand;)Lnet/minecraft/util/ActionResultType;}
[11:38:14] [main/DEBUG] [cp.mo.mo.TransformStore/MODLAUNCHER]: Adding transformer net.minecraftforge.coremod.transformer.CoreModMethodTransformer@1bcb79c2 to Target : METHOD {Lnet/minecraft/entity/passive/SheepEntity;} {getEntityInteractionResult} {(Lnet/minecraft/entity/player/PlayerEntity;Lnet/minecraft/util/Hand;)Lnet/minecraft/util/ActionResultType;}
[11:38:14] [main/DEBUG] [cp.mo.mo.TransformStore/MODLAUNCHER]: Adding transformer net.minecraftforge.coremod.transformer.CoreModMethodTransformer@d1a10ac to Target : METHOD {Lnet/minecraft/entity/passive/SnowGolemEntity;} {getEntityInteractionResult} {(Lnet/minecraft/entity/player/PlayerEntity;Lnet/minecraft/util/Hand;)Lnet/minecraft/util/ActionResultType;}
[11:38:14] [main/DEBUG] [cp.mo.mo.TransformStore/MODLAUNCHER]: Adding transformer net.minecraftforge.coremod.transformer.CoreModClassTransformer@31fc71ab to Target : CLASS {Lnet/minecraft/potion/EffectInstance;} {} {V}
[11:38:14] [main/DEBUG] [cp.mo.mo.TransformStore/MODLAUNCHER]: Adding transformer net.minecraftforge.coremod.transformer.CoreModClassTransformer@71391b3f to Target : CLASS {Lnet/minecraft/block/FlowingFluidBlock;} {} {V}
[11:38:14] [main/DEBUG] [cp.mo.mo.TransformStore/MODLAUNCHER]: Adding transformer net.minecraftforge.coremod.transformer.CoreModClassTransformer@2cfbeac4 to Target : CLASS {Lnet/minecraft/item/BucketItem;} {} {V}
[11:38:14] [main/DEBUG] [cp.mo.mo.TransformStore/MODLAUNCHER]: Adding transformer net.minecraftforge.coremod.transformer.CoreModClassTransformer@12db3386 to Target : CLASS {Lnet/minecraft/block/StairsBlock;} {} {V}
[11:38:14] [main/DEBUG] [cp.mo.mo.TransformStore/MODLAUNCHER]: Adding transformer net.minecraftforge.coremod.transformer.CoreModClassTransformer@4078695f to Target : CLASS {Lnet/minecraft/block/FlowerPotBlock;} {} {V}
[11:38:14] [main/DEBUG] [cp.mo.mo.TransformStore/MODLAUNCHER]: Adding transformer net.minecraftforge.coremod.transformer.CoreModClassTransformer@79a1728c to Target : CLASS {Lnet/minecraft/item/FishBucketItem;} {} {V}
[11:38:14] [main/DEBUG] [cp.mo.mo.TransformStore/MODLAUNCHER]: Adding transformer net.minecraftforge.coremod.transformer.CoreModClassTransformer@a7f0ab6 to Target : CLASS {Lnet/minecraft/item/ItemStack;} {} {V}
[11:38:14] [main/DEBUG] [cp.mo.mo.TransformStore/MODLAUNCHER]: Adding transformer net.minecraftforge.coremod.transformer.CoreModClassTransformer@41f35f7c to Target : CLASS {Lnet/minecraft/network/play/client/CClientSettingsPacket;} {} {V}
[11:38:14] [main/DEBUG] [cp.mo.mo.TransformationServiceDecorator/MODLAUNCHER]: Initialized transformers for transformation service fml
[11:38:14] [main/DEBUG] [mixin/]: Processing prepare() for PlatformAgent[MixinPlatformAgentDefault:ModLauncher Root Container(ModLauncher:4f56a0a2)]
[11:38:14] [main/DEBUG] [mixin/]: Processing launch tasks for PlatformAgent[MixinPlatformAgentDefault:ModLauncher Root Container(ModLauncher:4f56a0a2)]
[11:38:14] [main/DEBUG] [mixin/]: Adding mixin platform agents for container ContainerHandleModLauncher.Resource(client-extra.jar:C:\Users\Ryan-James\.gradle\caches\forge_gradle\minecraft_repo\versions\1.16.5\client-extra.jar)
[11:38:14] [main/DEBUG] [mixin/]: Instancing new MixinPlatformAgentMinecraftForge for ContainerHandleModLauncher.Resource(client-extra.jar:C:\Users\Ryan-James\.gradle\caches\forge_gradle\minecraft_repo\versions\1.16.5\client-extra.jar)
[11:38:14] [main/DEBUG] [mixin/]: MixinPlatformAgentMinecraftForge rejected container ContainerHandleModLauncher.Resource(client-extra.jar:C:\Users\Ryan-James\.gradle\caches\forge_gradle\minecraft_repo\versions\1.16.5\client-extra.jar)
[11:38:14] [main/DEBUG] [mixin/]: Instancing new MixinPlatformAgentDefault for ContainerHandleModLauncher.Resource(client-extra.jar:C:\Users\Ryan-James\.gradle\caches\forge_gradle\minecraft_repo\versions\1.16.5\client-extra.jar)
[11:38:14] [main/DEBUG] [mixin/]: MixinPlatformAgentDefault accepted container ContainerHandleModLauncher.Resource(client-extra.jar:C:\Users\Ryan-James\.gradle\caches\forge_gradle\minecraft_repo\versions\1.16.5\client-extra.jar)
[11:38:14] [main/DEBUG] [mixin/]: Processing prepare() for PlatformAgent[MixinPlatformAgentDefault:ContainerHandleModLauncher.Resource(client-extra.jar:C:\Users\Ryan-James\.gradle\caches\forge_gradle\minecraft_repo\versions\1.16.5\client-extra.jar)]
[11:38:14] [main/DEBUG] [mixin/]: Adding mixin platform agents for container ContainerHandleModLauncher.Resource(forge-1.16.5-36.2.20_mapped_snapshot_20210309-1.16.5-recomp.jar:C:\Users\Ryan-James\.gradle\caches\forge_gradle\minecraft_user_repo\net\minecraftforge\forge\1.16.5-36.2.20_mapped_snapshot_20210309-1.16.5\forge-1.16.5-36.2.20_mapped_snapshot_20210309-1.16.5-recomp.jar)
[11:38:14] [main/DEBUG] [mixin/]: Instancing new MixinPlatformAgentMinecraftForge for ContainerHandleModLauncher.Resource(forge-1.16.5-36.2.20_mapped_snapshot_20210309-1.16.5-recomp.jar:C:\Users\Ryan-James\.gradle\caches\forge_gradle\minecraft_user_repo\net\minecraftforge\forge\1.16.5-36.2.20_mapped_snapshot_20210309-1.16.5\forge-1.16.5-36.2.20_mapped_snapshot_20210309-1.16.5-recomp.jar)
[11:38:14] [main/DEBUG] [mixin/]: MixinPlatformAgentMinecraftForge rejected container ContainerHandleModLauncher.Resource(forge-1.16.5-36.2.20_mapped_snapshot_20210309-1.16.5-recomp.jar:C:\Users\Ryan-James\.gradle\caches\forge_gradle\minecraft_user_repo\net\minecraftforge\forge\1.16.5-36.2.20_mapped_snapshot_20210309-1.16.5\forge-1.16.5-36.2.20_mapped_snapshot_20210309-1.16.5-recomp.jar)
[11:38:14] [main/DEBUG] [mixin/]: Instancing new MixinPlatformAgentDefault for ContainerHandleModLauncher.Resource(forge-1.16.5-36.2.20_mapped_snapshot_20210309-1.16.5-recomp.jar:C:\Users\Ryan-James\.gradle\caches\forge_gradle\minecraft_user_repo\net\minecraftforge\forge\1.16.5-36.2.20_mapped_snapshot_20210309-1.16.5\forge-1.16.5-36.2.20_mapped_snapshot_20210309-1.16.5-recomp.jar)
[11:38:14] [main/DEBUG] [mixin/]: MixinPlatformAgentDefault accepted container ContainerHandleModLauncher.Resource(forge-1.16.5-36.2.20_mapped_snapshot_20210309-1.16.5-recomp.jar:C:\Users\Ryan-James\.gradle\caches\forge_gradle\minecraft_user_repo\net\minecraftforge\forge\1.16.5-36.2.20_mapped_snapshot_20210309-1.16.5\forge-1.16.5-36.2.20_mapped_snapshot_20210309-1.16.5-recomp.jar)
[11:38:14] [main/DEBUG] [mixin/]: Processing prepare() for PlatformAgent[MixinPlatformAgentDefault:ContainerHandleModLauncher.Resource(forge-1.16.5-36.2.20_mapped_snapshot_20210309-1.16.5-recomp.jar:C:\Users\Ryan-James\.gradle\caches\forge_gradle\minecraft_user_repo\net\minecraftforge\forge\1.16.5-36.2.20_mapped_snapshot_20210309-1.16.5\forge-1.16.5-36.2.20_mapped_snapshot_20210309-1.16.5-recomp.jar)]
[11:38:14] [main/DEBUG] [mixin/]: Adding mixin platform agents for container ContainerHandleModLauncher.Resource(main:C:\Users\Ryan-James\Desktop\mc mod\build\resources\main)
[11:38:14] [main/DEBUG] [mixin/]: Instancing new MixinPlatformAgentMinecraftForge for ContainerHandleModLauncher.Resource(main:C:\Users\Ryan-James\Desktop\mc mod\build\resources\main)
[11:38:14] [main/DEBUG] [mixin/]: MixinPlatformAgentMinecraftForge rejected container ContainerHandleModLauncher.Resource(main:C:\Users\Ryan-James\Desktop\mc mod\build\resources\main)
[11:38:14] [main/DEBUG] [mixin/]: Instancing new MixinPlatformAgentDefault for ContainerHandleModLauncher.Resource(main:C:\Users\Ryan-James\Desktop\mc mod\build\resources\main)
[11:38:14] [main/DEBUG] [mixin/]: MixinPlatformAgentDefault accepted container ContainerHandleModLauncher.Resource(main:C:\Users\Ryan-James\Desktop\mc mod\build\resources\main)
[11:38:14] [main/DEBUG] [mixin/]: Processing prepare() for PlatformAgent[MixinPlatformAgentDefault:ContainerHandleModLauncher.Resource(main:C:\Users\Ryan-James\Desktop\mc mod\build\resources\main)]
[11:38:14] [main/DEBUG] [mixin/]: inject() running with 4 agents
[11:38:14] [main/DEBUG] [mixin/]: Processing inject() for PlatformAgent[MixinPlatformAgentDefault:ModLauncher Root Container(ModLauncher:4f56a0a2)]
[11:38:14] [main/DEBUG] [mixin/]: Processing inject() for PlatformAgent[MixinPlatformAgentDefault:ContainerHandleModLauncher.Resource(client-extra.jar:C:\Users\Ryan-James\.gradle\caches\forge_gradle\minecraft_repo\versions\1.16.5\client-extra.jar)]
[11:38:14] [main/DEBUG] [mixin/]: Processing inject() for PlatformAgent[MixinPlatformAgentDefault:ContainerHandleModLauncher.Resource(forge-1.16.5-36.2.20_mapped_snapshot_20210309-1.16.5-recomp.jar:C:\Users\Ryan-James\.gradle\caches\forge_gradle\minecraft_user_repo\net\minecraftforge\forge\1.16.5-36.2.20_mapped_snapshot_20210309-1.16.5\forge-1.16.5-36.2.20_mapped_snapshot_20210309-1.16.5-recomp.jar)]
[11:38:14] [main/DEBUG] [mixin/]: Processing inject() for PlatformAgent[MixinPlatformAgentDefault:ContainerHandleModLauncher.Resource(main:C:\Users\Ryan-James\Desktop\mc mod\build\resources\main)]
[11:38:14] [main/INFO] [cp.mo.mo.LaunchServiceHandler/MODLAUNCHER]: Launching target 'fmluserdevclient' with arguments [--version, MOD_DEV, --gameDir, ., --assetsDir, C:\Users\Ryan-James\.gradle\caches\forge_gradle\assets, --assetIndex, 1.16, --username, Dev, --accessToken, ????????, --userProperties, {}]
[11:38:14] [main/DEBUG] [ne.mi.us.FMLUserdevClientLaunchProvider/CORE]: Launching minecraft in cpw.mods.modlauncher.TransformingClassLoader@53692008 with arguments [--version, MOD_DEV, --gameDir, ., --assetsDir, C:\Users\Ryan-James\.gradle\caches\forge_gradle\assets, --assetIndex, 1.16, --username, Dev, --accessToken, DONT_CRASH, --userProperties, {}]
[11:38:14] [main/DEBUG] [mixin/]: Error cleaning class output directory: .mixin.out
[11:38:15] [main/DEBUG] [mixin/]: Preparing mixins for MixinEnvironment[DEFAULT]
[11:38:15] [main/INFO] [STDERR/]: [java.lang.ThreadGroup:uncaughtException:1052]: java.lang.NoSuchMethodError: sun.security.util.ManifestEntryVerifier.<init>(Ljava/util/jar/Manifest;)V
[11:38:15] [main/INFO] [STDERR/]: [java.lang.ThreadGroup:uncaughtException:1052]:     at cpw.mods.modlauncher.SecureJarHandler.createCodeSource(SecureJarHandler.java:66)
[11:38:15] [main/INFO] [STDERR/]: [java.lang.ThreadGroup:uncaughtException:1052]:     at cpw.mods.modlauncher.TransformingClassLoader$DelegatedClassLoader.findClass(TransformingClassLoader.java:275)
[11:38:15] [main/INFO] [STDERR/]: [java.lang.ThreadGroup:uncaughtException:1052]:     at cpw.mods.modlauncher.TransformingClassLoader.loadClass(TransformingClassLoader.java:136)
[11:38:15] [main/INFO] [STDERR/]: [java.lang.ThreadGroup:uncaughtException:1052]:     at cpw.mods.modlauncher.TransformingClassLoader.loadClass(TransformingClassLoader.java:98)
[11:38:15] [main/INFO] [STDERR/]: [java.lang.ThreadGroup:uncaughtException:1052]:     at java.lang.ClassLoader.loadClass(ClassLoader.java:351)
[11:38:15] [main/INFO] [STDERR/]: [java.lang.ThreadGroup:uncaughtException:1052]:     at java.lang.Class.forName0(Native Method)
[11:38:15] [main/INFO] [STDERR/]: [java.lang.ThreadGroup:uncaughtException:1052]:     at java.lang.Class.forName(Class.java:348)
[11:38:15] [main/INFO] [STDERR/]: [java.lang.ThreadGroup:uncaughtException:1052]:     at net.minecraftforge.userdev.FMLUserdevClientLaunchProvider.lambda$launchService$0(FMLUserdevClientLaunchProvider.java:52)
[11:38:15] [main/INFO] [STDERR/]: [java.lang.ThreadGroup:uncaughtException:1052]:     at cpw.mods.modlauncher.LaunchServiceHandlerDecorator.launch(LaunchServiceHandlerDecorator.java:37)
[11:38:15] [main/INFO] [STDERR/]: [java.lang.ThreadGroup:uncaughtException:1052]:     at cpw.mods.modlauncher.LaunchServiceHandler.launch(LaunchServiceHandler.java:54)
[11:38:15] [main/INFO] [STDERR/]: [java.lang.ThreadGroup:uncaughtException:1052]:     at cpw.mods.modlauncher.LaunchServiceHandler.launch(LaunchServiceHandler.java:72)
[11:38:15] [main/INFO] [STDERR/]: [java.lang.ThreadGroup:uncaughtException:1052]:     at cpw.mods.modlauncher.Launcher.run(Launcher.java:82)
[11:38:15] [main/INFO] [STDERR/]: [java.lang.ThreadGroup:uncaughtException:1052]:     at cpw.mods.modlauncher.Launcher.main(Launcher.java:66)
[11:38:15] [main/INFO] [STDERR/]: [java.lang.ThreadGroup:uncaughtException:1052]:     at net.minecraftforge.userdev.LaunchTesting.main(LaunchTesting.java:108)
Exception in thread "main" 

> Task :runClient FAILED

Deprecated Gradle features were used in this build, making it incompatible with Gradle 8.0.

You can use '--warning-mode all' to show the individual deprecation warnings and determine if they come from your own scripts or plugins.

See https://docs.gradle.org/7.1.1/userguide/command_line_interface.html#sec:command_line_warnings
10 actionable tasks: 3 executed, 7 up-to-date
FAILURE: Build failed with an exception.

* What went wrong:
Execution failed for task ':runClient'.
> Process 'command 'C:\Users\Ryan-James\.gradle\jdks\jdk8u322-b06\bin\java.exe'' finished with non-zero exit value 1

* Try:
Run with --info or --debug option to get more log output. Run with --scan to get full insights.

* Exception is:
org.gradle.api.tasks.TaskExecutionException: Execution failed for task ':runClient'.
    at org.gradle.api.internal.tasks.execution.ExecuteActionsTaskExecuter.lambda$executeIfValid$1(ExecuteActionsTaskExecuter.java:188)
    at org.gradle.internal.Try$Failure.ifSuccessfulOrElse(Try.java:263)
    at org.gradle.api.internal.tasks.execution.ExecuteActionsTaskExecuter.executeIfValid(ExecuteActionsTaskExecuter.java:186)
    at org.gradle.api.internal.tasks.execution.ExecuteActionsTaskExecuter.execute(ExecuteActionsTaskExecuter.java:174)
    at org.gradle.api.internal.tasks.execution.CleanupStaleOutputsExecuter.execute(CleanupStaleOutputsExecuter.java:109)
    at org.gradle.api.internal.tasks.execution.FinalizePropertiesTaskExecuter.execute(FinalizePropertiesTaskExecuter.java:46)
    at org.gradle.api.internal.tasks.execution.ResolveTaskExecutionModeExecuter.execute(ResolveTaskExecutionModeExecuter.java:51)
    at org.gradle.api.internal.tasks.execution.SkipTaskWithNoActionsExecuter.execute(SkipTaskWithNoActionsExecuter.java:57)
    at org.gradle.api.internal.tasks.execution.SkipOnlyIfTaskExecuter.execute(SkipOnlyIfTaskExecuter.java:56)
    at org.gradle.api.internal.tasks.execution.CatchExceptionTaskExecuter.execute(CatchExceptionTaskExecuter.java:36)
    at org.gradle.api.internal.tasks.execution.EventFiringTaskExecuter$1.executeTask(EventFiringTaskExecuter.java:77)
    at org.gradle.api.internal.tasks.execution.EventFiringTaskExecuter$1.call(EventFiringTaskExecuter.java:55)
    at org.gradle.api.internal.tasks.execution.EventFiringTaskExecuter$1.call(EventFiringTaskExecuter.java:52)
    at org.gradle.internal.operations.DefaultBuildOperationRunner$CallableBuildOperationWorker.execute(DefaultBuildOperationRunner.java:200)
    at org.gradle.internal.operations.DefaultBuildOperationRunner$CallableBuildOperationWorker.execute(DefaultBuildOperationRunner.java:195)
    at org.gradle.internal.operations.DefaultBuildOperationRunner$3.execute(DefaultBuildOperationRunner.java:75)
    at org.gradle.internal.operations.DefaultBuildOperationRunner$3.execute(DefaultBuildOperationRunner.java:68)
    at org.gradle.internal.operations.DefaultBuildOperationRunner.execute(DefaultBuildOperationRunner.java:153)
    at org.gradle.internal.operations.DefaultBuildOperationRunner.execute(DefaultBuildOperationRunner.java:68)
    at org.gradle.internal.operations.DefaultBuildOperationRunner.call(DefaultBuildOperationRunner.java:62)
    at org.gradle.internal.operations.DefaultBuildOperationExecutor.lambda$call$2(DefaultBuildOperationExecutor.java:79)
    at org.gradle.internal.operations.UnmanagedBuildOperationWrapper.callWithUnmanagedSupport(UnmanagedBuildOperationWrapper.java:54)
    at org.gradle.internal.operations.DefaultBuildOperationExecutor.call(DefaultBuildOperationExecutor.java:79)
    at org.gradle.api.internal.tasks.execution.EventFiringTaskExecuter.execute(EventFiringTaskExecuter.java:52)
    at org.gradle.execution.plan.LocalTaskNodeExecutor.execute(LocalTaskNodeExecutor.java:74)
    at org.gradle.execution.taskgraph.DefaultTaskExecutionGraph$InvokeNodeExecutorsAction.execute(DefaultTaskExecutionGraph.java:408)
    at org.gradle.execution.taskgraph.DefaultTaskExecutionGraph$InvokeNodeExecutorsAction.execute(DefaultTaskExecutionGraph.java:395)
    at org.gradle.execution.taskgraph.DefaultTaskExecutionGraph$BuildOperationAwareExecutionAction.execute(DefaultTaskExecutionGraph.java:388)
    at org.gradle.execution.taskgraph.DefaultTaskExecutionGraph$BuildOperationAwareExecutionAction.execute(DefaultTaskExecutionGraph.java:374)
    at org.gradle.execution.plan.DefaultPlanExecutor$ExecutorWorker.lambda$run$0(DefaultPlanExecutor.java:127)
    at org.gradle.execution.plan.DefaultPlanExecutor$ExecutorWorker.execute(DefaultPlanExecutor.java:191)
    at org.gradle.execution.plan.DefaultPlanExecutor$ExecutorWorker.executeNextNode(DefaultPlanExecutor.java:182)
    at org.gradle.execution.plan.DefaultPlanExecutor$ExecutorWorker.run(DefaultPlanExecutor.java:124)
    at org.gradle.internal.concurrent.ExecutorPolicy$CatchAndRecordFailures.onExecute(ExecutorPolicy.java:64)
    at org.gradle.internal.concurrent.ManagedExecutorImpl$1.run(ManagedExecutorImpl.java:48)
    at org.gradle.internal.concurrent.ThreadFactoryImpl$ManagedThreadRunnable.run(ThreadFactoryImpl.java:56)
Caused by: org.gradle.process.internal.ExecException: Process 'command 'C:\Users\Ryan-James\.gradle\jdks\jdk8u322-b06\bin\java.exe'' finished with non-zero exit value 1
    at org.gradle.process.internal.DefaultExecHandle$ExecResultImpl.assertNormalExitValue(DefaultExecHandle.java:414)
    at org.gradle.process.internal.DefaultJavaExecAction.execute(DefaultJavaExecAction.java:52)
    at org.gradle.api.tasks.JavaExec.exec(JavaExec.java:156)
    at java.base/jdk.internal.reflect.NativeMethodAccessorImpl.invoke0(Native Method)
    at java.base/jdk.internal.reflect.NativeMethodAccessorImpl.invoke(NativeMethodAccessorImpl.java:78)
    at java.base/jdk.internal.reflect.DelegatingMethodAccessorImpl.invoke(DelegatingMethodAccessorImpl.java:43)
    at org.gradle.internal.reflect.JavaMethod.invoke(JavaMethod.java:104)
    at org.gradle.api.internal.project.taskfactory.StandardTaskAction.doExecute(StandardTaskAction.java:58)
    at org.gradle.api.internal.project.taskfactory.StandardTaskAction.execute(StandardTaskAction.java:51)
    at org.gradle.api.internal.project.taskfactory.StandardTaskAction.execute(StandardTaskAction.java:29)
    at org.gradle.api.internal.tasks.execution.ExecuteActionsTaskExecuter$2.run(ExecuteActionsTaskExecuter.java:506)
    at org.gradle.internal.operations.DefaultBuildOperationRunner$1.execute(DefaultBuildOperationRunner.java:29)
    at org.gradle.internal.operations.DefaultBuildOperationRunner$1.execute(DefaultBuildOperationRunner.java:26)
    at org.gradle.internal.operations.DefaultBuildOperationRunner$3.execute(DefaultBuildOperationRunner.java:75)
    at org.gradle.internal.operations.DefaultBuildOperationRunner$3.execute(DefaultBuildOperationRunner.java:68)
    at org.gradle.internal.operations.DefaultBuildOperationRunner.execute(DefaultBuildOperationRunner.java:153)
    at org.gradle.internal.operations.DefaultBuildOperationRunner.execute(DefaultBuildOperationRunner.java:68)
    at org.gradle.internal.operations.DefaultBuildOperationRunner.run(DefaultBuildOperationRunner.java:56)
    at org.gradle.internal.operations.DefaultBuildOperationExecutor.lambda$run$1(DefaultBuildOperationExecutor.java:74)
    at org.gradle.internal.operations.UnmanagedBuildOperationWrapper.runWithUnmanagedSupport(UnmanagedBuildOperationWrapper.java:45)
    at org.gradle.internal.operations.DefaultBuildOperationExecutor.run(DefaultBuildOperationExecutor.java:74)
    at org.gradle.api.internal.tasks.execution.ExecuteActionsTaskExecuter.executeAction(ExecuteActionsTaskExecuter.java:491)
    at org.gradle.api.internal.tasks.execution.ExecuteActionsTaskExecuter.executeActions(ExecuteActionsTaskExecuter.java:474)
    at org.gradle.api.internal.tasks.execution.ExecuteActionsTaskExecuter.access$300(ExecuteActionsTaskExecuter.java:106)
    at org.gradle.api.internal.tasks.execution.ExecuteActionsTaskExecuter$TaskExecution.executeWithPreviousOutputFiles(ExecuteActionsTaskExecuter.java:271)
    at org.gradle.api.internal.tasks.execution.ExecuteActionsTaskExecuter$TaskExecution.execute(ExecuteActionsTaskExecuter.java:249)
    at org.gradle.internal.execution.steps.ExecuteStep.executeInternal(ExecuteStep.java:83)
    at org.gradle.internal.execution.steps.ExecuteStep.access$000(ExecuteStep.java:37)
    at org.gradle.internal.execution.steps.ExecuteStep$1.call(ExecuteStep.java:50)
    at org.gradle.internal.execution.steps.ExecuteStep$1.call(ExecuteStep.java:47)
    at org.gradle.internal.operations.DefaultBuildOperationRunner$CallableBuildOperationWorker.execute(DefaultBuildOperationRunner.java:200)
    at org.gradle.internal.operations.DefaultBuildOperationRunner$CallableBuildOperationWorker.execute(DefaultBuildOperationRunner.java:195)
    at org.gradle.internal.operations.DefaultBuildOperationRunner$3.execute(DefaultBuildOperationRunner.java:75)
    at org.gradle.internal.operations.DefaultBuildOperationRunner$3.execute(DefaultBuildOperationRunner.java:68)
    at org.gradle.internal.operations.DefaultBuildOperationRunner.execute(DefaultBuildOperationRunner.java:153)
    at org.gradle.internal.operations.DefaultBuildOperationRunner.execute(DefaultBuildOperationRunner.java:68)
    at org.gradle.internal.operations.DefaultBuildOperationRunner.call(DefaultBuildOperationRunner.java:62)
    at org.gradle.internal.operations.DefaultBuildOperationExecutor.lambda$call$2(DefaultBuildOperationExecutor.java:79)
    at org.gradle.internal.operations.UnmanagedBuildOperationWrapper.callWithUnmanagedSupport(UnmanagedBuildOperationWrapper.java:54)
    at org.gradle.internal.operations.DefaultBuildOperationExecutor.call(DefaultBuildOperationExecutor.java:79)
    at org.gradle.internal.execution.steps.ExecuteStep.execute(ExecuteStep.java:47)
    at org.gradle.internal.execution.steps.ExecuteStep.execute(ExecuteStep.java:37)
    at org.gradle.internal.execution.steps.RemovePreviousOutputsStep.execute(RemovePreviousOutputsStep.java:68)
    at org.gradle.internal.execution.steps.RemovePreviousOutputsStep.execute(RemovePreviousOutputsStep.java:38)
    at org.gradle.internal.execution.steps.ResolveInputChangesStep.execute(ResolveInputChangesStep.java:50)
    at org.gradle.internal.execution.steps.ResolveInputChangesStep.execute(ResolveInputChangesStep.java:36)
    at org.gradle.internal.execution.steps.CancelExecutionStep.execute(CancelExecutionStep.java:41)
    at org.gradle.internal.execution.steps.TimeoutStep.executeWithoutTimeout(TimeoutStep.java:74)
    at org.gradle.internal.execution.steps.TimeoutStep.execute(TimeoutStep.java:55)
    at org.gradle.internal.execution.steps.CreateOutputsStep.execute(CreateOutputsStep.java:51)
    at org.gradle.internal.execution.steps.CreateOutputsStep.execute(CreateOutputsStep.java:29)
    at org.gradle.internal.execution.steps.CaptureStateAfterExecutionStep.execute(CaptureStateAfterExecutionStep.java:54)
    at org.gradle.internal.execution.steps.CaptureStateAfterExecutionStep.execute(CaptureStateAfterExecutionStep.java:35)
    at org.gradle.internal.execution.steps.BroadcastChangingOutputsStep.execute(BroadcastChangingOutputsStep.java:60)
    at org.gradle.internal.execution.steps.BroadcastChangingOutputsStep.execute(BroadcastChangingOutputsStep.java:27)
    at org.gradle.internal.execution.steps.BuildCacheStep.executeWithoutCache(BuildCacheStep.java:174)
    at org.gradle.internal.execution.steps.BuildCacheStep.execute(BuildCacheStep.java:74)
    at org.gradle.internal.execution.steps.BuildCacheStep.execute(BuildCacheStep.java:45)
    at org.gradle.internal.execution.steps.StoreExecutionStateStep.execute(StoreExecutionStateStep.java:40)
    at org.gradle.internal.execution.steps.StoreExecutionStateStep.execute(StoreExecutionStateStep.java:29)
    at org.gradle.internal.execution.steps.RecordOutputsStep.execute(RecordOutputsStep.java:36)
    at org.gradle.internal.execution.steps.RecordOutputsStep.execute(RecordOutputsStep.java:22)
    at org.gradle.internal.execution.steps.SkipUpToDateStep.executeBecause(SkipUpToDateStep.java:99)
    at org.gradle.internal.execution.steps.SkipUpToDateStep.lambda$execute$0(SkipUpToDateStep.java:92)
    at org.gradle.internal.execution.steps.SkipUpToDateStep.execute(SkipUpToDateStep.java:52)
    at org.gradle.internal.execution.steps.SkipUpToDateStep.execute(SkipUpToDateStep.java:36)
    at org.gradle.internal.execution.steps.ResolveChangesStep.execute(ResolveChangesStep.java:85)
    at org.gradle.internal.execution.steps.ResolveChangesStep.execute(ResolveChangesStep.java:42)
    at org.gradle.internal.execution.steps.legacy.MarkSnapshottingInputsFinishedStep.execute(MarkSnapshottingInputsFinishedStep.java:37)
    at org.gradle.internal.execution.steps.legacy.MarkSnapshottingInputsFinishedStep.execute(MarkSnapshottingInputsFinishedStep.java:27)
    at org.gradle.internal.execution.steps.ResolveCachingStateStep.execute(ResolveCachingStateStep.java:91)
    at org.gradle.internal.execution.steps.ResolveCachingStateStep.execute(ResolveCachingStateStep.java:49)
    at org.gradle.internal.execution.steps.ValidateStep.execute(ValidateStep.java:106)
    at org.gradle.internal.execution.steps.ValidateStep.execute(ValidateStep.java:51)
    at org.gradle.internal.execution.steps.CaptureStateBeforeExecutionStep.execute(CaptureStateBeforeExecutionStep.java:72)
    at org.gradle.internal.execution.steps.CaptureStateBeforeExecutionStep.execute(CaptureStateBeforeExecutionStep.java:46)
    at org.gradle.internal.execution.steps.SkipEmptyWorkStep.lambda$execute$2(SkipEmptyWorkStep.java:86)
    at org.gradle.internal.execution.steps.SkipEmptyWorkStep.execute(SkipEmptyWorkStep.java:86)
    at org.gradle.internal.execution.steps.SkipEmptyWorkStep.execute(SkipEmptyWorkStep.java:32)
    at org.gradle.internal.execution.steps.legacy.MarkSnapshottingInputsStartedStep.execute(MarkSnapshottingInputsStartedStep.java:38)
    at org.gradle.internal.execution.steps.LoadExecutionStateStep.execute(LoadExecutionStateStep.java:43)
    at org.gradle.internal.execution.steps.LoadExecutionStateStep.execute(LoadExecutionStateStep.java:31)
    at org.gradle.internal.execution.steps.AssignWorkspaceStep.lambda$execute$0(AssignWorkspaceStep.java:40)
    at org.gradle.api.internal.tasks.execution.ExecuteActionsTaskExecuter$TaskExecution$2.withWorkspace(ExecuteActionsTaskExecuter.java:284)
    at org.gradle.internal.execution.steps.AssignWorkspaceStep.execute(AssignWorkspaceStep.java:40)
    at org.gradle.internal.execution.steps.AssignWorkspaceStep.execute(AssignWorkspaceStep.java:30)
    at org.gradle.internal.execution.steps.IdentityCacheStep.execute(IdentityCacheStep.java:37)
    at org.gradle.internal.execution.steps.IdentityCacheStep.execute(IdentityCacheStep.java:27)
    at org.gradle.internal.execution.steps.IdentifyStep.execute(IdentifyStep.java:44)
    at org.gradle.internal.execution.steps.IdentifyStep.execute(IdentifyStep.java:33)
    at org.gradle.internal.execution.impl.DefaultExecutionEngine$1.execute(DefaultExecutionEngine.java:76)
    at org.gradle.api.internal.tasks.execution.ExecuteActionsTaskExecuter.executeIfValid(ExecuteActionsTaskExecuter.java:185)
    at org.gradle.api.internal.tasks.execution.ExecuteActionsTaskExecuter.execute(ExecuteActionsTaskExecuter.java:174)
    at org.gradle.api.internal.tasks.execution.CleanupStaleOutputsExecuter.execute(CleanupStaleOutputsExecuter.java:109)
    at org.gradle.api.internal.tasks.execution.FinalizePropertiesTaskExecuter.execute(FinalizePropertiesTaskExecuter.java:46)
    at org.gradle.api.internal.tasks.execution.ResolveTaskExecutionModeExecuter.execute(ResolveTaskExecutionModeExecuter.java:51)
    at org.gradle.api.internal.tasks.execution.SkipTaskWithNoActionsExecuter.execute(SkipTaskWithNoActionsExecuter.java:57)
    at org.gradle.api.internal.tasks.execution.SkipOnlyIfTaskExecuter.execute(SkipOnlyIfTaskExecuter.java:56)
    at org.gradle.api.internal.tasks.execution.CatchExceptionTaskExecuter.execute(CatchExceptionTaskExecuter.java:36)
    at org.gradle.api.internal.tasks.execution.EventFiringTaskExecuter$1.executeTask(EventFiringTaskExecuter.java:77)
    at org.gradle.api.internal.tasks.execution.EventFiringTaskExecuter$1.call(EventFiringTaskExecuter.java:55)
    at org.gradle.api.internal.tasks.execution.EventFiringTaskExecuter$1.call(EventFiringTaskExecuter.java:52)
    at org.gradle.internal.operations.DefaultBuildOperationRunner$CallableBuildOperationWorker.execute(DefaultBuildOperationRunner.java:200)
    at org.gradle.internal.operations.DefaultBuildOperationRunner$CallableBuildOperationWorker.execute(DefaultBuildOperationRunner.java:195)
    at org.gradle.internal.operations.DefaultBuildOperationRunner$3.execute(DefaultBuildOperationRunner.java:75)
    at org.gradle.internal.operations.DefaultBuildOperationRunner$3.execute(DefaultBuildOperationRunner.java:68)
    at org.gradle.internal.operations.DefaultBuildOperationRunner.execute(DefaultBuildOperationRunner.java:153)
    at org.gradle.internal.operations.DefaultBuildOperationRunner.execute(DefaultBuildOperationRunner.java:68)
    at org.gradle.internal.operations.DefaultBuildOperationRunner.call(DefaultBuildOperationRunner.java:62)
    at org.gradle.internal.operations.DefaultBuildOperationExecutor.lambda$call$2(DefaultBuildOperationExecutor.java:79)
    at org.gradle.internal.operations.UnmanagedBuildOperationWrapper.callWithUnmanagedSupport(UnmanagedBuildOperationWrapper.java:54)
    at org.gradle.internal.operations.DefaultBuildOperationExecutor.call(DefaultBuildOperationExecutor.java:79)
    at org.gradle.api.internal.tasks.execution.EventFiringTaskExecuter.execute(EventFiringTaskExecuter.java:52)
    at org.gradle.execution.plan.LocalTaskNodeExecutor.execute(LocalTaskNodeExecutor.java:74)
    at org.gradle.execution.taskgraph.DefaultTaskExecutionGraph$InvokeNodeExecutorsAction.execute(DefaultTaskExecutionGraph.java:408)
    at org.gradle.execution.taskgraph.DefaultTaskExecutionGraph$InvokeNodeExecutorsAction.execute(DefaultTaskExecutionGraph.java:395)
    at org.gradle.execution.taskgraph.DefaultTaskExecutionGraph$BuildOperationAwareExecutionAction.execute(DefaultTaskExecutionGraph.java:388)
    at org.gradle.execution.taskgraph.DefaultTaskExecutionGraph$BuildOperationAwareExecutionAction.execute(DefaultTaskExecutionGraph.java:374)
    at org.gradle.execution.plan.DefaultPlanExecutor$ExecutorWorker.lambda$run$0(DefaultPlanExecutor.java:127)
    at org.gradle.execution.plan.DefaultPlanExecutor$ExecutorWorker.execute(DefaultPlanExecutor.java:191)
    at org.gradle.execution.plan.DefaultPlanExecutor$ExecutorWorker.executeNextNode(DefaultPlanExecutor.java:182)
    at org.gradle.execution.plan.DefaultPlanExecutor$ExecutorWorker.run(DefaultPlanExecutor.java:124)
    at org.gradle.internal.concurrent.ExecutorPolicy$CatchAndRecordFailures.onExecute(ExecutorPolicy.java:64)
    at org.gradle.internal.concurrent.ManagedExecutorImpl$1.run(ManagedExecutorImpl.java:48)
    at org.gradle.internal.concurrent.ThreadFactoryImpl$ManagedThreadRunnable.run(ThreadFactoryImpl.java:56)


* Get more help at https://help.gradle.org

BUILD FAILED in 9s

Join the conversation

You can post now and register later. If you have an account, sign in now to post with your account.
Note: Your post will require moderator approval before it will be visible.

Guest
Unfortunately, your content contains terms that we do not allow. Please edit your content to remove the highlighted words below.
Reply to this topic...

×   Pasted as rich text.   Restore formatting

  Only 75 emoji are allowed.

×   Your link has been automatically embedded.   Display as a link instead

×   Your previous content has been restored.   Clear editor

×   You cannot paste images directly. Upload or insert images from URL.

Announcements



×
×
  • Create New...

Important Information

By using this site, you agree to our Terms of Use.