Jump to content
Search In
  • More options...
Find results that contain...
Find results in...

[SOLVED] [1.7.10] ForgeGradle fails on :decompile


Recommended Posts

I switched to a different PC for development recently and I'm trying to set up a new Forge 10.13.4.1558 environment. Running gradlew setupDecompWorkspace runs fine until it reaches :decompile, at which point it crashes with "Process 'command 'C:\Program Files\Java\jdk1.8.0_74\bin\java.exe'' finished with non-zero exit value 1". Running with --debug and --stacktrace gives the following information:

 

 

 

17:46:33.657 [ERROR] [org.gradle.BuildExceptionReporter] FAILURE: Build failed with an exception.
17:46:33.664 [ERROR] [org.gradle.BuildExceptionReporter]
17:46:33.674 [ERROR] [org.gradle.BuildExceptionReporter] * What went wrong:
17:46:33.684 [ERROR] [org.gradle.BuildExceptionReporter] Execution failed for task ':decompile'.
17:46:33.692 [ERROR] [org.gradle.BuildExceptionReporter] > Process 'command 'C:\Program Files\Java\jdk1.8.0_74\bin\java.exe'' finished with non-zero exit value 1
17:46:33.699 [ERROR] [org.gradle.BuildExceptionReporter]
17:46:33.704 [ERROR] [org.gradle.BuildExceptionReporter] * Exception is:
17:46:33.709 [ERROR] [org.gradle.BuildExceptionReporter] org.gradle.api.tasks.TaskExecutionException: Execution failed for task ':decompile'.
17:46:33.717 [ERROR] [org.gradle.BuildExceptionReporter]        at org.gradle.api.internal.tasks.execution.ExecuteActionsTaskExecuter.executeActions(ExecuteActionsTaskExecuter.java:69)
17:46:33.725 [ERROR] [org.gradle.BuildExceptionReporter]        at org.gradle.api.internal.tasks.execution.ExecuteActionsTaskExecuter.execute(ExecuteActionsTaskExecuter.java:46)
17:46:33.733 [ERROR] [org.gradle.BuildExceptionReporter]        at org.gradle.api.internal.tasks.execution.PostExecutionAnalysisTaskExecuter.execute(PostExecutionAnalysisTaskExecuter.java:35)
17:46:33.741 [ERROR] [org.gradle.BuildExceptionReporter]        at org.gradle.api.internal.tasks.execution.SkipUpToDateTaskExecuter.execute(SkipUpToDateTaskExecuter.java:64)
17:46:33.749 [ERROR] [org.gradle.BuildExceptionReporter]        at org.gradle.api.internal.tasks.execution.ValidatingTaskExecuter.execute(ValidatingTaskExecuter.java:58)
17:46:33.757 [ERROR] [org.gradle.BuildExceptionReporter]        at org.gradle.api.internal.tasks.execution.SkipEmptySourceFilesTaskExecuter.execute(SkipEmptySourceFilesTaskExecuter.java:42)
17:46:33.765 [ERROR] [org.gradle.BuildExceptionReporter]        at org.gradle.api.internal.tasks.execution.SkipTaskWithNoActionsExecuter.execute(SkipTaskWithNoActionsExecuter.java:52)
17:46:33.773 [ERROR] [org.gradle.BuildExceptionReporter]        at org.gradle.api.internal.tasks.execution.SkipOnlyIfTaskExecuter.execute(SkipOnlyIfTaskExecuter.java:53)
17:46:33.781 [ERROR] [org.gradle.BuildExceptionReporter]        at org.gradle.api.internal.tasks.execution.ExecuteAtMostOnceTaskExecuter.execute(ExecuteAtMostOnceTaskExecuter.java:43)
17:46:33.789 [ERROR] [org.gradle.BuildExceptionReporter]        at org.gradle.api.internal.AbstractTask.executeWithoutThrowingTaskFailure(AbstractTask.java:296)
17:46:33.796 [ERROR] [org.gradle.BuildExceptionReporter]        at org.gradle.execution.taskgraph.AbstractTaskPlanExecutor$TaskExecutorWorker.executeTask(AbstractTaskPlanExecutor.java:79)
17:46:33.804 [ERROR] [org.gradle.BuildExceptionReporter]        at org.gradle.execution.taskgraph.AbstractTaskPlanExecutor$TaskExecutorWorker.processTask(AbstractTaskPlanExecutor.java:63)
17:46:33.813 [ERROR] [org.gradle.BuildExceptionReporter]        at org.gradle.execution.taskgraph.AbstractTaskPlanExecutor$TaskExecutorWorker.run(AbstractTaskPlanExecutor.java:51)
17:46:33.821 [ERROR] [org.gradle.BuildExceptionReporter]        at org.gradle.execution.taskgraph.DefaultTaskPlanExecutor.process(DefaultTaskPlanExecutor.java:23)
17:46:33.828 [ERROR] [org.gradle.BuildExceptionReporter]        at org.gradle.execution.taskgraph.DefaultTaskGraphExecuter.execute(DefaultTaskGraphExecuter.java:86)
17:46:33.837 [ERROR] [org.gradle.BuildExceptionReporter]        at org.gradle.execution.SelectedTaskExecutionAction.execute(SelectedTaskExecutionAction.java:29)
17:46:33.845 [ERROR] [org.gradle.BuildExceptionReporter]        at org.gradle.execution.DefaultBuildExecuter.execute(DefaultBuildExecuter.java:61)
17:46:33.852 [ERROR] [org.gradle.BuildExceptionReporter]        at org.gradle.execution.DefaultBuildExecuter.access$200(DefaultBuildExecuter.java:23)
17:46:33.859 [ERROR] [org.gradle.BuildExceptionReporter]        at org.gradle.execution.DefaultBuildExecuter$2.proceed(DefaultBuildExecuter.java:67)
17:46:33.867 [ERROR] [org.gradle.BuildExceptionReporter]        at org.gradle.execution.DryRunBuildExecutionAction.execute(DryRunBuildExecutionAction.java:32)
17:46:33.874 [ERROR] [org.gradle.BuildExceptionReporter]        at org.gradle.execution.DefaultBuildExecuter.execute(DefaultBuildExecuter.java:61)
17:46:33.881 [ERROR] [org.gradle.BuildExceptionReporter]        at org.gradle.execution.DefaultBuildExecuter.execute(DefaultBuildExecuter.java:54)
17:46:33.888 [ERROR] [org.gradle.BuildExceptionReporter]        at org.gradle.initialization.DefaultGradleLauncher.doBuildStages(DefaultGradleLauncher.java:148)
17:46:33.895 [ERROR] [org.gradle.BuildExceptionReporter]        at org.gradle.initialization.DefaultGradleLauncher.doBuild(DefaultGradleLauncher.java:105)
17:46:33.902 [ERROR] [org.gradle.BuildExceptionReporter]        at org.gradle.initialization.DefaultGradleLauncher.run(DefaultGradleLauncher.java:85)
17:46:33.909 [ERROR] [org.gradle.BuildExceptionReporter]        at org.gradle.launcher.exec.InProcessBuildActionExecuter$DefaultBuildController.run(InProcessBuildActionExecuter.java:81)
17:46:33.916 [ERROR] [org.gradle.BuildExceptionReporter]        at org.gradle.launcher.cli.ExecuteBuildAction.run(ExecuteBuildAction.java:33)
17:46:33.923 [ERROR] [org.gradle.BuildExceptionReporter]        at org.gradle.launcher.cli.ExecuteBuildAction.run(ExecuteBuildAction.java:24)
17:46:33.929 [ERROR] [org.gradle.BuildExceptionReporter]        at org.gradle.launcher.exec.InProcessBuildActionExecuter.execute(InProcessBuildActionExecuter.java:39)
17:46:33.937 [ERROR] [org.gradle.BuildExceptionReporter]        at org.gradle.launcher.exec.InProcessBuildActionExecuter.execute(InProcessBuildActionExecuter.java:29)
17:46:33.944 [ERROR] [org.gradle.BuildExceptionReporter]        at org.gradle.launcher.cli.RunBuildAction.run(RunBuildAction.java:50)
17:46:33.952 [ERROR] [org.gradle.BuildExceptionReporter]        at org.gradle.internal.Actions$RunnableActionAdapter.execute(Actions.java:171)
17:46:33.959 [ERROR] [org.gradle.BuildExceptionReporter]        at org.gradle.launcher.cli.CommandLineActionFactory$ParseAndBuildAction.execute(CommandLineActionFactory.java:237)
17:46:33.967 [ERROR] [org.gradle.BuildExceptionReporter]        at org.gradle.launcher.cli.CommandLineActionFactory$ParseAndBuildAction.execute(CommandLineActionFactory.java:210)
17:46:33.975 [ERROR] [org.gradle.BuildExceptionReporter]        at org.gradle.launcher.cli.JavaRuntimeValidationAction.execute(JavaRuntimeValidationAction.java:35)
17:46:33.983 [ERROR] [org.gradle.BuildExceptionReporter]        at org.gradle.launcher.cli.JavaRuntimeValidationAction.execute(JavaRuntimeValidationAction.java:24)
17:46:33.990 [ERROR] [org.gradle.BuildExceptionReporter]        at org.gradle.launcher.cli.CommandLineActionFactory$WithLogging.execute(CommandLineActionFactory.java:206)
17:46:33.997 [ERROR] [org.gradle.BuildExceptionReporter]        at org.gradle.launcher.cli.CommandLineActionFactory$WithLogging.execute(CommandLineActionFactory.java:169)
17:46:34.005 [ERROR] [org.gradle.BuildExceptionReporter]        at org.gradle.launcher.cli.ExceptionReportingAction.execute(ExceptionReportingAction.java:33)
17:46:34.012 [ERROR] [org.gradle.BuildExceptionReporter]        at org.gradle.launcher.cli.ExceptionReportingAction.execute(ExceptionReportingAction.java:22)
17:46:34.018 [ERROR] [org.gradle.BuildExceptionReporter]        at org.gradle.launcher.Main.doAction(Main.java:33)
17:46:34.024 [ERROR] [org.gradle.BuildExceptionReporter]        at org.gradle.launcher.bootstrap.EntryPoint.run(EntryPoint.java:45)
17:46:34.030 [ERROR] [org.gradle.BuildExceptionReporter]        at org.gradle.launcher.bootstrap.ProcessBootstrap.runNoExit(ProcessBootstrap.java:54)
17:46:34.037 [ERROR] [org.gradle.BuildExceptionReporter]        at org.gradle.launcher.bootstrap.ProcessBootstrap.run(ProcessBootstrap.java:35)
17:46:34.044 [ERROR] [org.gradle.BuildExceptionReporter]        at org.gradle.launcher.GradleMain.main(GradleMain.java:23)
17:46:34.051 [ERROR] [org.gradle.BuildExceptionReporter]        at org.gradle.wrapper.BootstrapMainStarter.start(BootstrapMainStarter.java:30)
17:46:34.057 [ERROR] [org.gradle.BuildExceptionReporter]        at org.gradle.wrapper.WrapperExecutor.execute(WrapperExecutor.java:127)
17:46:34.064 [ERROR] [org.gradle.BuildExceptionReporter]        at org.gradle.wrapper.GradleWrapperMain.main(GradleWrapperMain.java:56)
17:46:34.070 [ERROR] [org.gradle.BuildExceptionReporter] Caused by: org.gradle.process.internal.ExecException: Process 'command 'C:\Program Files\Java\jdk1.8.0_74\bin\java.exe'' finished with non-zero exit value 1
17:46:34.079 [ERROR] [org.gradle.BuildExceptionReporter]        at org.gradle.process.internal.DefaultExecHandle$ExecResultImpl.assertNormalExitValue(DefaultExecHandle.java:365)
17:46:34.087 [ERROR] [org.gradle.BuildExceptionReporter]        at org.gradle.process.internal.DefaultJavaExecAction.execute(DefaultJavaExecAction.java:31)
17:46:34.094 [ERROR] [org.gradle.BuildExceptionReporter]        at org.gradle.api.internal.file.DefaultFileOperations.javaexec(DefaultFileOperations.java:159)
17:46:34.101 [ERROR] [org.gradle.BuildExceptionReporter]        at org.gradle.api.internal.project.AbstractProject.javaexec(AbstractProject.java:749)
17:46:34.108 [ERROR] [org.gradle.BuildExceptionReporter]        at net.minecraftforge.gradle.tasks.DecompileTask.decompile(DecompileTask.java:118)
17:46:34.115 [ERROR] [org.gradle.BuildExceptionReporter]        at net.minecraftforge.gradle.tasks.DecompileTask.doMCPStuff(DecompileTask.java:90)
17:46:34.121 [ERROR] [org.gradle.BuildExceptionReporter]        at org.gradle.internal.reflect.JavaMethod.invoke(JavaMethod.java:63)
17:46:34.128 [ERROR] [org.gradle.BuildExceptionReporter]        at org.gradle.api.internal.project.taskfactory.AnnotationProcessingTaskFactory$StandardTaskAction.doExecute(AnnotationProcessingTaskFactory.java:218)
17:46:34.138 [ERROR] [org.gradle.BuildExceptionReporter]        at org.gradle.api.internal.project.taskfactory.AnnotationProcessingTaskFactory$StandardTaskAction.execute(AnnotationProcessingTaskFactory.java:211)
17:46:34.149 [ERROR] [org.gradle.BuildExceptionReporter]        at org.gradle.api.internal.project.taskfactory.AnnotationProcessingTaskFactory$StandardTaskAction.execute(AnnotationProcessingTaskFactory.java:200)
17:46:34.159 [ERROR] [org.gradle.BuildExceptionReporter]        at org.gradle.api.internal.AbstractTask$TaskActionWrapper.execute(AbstractTask.java:570)
17:46:34.169 [ERROR] [org.gradle.BuildExceptionReporter]        at org.gradle.api.internal.AbstractTask$TaskActionWrapper.execute(AbstractTask.java:553)
17:46:34.176 [ERROR] [org.gradle.BuildExceptionReporter]        at org.gradle.api.internal.tasks.execution.ExecuteActionsTaskExecuter.executeAction(ExecuteActionsTaskExecuter.java:80)
17:46:34.186 [ERROR] [org.gradle.BuildExceptionReporter]        at org.gradle.api.internal.tasks.execution.ExecuteActionsTaskExecuter.executeActions(ExecuteActionsTaskExecuter.java:61)
17:46:34.195 [ERROR] [org.gradle.BuildExceptionReporter]        ... 47 more
17:46:34.199 [ERROR] [org.gradle.BuildExceptionReporter]
17:46:34.204 [LIFECYCLE] [org.gradle.BuildResultLogger]
17:46:34.208 [LIFECYCLE] [org.gradle.BuildResultLogger] BUILD FAILED

 

 

 

The decompile command and environment:

 

 

 

17:46:33.208 [iNFO] [org.gradle.process.internal.DefaultExecHandle] Starting process 'command 'C:\Program Files\Java\jdk1.8.0_74\bin\java.exe''. Working directory: C:\Users\Condor\.gradle\caches\minecraft Command: C:\Program Files\Java\jdk1.8.0_74\bin\java.exe -Xmx512M -Dfile.encoding=windows-1252 -cp C:\Users\Condor\.gradle\caches\modules-2\files-2.1\net.minecraftforge.gradle\ForgeGradle\1.2-SNAPSHOT\11896a5fc302b2f7f1ad8803ef71cdd9588cca7d\ForgeGradle-1.2-SNAPSHOT.jar;C:\Users\Condor\.gradle\caches\modules-2\files-2.1\de.oceanlabs.mcp\RetroGuard\3.6.6\ffd69fcab06b928cf76144f08b7209ccf0656b6d\RetroGuard-3.6.6.jar;C:\Users\Condor\.gradle\caches\modules-2\files-2.1\net.sf.opencsv\opencsv\2.3\c23708cdb9e80a144db433e23344a788a1fd6599\opencsv-2.3.jar;C:\Users\Condor\.gradle\caches\modules-2\files-2.1\com.github.jponge\lzma-java\1.3\a25db9d4d385ccda4825ae1b47a7a61d86e595af\lzma-java-1.3.jar;C:\Users\Condor\.gradle\caches\modules-2\files-2.1\com.github.abrarsyed.jastyle\jAstyle\1.2\642eada5efeb315295e21a5aea384b68dd191e5f\jAstyle-1.2.jar;C:\Users\Condor\.gradle\caches\modules-2\files-2.1\net.sf.trove4j\trove4j\2.1.0\c82f2749a460b95de4c9d2466b62f18c23c7c914\trove4j-2.1.0.jar;C:\Users\Condor\.gradle\caches\modules-2\files-2.1\com.cloudbees\diff4j\1.1\645329c0d4ebbea5f73758929c6e63bab9e77204\diff4j-1.1.jar;C:\Users\Condor\.gradle\caches\modules-2\files-2.1\net.md-5\SpecialSource\1.7.3\43f9434f08b3647affccfd151a9b437e07e6bff0\SpecialSource-1.7.3.jar;C:\Users\Condor\.gradle\caches\modules-2\files-2.1\com.github.tony19\named-regexp\0.2.3\370846bf3837952d981deb8f91e81da8c65b09e1\named-regexp-0.2.3.jar;C:\Users\Condor\.gradle\caches\modules-2\files-2.1\org.ow2.asm\asm-debug-all\5.0.3\f9e364ae2a66ce2a543012a4668856e84e5dab74\asm-debug-all-5.0.3.jar;C:\Users\Condor\.gradle\caches\modules-2\files-2.1\com.nothome\javaxdelta\2.0.1\d4f5d077f1b15c6f67595015d69572303ad3f66d\javaxdelta-2.0.1.jar;C:\Users\Condor\.gradle\caches\modules-2\files-2.1\net.minecraftforge.srg2source\Srg2Source\3.2-SNAPSHOT\1b66b012733f12d052e18b0b71581acfdca53ee8\Srg2Source-3.2-SNAPSHOT.jar;C:\Users\Condor\.gradle\caches\modules-2\files-2.1\org.apache.httpcomponents\httpclient\4.3.3\18f4247ff4572a074444572cee34647c43e7c9c7\httpclient-4.3.3.jar;C:\Users\Condor\.gradle\caches\modules-2\files-2.1\com.google.code.gson\gson\2.2.4\a60a5e993c98c864010053cb901b7eab25306568\gson-2.2.4.jar;C:\Users\Condor\.gradle\caches\modules-2\files-2.1\com.google.guava\guava\18.0\cce0823396aa693798f8882e64213b1772032b09\guava-18.0.jar;C:\Users\Condor\.gradle\caches\modules-2\files-2.1\org.apache.httpcomponents\httpmime\4.3.3\e02368d7b56c0c376f227378a4f77de62864d020\httpmime-4.3.3.jar;C:\Users\Condor\.gradle\caches\modules-2\files-2.1\de.oceanlabs.mcp\mcinjector\3.2-SNAPSHOT\edce969ee85a6402825b1e5d23e67b645852e912\mcinjector-3.2-SNAPSHOT.jar;C:\Users\Condor\.gradle\caches\modules-2\files-2.1\org.jvnet.localizer\localizer\1.12\6d456886a035b2c3f758059da1f91a823eaa4a62\localizer-1.12.jar;C:\Users\Condor\.gradle\caches\modules-2\files-2.1\commons-io\commons-io\1.4\a8762d07e76cfde2395257a5da47ba7c1dbd3dce\commons-io-1.4.jar;C:\Users\Condor\.gradle\caches\modules-2\files-2.1\trove\trove\1.0.2\112b40581ab9a4d3de4636d49985a7f686d181c8\trove-1.0.2.jar;C:\Users\Condor\.gradle\caches\modules-2\files-2.1\org.eclipse.jdt\org.eclipse.jdt.core\3.10.0.v20131029-1755\9d27d8ac8d6be6b10dffd5101d5e9b893455f0b0\org.eclipse.jdt.core-3.10.0.v20131029-1755.jar;C:\Users\Condor\.gradle\caches\modules-2\files-2.1\org.eclipse.core\resources\3.2.1-R32x_v20060914\af7df4abd126286417df7e36feb35f956f0908b8\resources-3.2.1-R32x_v20060914.jar;C:\Users\Condor\.gradle\caches\modules-2\files-2.1\org.eclipse.equinox\common\3.6.200-v20130402-1505\5354112138f6e420a8152fc9526b15f25ed5f163\common-3.6.200-v20130402-1505.jar;C:\Users\Condor\.gradle\caches\modules-2\files-2.1\org.eclipse.text\org.eclipse.text\3.5.101\54a442442c575e6809c18f7dfc848755a58ab955\org.eclipse.text-3.5.101.jar;C:\Users\Condor\.gradle\caches\modules-2\files-2.1\org.eclipse.jgit\org.eclipse.jgit\3.2.0.201312181205-r\4b99546e8c8a04597b7a4564003e3b554ec12b5c\org.eclipse.jgit-3.2.0.201312181205-r.jar;C:\Users\Condor\.gradle\caches\modules-2\files-2.1\org.apache.httpcomponents\httpcore\4.3.2\31fbbff1ddbf98f3aa7377c94d33b0447c646b6e\httpcore-4.3.2.jar;C:\Users\Condor\.gradle\caches\modules-2\files-2.1\commons-logging\commons-logging\1.1.3\f6f66e966c70a83ffbdb6f17a0919eaf7c8aca7f\commons-logging-1.1.3.jar;C:\Users\Condor\.gradle\caches\modules-2\files-2.1\commons-codec\commons-codec\1.6\b7f0fc8f61ecadeb3695f0b9464755eee44374d4\commons-codec-1.6.jar;C:\Users\Condor\.gradle\caches\modules-2\files-2.1\org.eclipse.equinox\registry\3.5.400-v20140428-1507\5f933a7fbea4c96c74c50b4d453e59b3185e6aec\registry-3.5.400-v20140428-1507.jar;C:\Users\Condor\.gradle\caches\modules-2\files-2.1\org.eclipse.core.runtime\compatibility\3.1.200-v20070502\8b371f1ce208f82314b6afe9cad768d87d53142c\compatibility-3.1.200-v20070502.jar;C:\Users\Condor\.gradle\caches\modules-2\files-2.1\org.eclipse.core\expressions\3.3.0-v20070606-0010\2477cfaa48dab4512c2b1332538687ceb447eaf8\expressions-3.3.0-v20070606-0010.jar;C:\Users\Condor\.gradle\caches\modules-2\files-2.1\org.eclipse.core\filesystem\1.1.0-v20070606\311d9379367bce428ae8e97ca9708cfd0026ca6d\filesystem-1.1.0-v20070606.jar;C:\Users\Condor\.gradle\caches\modules-2\files-2.1\org.eclipse.core\org.eclipse.core.commands\3.6.0\11c16b281bc722e9acb07a0562f0aa6e824d6215\org.eclipse.core.commands-3.6.0.jar;C:\Users\Condor\.gradle\caches\modules-2\files-2.1\org.eclipse.equinox\org.eclipse.equinox.common\3.6.0\78e5d0b8516b042495660da36ce5114650f8f156\org.eclipse.equinox.common-3.6.0.jar;C:\Users\Condor\.gradle\caches\modules-2\files-2.1\com.jcraft\jsch\0.1.46\f3a38fd1d65c32bd627b1389e7181eb294cc8a8\jsch-0.1.46.jar;C:\Users\Condor\.gradle\caches\modules-2\files-2.1\com.googlecode.javaewah\JavaEWAH\0.5.6\1207c0fc8552d4f5f574b50f29321d923521128e\JavaEWAH-0.5.6.jar;C:\Users\Condor\.gradle\caches\modules-2\files-2.1\org.eclipse.equinox\app\1.3.200-v20130910-1609\659921d8f404ee6161c29bd6a6798631208c3633\app-1.3.200-v20130910-1609.jar;C:\Users\Condor\.gradle\caches\modules-2\files-2.1\org.eclipse.update\configurator\3.2.100-v20070615\1e57b63cb6f349bd96d2d4a6e3679e5838581bdd\configurator-3.2.100-v20070615.jar;C:\Users\Condor\.gradle\caches\modules-2\files-2.1\net.sf.jopt-simple\jopt-simple\4.7\3e19c15a38d0e864545acf635b1b69bd6e9f016b\jopt-simple-4.7.jar;C:\Users\Condor\.gradle\caches\modules-2\files-2.1\org.eclipse.equinox\preferences\3.5.200-v20140224-1527\9ea0f3c0b18d0a1e904743b19c2f7c0c7163c61e\preferences-3.5.200-v20140224-1527.jar;C:\Users\Condor\.gradle\caches\modules-2\files-2.1\org.eclipse\osgi\3.10.0-v20140606-1445\afe258a6e5d2dcd8fa4c894f53fdc78e49984e3c\osgi-3.10.0-v20140606-1445.jar;C:\Users\Condor\.gradle\caches\modules-2\files-2.1\org.eclipse.core\jobs\3.6.0-v20140424-0053\4f355c5efd8a39a03f7b0ff4cfcf24b33a968c12\jobs-3.6.0-v20140424-0053.jar;C:\Users\Condor\.gradle\caches\modules-2\files-2.1\org.eclipse.core\contenttype\3.4.200-v20140207-1251\db44eacfdced003f806846810b1a62a1066bb8fd\contenttype-3.4.200-v20140207-1251.jar;C:\Users\Condor\.gradle\caches\modules-2\files-2.1\org.eclipse.core\runtime\3.10.0-v20140318-2214\a537de26c1e322a68536a3a2c3cb2389d5dbcb00\runtime-3.10.0-v20140318-2214.jar -jar C:\Users\Condor\.gradle\caches\minecraft\fernflower-fixed.jar -din=1 -rbr=0 -dgs=1 -asc=1 -log=ERROR C:\Users\Condor\.gradle\caches\minecraft\net\minecraftforge\forge\1.7.10-10.13.4.1558-1.7.10\forge-1.7.10-10.13.4.1558-1.7.10-srg.jar C:\Dev\Forge\chrysos\build\tmp\decompile
17:46:33.457 [DEBUG] [org.gradle.process.internal.DefaultExecHandle] Environment for process 'command 'C:\Program Files\Java\jdk1.8.0_74\bin\java.exe'': {USERDOMAIN_ROAMINGPROFILE=CONDOR-10, LOCALAPPDATA=C:\Users\Condor\AppData\Local, PROCESSOR_LEVEL=6, USERDOMAIN=CONDOR-10, LOGONSERVER=\\CONDOR-10, PROMPT=$P$G, SESSIONNAME=Console, ALLUSERSPROFILE=C:\ProgramData, PROCESSOR_ARCHITECTURE=AMD64, PSModulePath=C:\Program Files\WindowsPowerShell\Modules;C:\Windows\system32\WindowsPowerShell\v1.0\Modules, SystemDrive=C:, =ExitCode=00000000, =C:=C:\Dev\Forge\chrysos, APPDATA=C:\Users\Condor\AppData\Roaming, DIRNAME=C:\Dev\Forge\chrysos\, JAVA_EXE=java.exe, USERNAME=Condor, CMD_LINE_ARGS=--debug --stacktrace setupDecompWorkspace, ProgramFiles(x86)=C:\Program Files (x86), VBOX_MSI_INSTALL_PATH=C:\Program Files\Oracle\VirtualBox\, CommonProgramFiles=C:\Program Files\Common Files, Path=C:\Program Files\Java\jre1.8.0_74\bin;C:\Program Files\Java\jdk1.8.0_74\bin;C:\Windows\system32;C:\Windows;C:\Windows\System32\Wbem;C:\Windows\System32\WindowsPowerShell\v1.0\;C:\Program Files (x86)\NVIDIA Corporation\PhysX\Common;C:\Program Files (x86)\Skype\Phone\;C:\Program Files\Git\cmd, APP_HOME=C:\Dev\Forge\chrysos\, PATHEXT=.COM;.EXE;.BAT;.CMD;.VBS;.VBE;.JS;.JSE;.WSF;.WSH;.MSC, OS=Windows_NT, COMPUTERNAME=CONDOR-10, PROCESSOR_REVISION=3a09, CLASSPATH=C:\Dev\Forge\chrysos\\gradle\wrapper\gradle-wrapper.jar, CommonProgramW6432=C:\Program Files\Common Files, ComSpec=C:\Windows\system32\cmd.exe, APP_BASE_NAME=gradlew, ProgramData=C:\ProgramData, ProgramW6432=C:\Program Files, HOMEPATH=\Users\Condor, SystemRoot=C:\Windows, TEMP=C:\Users\Condor\AppData\Local\Temp, HOMEDRIVE=C:, PROCESSOR_IDENTIFIER=Intel64 Family 6 Model 58 Stepping 9, GenuineIntel, USERPROFILE=C:\Users\Condor, TMP=C:\Users\Condor\AppData\Local\Temp, CommonProgramFiles(x86)=C:\Program Files (x86)\Common Files, ProgramFiles=C:\Program Files, PUBLIC=C:\Users\Public, NUMBER_OF_PROCESSORS=4, windir=C:\Windows, =::=::\, _SKIP=2}17:46:33.208 [iNFO] [org.gradle.process.internal.DefaultExecHandle] Starting process 'command 'C:\Program Files\Java\jdk1.8.0_74\bin\java.exe''. Working directory: C:\Users\Condor\.gradle\caches\minecraft Command: C:\Program Files\Java\jdk1.8.0_74\bin\java.exe -Xmx512M -Dfile.encoding=windows-1252 -cp C:\Users\Condor\.gradle\caches\modules-2\files-2.1\net.minecraftforge.gradle\ForgeGradle\1.2-SNAPSHOT\11896a5fc302b2f7f1ad8803ef71cdd9588cca7d\ForgeGradle-1.2-SNAPSHOT.jar;C:\Users\Condor\.gradle\caches\modules-2\files-2.1\de.oceanlabs.mcp\RetroGuard\3.6.6\ffd69fcab06b928cf76144f08b7209ccf0656b6d\RetroGuard-3.6.6.jar;C:\Users\Condor\.gradle\caches\modules-2\files-2.1\net.sf.opencsv\opencsv\2.3\c23708cdb9e80a144db433e23344a788a1fd6599\opencsv-2.3.jar;C:\Users\Condor\.gradle\caches\modules-2\files-2.1\com.github.jponge\lzma-java\1.3\a25db9d4d385ccda4825ae1b47a7a61d86e595af\lzma-java-1.3.jar;C:\Users\Condor\.gradle\caches\modules-2\files-2.1\com.github.abrarsyed.jastyle\jAstyle\1.2\642eada5efeb315295e21a5aea384b68dd191e5f\jAstyle-1.2.jar;C:\Users\Condor\.gradle\caches\modules-2\files-2.1\net.sf.trove4j\trove4j\2.1.0\c82f2749a460b95de4c9d2466b62f18c23c7c914\trove4j-2.1.0.jar;C:\Users\Condor\.gradle\caches\modules-2\files-2.1\com.cloudbees\diff4j\1.1\645329c0d4ebbea5f73758929c6e63bab9e77204\diff4j-1.1.jar;C:\Users\Condor\.gradle\caches\modules-2\files-2.1\net.md-5\SpecialSource\1.7.3\43f9434f08b3647affccfd151a9b437e07e6bff0\SpecialSource-1.7.3.jar;C:\Users\Condor\.gradle\caches\modules-2\files-2.1\com.github.tony19\named-regexp\0.2.3\370846bf3837952d981deb8f91e81da8c65b09e1\named-regexp-0.2.3.jar;C:\Users\Condor\.gradle\caches\modules-2\files-2.1\org.ow2.asm\asm-debug-all\5.0.3\f9e364ae2a66ce2a543012a4668856e84e5dab74\asm-debug-all-5.0.3.jar;C:\Users\Condor\.gradle\caches\modules-2\files-2.1\com.nothome\javaxdelta\2.0.1\d4f5d077f1b15c6f67595015d69572303ad3f66d\javaxdelta-2.0.1.jar;C:\Users\Condor\.gradle\caches\modules-2\files-2.1\net.minecraftforge.srg2source\Srg2Source\3.2-SNAPSHOT\1b66b012733f12d052e18b0b71581acfdca53ee8\Srg2Source-3.2-SNAPSHOT.jar;C:\Users\Condor\.gradle\caches\modules-2\files-2.1\org.apache.httpcomponents\httpclient\4.3.3\18f4247ff4572a074444572cee34647c43e7c9c7\httpclient-4.3.3.jar;C:\Users\Condor\.gradle\caches\modules-2\files-2.1\com.google.code.gson\gson\2.2.4\a60a5e993c98c864010053cb901b7eab25306568\gson-2.2.4.jar;C:\Users\Condor\.gradle\caches\modules-2\files-2.1\com.google.guava\guava\18.0\cce0823396aa693798f8882e64213b1772032b09\guava-18.0.jar;C:\Users\Condor\.gradle\caches\modules-2\files-2.1\org.apache.httpcomponents\httpmime\4.3.3\e02368d7b56c0c376f227378a4f77de62864d020\httpmime-4.3.3.jar;C:\Users\Condor\.gradle\caches\modules-2\files-2.1\de.oceanlabs.mcp\mcinjector\3.2-SNAPSHOT\edce969ee85a6402825b1e5d23e67b645852e912\mcinjector-3.2-SNAPSHOT.jar;C:\Users\Condor\.gradle\caches\modules-2\files-2.1\org.jvnet.localizer\localizer\1.12\6d456886a035b2c3f758059da1f91a823eaa4a62\localizer-1.12.jar;C:\Users\Condor\.gradle\caches\modules-2\files-2.1\commons-io\commons-io\1.4\a8762d07e76cfde2395257a5da47ba7c1dbd3dce\commons-io-1.4.jar;C:\Users\Condor\.gradle\caches\modules-2\files-2.1\trove\trove\1.0.2\112b40581ab9a4d3de4636d49985a7f686d181c8\trove-1.0.2.jar;C:\Users\Condor\.gradle\caches\modules-2\files-2.1\org.eclipse.jdt\org.eclipse.jdt.core\3.10.0.v20131029-1755\9d27d8ac8d6be6b10dffd5101d5e9b893455f0b0\org.eclipse.jdt.core-3.10.0.v20131029-1755.jar;C:\Users\Condor\.gradle\caches\modules-2\files-2.1\org.eclipse.core\resources\3.2.1-R32x_v20060914\af7df4abd126286417df7e36feb35f956f0908b8\resources-3.2.1-R32x_v20060914.jar;C:\Users\Condor\.gradle\caches\modules-2\files-2.1\org.eclipse.equinox\common\3.6.200-v20130402-1505\5354112138f6e420a8152fc9526b15f25ed5f163\common-3.6.200-v20130402-1505.jar;C:\Users\Condor\.gradle\caches\modules-2\files-2.1\org.eclipse.text\org.eclipse.text\3.5.101\54a442442c575e6809c18f7dfc848755a58ab955\org.eclipse.text-3.5.101.jar;C:\Users\Condor\.gradle\caches\modules-2\files-2.1\org.eclipse.jgit\org.eclipse.jgit\3.2.0.201312181205-r\4b99546e8c8a04597b7a4564003e3b554ec12b5c\org.eclipse.jgit-3.2.0.201312181205-r.jar;C:\Users\Condor\.gradle\caches\modules-2\files-2.1\org.apache.httpcomponents\httpcore\4.3.2\31fbbff1ddbf98f3aa7377c94d33b0447c646b6e\httpcore-4.3.2.jar;C:\Users\Condor\.gradle\caches\modules-2\files-2.1\commons-logging\commons-logging\1.1.3\f6f66e966c70a83ffbdb6f17a0919eaf7c8aca7f\commons-logging-1.1.3.jar;C:\Users\Condor\.gradle\caches\modules-2\files-2.1\commons-codec\commons-codec\1.6\b7f0fc8f61ecadeb3695f0b9464755eee44374d4\commons-codec-1.6.jar;C:\Users\Condor\.gradle\caches\modules-2\files-2.1\org.eclipse.equinox\registry\3.5.400-v20140428-1507\5f933a7fbea4c96c74c50b4d453e59b3185e6aec\registry-3.5.400-v20140428-1507.jar;C:\Users\Condor\.gradle\caches\modules-2\files-2.1\org.eclipse.core.runtime\compatibility\3.1.200-v20070502\8b371f1ce208f82314b6afe9cad768d87d53142c\compatibility-3.1.200-v20070502.jar;C:\Users\Condor\.gradle\caches\modules-2\files-2.1\org.eclipse.core\expressions\3.3.0-v20070606-0010\2477cfaa48dab4512c2b1332538687ceb447eaf8\expressions-3.3.0-v20070606-0010.jar;C:\Users\Condor\.gradle\caches\modules-2\files-2.1\org.eclipse.core\filesystem\1.1.0-v20070606\311d9379367bce428ae8e97ca9708cfd0026ca6d\filesystem-1.1.0-v20070606.jar;C:\Users\Condor\.gradle\caches\modules-2\files-2.1\org.eclipse.core\org.eclipse.core.commands\3.6.0\11c16b281bc722e9acb07a0562f0aa6e824d6215\org.eclipse.core.commands-3.6.0.jar;C:\Users\Condor\.gradle\caches\modules-2\files-2.1\org.eclipse.equinox\org.eclipse.equinox.common\3.6.0\78e5d0b8516b042495660da36ce5114650f8f156\org.eclipse.equinox.common-3.6.0.jar;C:\Users\Condor\.gradle\caches\modules-2\files-2.1\com.jcraft\jsch\0.1.46\f3a38fd1d65c32bd627b1389e7181eb294cc8a8\jsch-0.1.46.jar;C:\Users\Condor\.gradle\caches\modules-2\files-2.1\com.googlecode.javaewah\JavaEWAH\0.5.6\1207c0fc8552d4f5f574b50f29321d923521128e\JavaEWAH-0.5.6.jar;C:\Users\Condor\.gradle\caches\modules-2\files-2.1\org.eclipse.equinox\app\1.3.200-v20130910-1609\659921d8f404ee6161c29bd6a6798631208c3633\app-1.3.200-v20130910-1609.jar;C:\Users\Condor\.gradle\caches\modules-2\files-2.1\org.eclipse.update\configurator\3.2.100-v20070615\1e57b63cb6f349bd96d2d4a6e3679e5838581bdd\configurator-3.2.100-v20070615.jar;C:\Users\Condor\.gradle\caches\modules-2\files-2.1\net.sf.jopt-simple\jopt-simple\4.7\3e19c15a38d0e864545acf635b1b69bd6e9f016b\jopt-simple-4.7.jar;C:\Users\Condor\.gradle\caches\modules-2\files-2.1\org.eclipse.equinox\preferences\3.5.200-v20140224-1527\9ea0f3c0b18d0a1e904743b19c2f7c0c7163c61e\preferences-3.5.200-v20140224-1527.jar;C:\Users\Condor\.gradle\caches\modules-2\files-2.1\org.eclipse\osgi\3.10.0-v20140606-1445\afe258a6e5d2dcd8fa4c894f53fdc78e49984e3c\osgi-3.10.0-v20140606-1445.jar;C:\Users\Condor\.gradle\caches\modules-2\files-2.1\org.eclipse.core\jobs\3.6.0-v20140424-0053\4f355c5efd8a39a03f7b0ff4cfcf24b33a968c12\jobs-3.6.0-v20140424-0053.jar;C:\Users\Condor\.gradle\caches\modules-2\files-2.1\org.eclipse.core\contenttype\3.4.200-v20140207-1251\db44eacfdced003f806846810b1a62a1066bb8fd\contenttype-3.4.200-v20140207-1251.jar;C:\Users\Condor\.gradle\caches\modules-2\files-2.1\org.eclipse.core\runtime\3.10.0-v20140318-2214\a537de26c1e322a68536a3a2c3cb2389d5dbcb00\runtime-3.10.0-v20140318-2214.jar -jar C:\Users\Condor\.gradle\caches\minecraft\fernflower-fixed.jar -din=1 -rbr=0 -dgs=1 -asc=1 -log=ERROR C:\Users\Condor\.gradle\caches\minecraft\net\minecraftforge\forge\1.7.10-10.13.4.1558-1.7.10\forge-1.7.10-10.13.4.1558-1.7.10-srg.jar C:\Dev\Forge\chrysos\build\tmp\decompile
17:46:33.457 [DEBUG] [org.gradle.process.internal.DefaultExecHandle] Environment for process 'command 'C:\Program Files\Java\jdk1.8.0_74\bin\java.exe'': {USERDOMAIN_ROAMINGPROFILE=CONDOR-10, LOCALAPPDATA=C:\Users\Condor\AppData\Local, PROCESSOR_LEVEL=6, USERDOMAIN=CONDOR-10, LOGONSERVER=\\CONDOR-10, PROMPT=$P$G, SESSIONNAME=Console, ALLUSERSPROFILE=C:\ProgramData, PROCESSOR_ARCHITECTURE=AMD64, PSModulePath=C:\Program Files\WindowsPowerShell\Modules;C:\Windows\system32\WindowsPowerShell\v1.0\Modules, SystemDrive=C:, =ExitCode=00000000, =C:=C:\Dev\Forge\chrysos, APPDATA=C:\Users\Condor\AppData\Roaming, DIRNAME=C:\Dev\Forge\chrysos\, JAVA_EXE=java.exe, USERNAME=Condor, CMD_LINE_ARGS=--debug --stacktrace setupDecompWorkspace, ProgramFiles(x86)=C:\Program Files (x86), VBOX_MSI_INSTALL_PATH=C:\Program Files\Oracle\VirtualBox\, CommonProgramFiles=C:\Program Files\Common Files, Path=C:\Program Files\Java\jre1.8.0_74\bin;C:\Program Files\Java\jdk1.8.0_74\bin;C:\Windows\system32;C:\Windows;C:\Windows\System32\Wbem;C:\Windows\System32\WindowsPowerShell\v1.0\;C:\Program Files (x86)\NVIDIA Corporation\PhysX\Common;C:\Program Files (x86)\Skype\Phone\;C:\Program Files\Git\cmd, APP_HOME=C:\Dev\Forge\chrysos\, PATHEXT=.COM;.EXE;.BAT;.CMD;.VBS;.VBE;.JS;.JSE;.WSF;.WSH;.MSC, OS=Windows_NT, COMPUTERNAME=CONDOR-10, PROCESSOR_REVISION=3a09, CLASSPATH=C:\Dev\Forge\chrysos\\gradle\wrapper\gradle-wrapper.jar, CommonProgramW6432=C:\Program Files\Common Files, ComSpec=C:\Windows\system32\cmd.exe, APP_BASE_NAME=gradlew, ProgramData=C:\ProgramData, ProgramW6432=C:\Program Files, HOMEPATH=\Users\Condor, SystemRoot=C:\Windows, TEMP=C:\Users\Condor\AppData\Local\Temp, HOMEDRIVE=C:, PROCESSOR_IDENTIFIER=Intel64 Family 6 Model 58 Stepping 9, GenuineIntel, USERPROFILE=C:\Users\Condor, TMP=C:\Users\Condor\AppData\Local\Temp, CommonProgramFiles(x86)=C:\Program Files (x86)\Common Files, ProgramFiles=C:\Program Files, PUBLIC=C:\Users\Public, NUMBER_OF_PROCESSORS=4, windir=C:\Windows, =::=::\, _SKIP=2}

 

 

 

If I try executing that command in the correct working directory, I end up with:

 

Error occurred during initialization of VM
java/lang/NoClassDefFoundError: java/lang/Object

 

Interestingly, using java.exe from the JRE instead of the JDK executes correctly and I tried decompiling Minecraft like that in the hope that Gradle would skip decompilation, but no dice. I am running Windows 10 Pro and Java 8u74. I'm also using the stable_12 MCP mappings. Other Java programs, Minecraft and Eclipse included, run fine.

Link to post
Share on other sites

Join the conversation

You can post now and register later. If you have an account, sign in now to post with your account.

Guest
Reply to this topic...

×   Pasted as rich text.   Restore formatting

  Only 75 emoji are allowed.

×   Your link has been automatically embedded.   Display as a link instead

×   Your previous content has been restored.   Clear editor

×   You cannot paste images directly. Upload or insert images from URL.



×
×
  • Create New...

Important Information

By using this site, you agree to our Privacy Policy.