Jump to content
Search In
  • More options...
Find results that contain...
Find results in...

Give "install.sh" the executable flag


Recommended Posts

I don't think zip files keep permissions, so it would be impossible to do that.

Protip: try and find answers yourself before asking on the forum.

It's pretty likely that there is an answer.

 

Was I helpful? Give me a thank you!

 

 

width=635 height=903http://bit.ly/HZ03zy[/img]

 

 

Tired of waiting for mods to port to bukkit?

use BukkitForge! (now with a working version of WorldEdit!)

Link to post
Share on other sites

As the subject says, everytime I need to setup forge for a development environment, I have to do:

chmod +x install.sh

would be nice if this was done before hand.

I guess if you were desperate you could always write some kind of a script that detects if you're unzipping a forge source installation and then automatically chmods it for you.

Protip: try and find answers yourself before asking on the forum.

It's pretty likely that there is an answer.

 

Was I helpful? Give me a thank you!

 

 

width=635 height=903http://bit.ly/HZ03zy[/img]

 

 

Tired of waiting for mods to port to bukkit?

use BukkitForge! (now with a working version of WorldEdit!)

Link to post
Share on other sites

Join the conversation

You can post now and register later. If you have an account, sign in now to post with your account.

Guest
Reply to this topic...

×   Pasted as rich text.   Restore formatting

  Only 75 emoji are allowed.

×   Your link has been automatically embedded.   Display as a link instead

×   Your previous content has been restored.   Clear editor

×   You cannot paste images directly. Upload or insert images from URL.



  • Recently Browsing

    No registered users viewing this page.

  • Posts

    • I just got started with modding and I'm trying to create one. I did everything that the Forge Documentation said, ran the Eclipse IDE launch configurations and after trying to run   gradlew build after 46% of the build I got an error:   > Task :compileJava FAILED FAILURE: Build failed with an exception. * What went wrong: Execution failed for task ':compileJava'. > Could not resolve all files for configuration ':compileClasspath'. > Could not find net.minecraftforge:forge:1.16.5-36.1.0_mapped_official_1.16.5. Searched in the following locations: - https://files.minecraftforge.net/maven/net/minecraftforge/forge/1.16.5-36.1.0_mapped_official_1.16.5/forge-1.16.5-36.1.0_mapped_official_1.16.5.module - https://files.minecraftforge.net/maven/net/minecraftforge/forge/1.16.5-36.1.0_mapped_official_1.16.5/forge-1.16.5-36.1.0_mapped_official_1.16.5.pom - https://files.minecraftforge.net/maven/net/minecraftforge/forge/1.16.5-36.1.0_mapped_official_1.16.5/forge-1.16.5-36.1.0_mapped_official_1.16.5.jar - file:/C:/Users/Zalman/.gradle/caches/forge_gradle/bundeled_repo/net/minecraftforge/forge/1.16.5-36.1.0_mapped_official_1.16.5/forge-1.16.5-36.1.0_mapped_official_1.16.5.pom - file:/C:/Users/Zalman/.gradle/caches/forge_gradle/bundeled_repo/net/minecraftforge/forge/1.16.5-36.1.0_mapped_official_1.16.5/forge-1.16.5-36.1.0_mapped_official_1.16.5.jar - https://libraries.minecraft.net/net/minecraftforge/forge/1.16.5-36.1.0_mapped_official_1.16.5/forge-1.16.5-36.1.0_mapped_official_1.16.5.jar - https://repo.maven.apache.org/maven2/net/minecraftforge/forge/1.16.5-36.1.0_mapped_official_1.16.5/forge-1.16.5-36.1.0_mapped_official_1.16.5.pom Required by: project : * Try: Run with --stacktrace option to get the stack trace. Run with --info or --debug option to get more log output. Run with --scan to get full insights. * Get more help at https://help.gradle.org Deprecated Gradle features were used in this build, making it incompatible with Gradle 7.0. Use '--warning-mode all' to show the individual deprecation warnings. See https://docs.gradle.org/6.8.1/userguide/command_line_interface.html#sec:command_line_warnings BUILD FAILED in 35s 1 actionable task: 1 executed I tried deleting the gradle cache (in C:\Users\username\.gradle) and building again, nothing. Tried deleting the whole project, putting the forge files back and generating the launch configurations again, still nothing. I'd appreciate some support with this.
    • Ugh, I posted in the wrong category, sorry.
    • I just got started with modding and I'm trying to create one. I did everything that the Forge Documentation said, ran the Eclipse IDE launch configurations and after trying to run   gradlew build after 46% of the build I got an error:   > Task :compileJava FAILED FAILURE: Build failed with an exception. * What went wrong: Execution failed for task ':compileJava'. > Could not resolve all files for configuration ':compileClasspath'. > Could not find net.minecraftforge:forge:1.16.5-36.1.0_mapped_official_1.16.5. Searched in the following locations: - https://files.minecraftforge.net/maven/net/minecraftforge/forge/1.16.5-36.1.0_mapped_official_1.16.5/forge-1.16.5-36.1.0_mapped_official_1.16.5.module - https://files.minecraftforge.net/maven/net/minecraftforge/forge/1.16.5-36.1.0_mapped_official_1.16.5/forge-1.16.5-36.1.0_mapped_official_1.16.5.pom - https://files.minecraftforge.net/maven/net/minecraftforge/forge/1.16.5-36.1.0_mapped_official_1.16.5/forge-1.16.5-36.1.0_mapped_official_1.16.5.jar - file:/C:/Users/Zalman/.gradle/caches/forge_gradle/bundeled_repo/net/minecraftforge/forge/1.16.5-36.1.0_mapped_official_1.16.5/forge-1.16.5-36.1.0_mapped_official_1.16.5.pom - file:/C:/Users/Zalman/.gradle/caches/forge_gradle/bundeled_repo/net/minecraftforge/forge/1.16.5-36.1.0_mapped_official_1.16.5/forge-1.16.5-36.1.0_mapped_official_1.16.5.jar - https://libraries.minecraft.net/net/minecraftforge/forge/1.16.5-36.1.0_mapped_official_1.16.5/forge-1.16.5-36.1.0_mapped_official_1.16.5.jar - https://repo.maven.apache.org/maven2/net/minecraftforge/forge/1.16.5-36.1.0_mapped_official_1.16.5/forge-1.16.5-36.1.0_mapped_official_1.16.5.pom Required by: project : * Try: Run with --stacktrace option to get the stack trace. Run with --info or --debug option to get more log output. Run with --scan to get full insights. * Get more help at https://help.gradle.org Deprecated Gradle features were used in this build, making it incompatible with Gradle 7.0. Use '--warning-mode all' to show the individual deprecation warnings. See https://docs.gradle.org/6.8.1/userguide/command_line_interface.html#sec:command_line_warnings BUILD FAILED in 35s 1 actionable task: 1 executed I tried deleting the gradle cache (in C:\Users\username\.gradle) and building again, nothing. Tried deleting the whole project, putting the forge files back and generating the launch configurations again, still nothing. I'd appreciate some support with this.  
    • This is the launcher log, it's the only place where I see any reference to an error.
  • Topics

  • Who's Online (See full list)

×
×
  • Create New...

Important Information

By using this site, you agree to our Privacy Policy.