Jump to content

Problems building FernFlower from the github repo [Unsure if right place to ask]


hoodwink_dude
 Share

Recommended Posts

Forge Fernflower Repo

 

Console log pastebin

 

Alternatively, spoiler containing the console log here:

 

 

C:\Users\james_000\Downloads\FernFlower-master>gradlew build

:compileJava

warning: [options] bootstrap class path not set in conjunction with -source 1.6

Note: C:\Users\james_000\Downloads\FernFlower-master\src\org\jetbrains\java\deco

mpiler\modules\decompiler\LabelHelper.java uses unchecked or unsafe operations.

Note: Recompile with -Xlint:unchecked for details.

1 warning

:processResources UP-TO-DATE

:classes

:jar

:assemble

:compileTestJava

warning: [options] bootstrap class path not set in conjunction with -source 1.6

1 warning

:processTestResources UP-TO-DATE

:testClasses

:test

TESTOUTPUT:INFO:  Adding File to context from classpath: C:\Users\james_000\.gra

dle\caches\modules-2\files-2.1\junit\junit\4.12\2973d150c0dc1fefe998f834810d68f2

78ea58ec\junit-4.12.jar

 

TESTOUTPUT:INFO:  Adding File to context from classpath: C:\Users\james_000\.gra

dle\caches\modules-2\files-2.1\org.hamcrest\hamcrest-core\1.3\42a25dc3219429f0e5

d060061f71acb49bf010a0\hamcrest-core-1.3.jar

 

TESTOUTPUT:INFO:  Adding File to context from classpath: C:\Users\james_000\.gra

dle\caches\modules-2\files-2.1\org.hamcrest\hamcrest-library\1.3\4785a3c21320980

282f9f33d0d1264a69040538f\hamcrest-library-1.3.jar

 

TESTOUTPUT:INFO:  Adding File to context from classpath: C:\Users\james_000\.gra

dle\caches\modules-2\files-2.1\oshi-project\oshi-core\1.1\9ddf7b048a8d701be231c0

f4f95fd986198fd2d8\oshi-core-1.1.jar

 

TESTOUTPUT:INFO:  Adding File to context from classpath: C:\Users\james_000\.gra

dle\caches\modules-2\files-2.1\net.java.dev.jna\jna\3.4.0\803ff252fedbd395baffd4

3b37341dc4a150a554\jna-3.4.0.jar

 

TESTOUTPUT:INFO:  Adding File to context from classpath: C:\Users\james_000\.gra

dle\caches\modules-2\files-2.1\net.java.dev.jna\platform\3.4.0\e3f70017be8100d3d

6923f50b3d2ee17714e9c13\platform-3.4.0.jar

 

TESTOUTPUT:INFO:  Adding File to context from classpath: C:\Users\james_000\.gra

dle\caches\modules-2\files-2.1\com.ibm.icu\icu4j-core-mojang\51.2\63d216a9311cca

6be337c1e458e587f99d382b84\icu4j-core-mojang-51.2.jar

 

TESTOUTPUT:INFO:  Adding File to context from classpath: C:\Users\james_000\.gra

dle\caches\modules-2\files-2.1\net.sf.jopt-simple\jopt-simple\4.6\306816fb57cf94

f108a43c95731b08934dcae15c\jopt-simple-4.6.jar

 

TESTOUTPUT:INFO:  Adding File to context from classpath: C:\Users\james_000\.gra

dle\caches\modules-2\files-2.1\com.paulscode\codecjorbis\20101023\c73b5636faf089

d9f00e8732a829577de25237ee\codecjorbis-20101023.jar

 

TESTOUTPUT:INFO:  Adding File to context from classpath: C:\Users\james_000\.gra

dle\caches\modules-2\files-2.1\com.paulscode\codecwav\20101023\12f031cfe88fef5c1

dd36c563c0a3a69bd7261da\codecwav-20101023.jar

 

TESTOUTPUT:INFO:  Adding File to context from classpath: C:\Users\james_000\.gra

dle\caches\modules-2\files-2.1\com.paulscode\libraryjavasound\20101123\5c5e30436

6f75f9eaa2e8cca546a1fb6109348b3\libraryjavasound-20101123.jar

 

TESTOUTPUT:INFO:  Adding File to context from classpath: C:\Users\james_000\.gra

dle\caches\modules-2\files-2.1\com.paulscode\librarylwjglopenal\20100824\73e80d0

794c39665aec3f62eee88ca91676674ef\librarylwjglopenal-20100824.jar

 

TESTOUTPUT:INFO:  Adding File to context from classpath: C:\Users\james_000\.gra

dle\caches\modules-2\files-2.1\com.paulscode\soundsystem\20120107\419c05fe9be71f

792b2d76cfc9b67f1ed0fec7f6\soundsystem-20120107.jar

 

TESTOUTPUT:INFO:  Adding File to context from classpath: C:\Users\james_000\.gra

dle\caches\modules-2\files-2.1\io.netty\netty-all\4.0.23.Final\294104aaf1781d6a5

6a07d561e792c5d0c95f45\netty-all-4.0.23.Final.jar

 

TESTOUTPUT:INFO:  Adding File to context from classpath: C:\Users\james_000\.gra

dle\caches\modules-2\files-2.1\com.google.guava\guava\17.0\9c6ef172e8de35fd8d4d8

783e4821e57cdef7445\guava-17.0.jar

 

TESTOUTPUT:INFO:  Adding File to context from classpath: C:\Users\james_000\.gra

dle\caches\modules-2\files-2.1\org.apache.commons\commons-lang3\3.3.2\90a3822c38

ec8c996e84c16a3477ef632cbc87a3\commons-lang3-3.3.2.jar

 

TESTOUTPUT:INFO:  Adding File to context from classpath: C:\Users\james_000\.gra

dle\caches\modules-2\files-2.1\commons-io\commons-io\2.4\b1b6ea3b7e4aa4f492509a4

952029cd8e48019ad\commons-io-2.4.jar

 

TESTOUTPUT:INFO:  Adding File to context from classpath: C:\Users\james_000\.gra

dle\caches\modules-2\files-2.1\commons-codec\commons-codec\1.9\9ce04e34240f674bc

72680f8b843b1457383161a\commons-codec-1.9.jar

 

TESTOUTPUT:INFO:  Adding File to context from classpath: C:\Users\james_000\.gra

dle\caches\modules-2\files-2.1\net.java.jinput\jinput\2.0.5\39c7796b469a600f7238

0316f6b1f11db6c2c7c4\jinput-2.0.5.jar

 

TESTOUTPUT:INFO:  Adding File to context from classpath: C:\Users\james_000\.gra

dle\caches\modules-2\files-2.1\net.java.jutils\jutils\1.0.0\e12fe1fda814bd348c15

79329c86943d2cd3c6a6\jutils-1.0.0.jar

 

TESTOUTPUT:INFO:  Adding File to context from classpath: C:\Users\james_000\.gra

dle\caches\modules-2\files-2.1\com.google.code.gson\gson\2.2.4\a60a5e993c98c8640

10053cb901b7eab25306568\gson-2.2.4.jar

 

TESTOUTPUT:INFO:  Adding File to context from classpath: C:\Users\james_000\.gra

dle\caches\modules-2\files-2.1\com.mojang\authlib\1.5.21\aefba0d5b53fbcb70860bc8

046ab95d5854c07a5\authlib-1.5.21.jar

 

TESTOUTPUT:INFO:  Adding File to context from classpath: C:\Users\james_000\.gra

dle\caches\modules-2\files-2.1\com.mojang\realms\1.7.39\c282954ce2a3bc62812e0d41

c05f179b3b5839d7\realms-1.7.39.jar

 

TESTOUTPUT:INFO:  Adding File to context from classpath: C:\Users\james_000\.gra

dle\caches\modules-2\files-2.1\org.apache.commons\commons-compress\1.8.1\a698750

c16740fd5b3871425f4cb3bbaa87f529d\commons-compress-1.8.1.jar

 

TESTOUTPUT:INFO:  Adding File to context from classpath: C:\Users\james_000\.gra

dle\caches\modules-2\files-2.1\org.apache.httpcomponents\httpclient\4.3.3\18f424

7ff4572a074444572cee34647c43e7c9c7\httpclient-4.3.3.jar

 

TESTOUTPUT:INFO:  Adding File to context from classpath: C:\Users\james_000\.gra

dle\caches\modules-2\files-2.1\commons-logging\commons-logging\1.1.3\f6f66e966c7

0a83ffbdb6f17a0919eaf7c8aca7f\commons-logging-1.1.3.jar

 

TESTOUTPUT:INFO:  Adding File to context from classpath: C:\Users\james_000\.gra

dle\caches\modules-2\files-2.1\org.apache.httpcomponents\httpcore\4.3.2\31fbbff1

ddbf98f3aa7377c94d33b0447c646b6e\httpcore-4.3.2.jar

 

TESTOUTPUT:INFO:  Adding File to context from classpath: C:\Users\james_000\.gra

dle\caches\modules-2\files-2.1\org.apache.logging.log4j\log4j-api\2.0-beta9\1dd6

6e68cccd907880229f9e2de1314bd13ff785\log4j-api-2.0-beta9.jar

 

TESTOUTPUT:INFO:  Adding File to context from classpath: C:\Users\james_000\.gra

dle\caches\modules-2\files-2.1\org.apache.logging.log4j\log4j-core\2.0-beta9\678

861ba1b2e1fccb594bb0ca03114bb05da9695\log4j-core-2.0-beta9.jar

 

TESTOUTPUT:INFO:  Adding File to context from classpath: C:\Users\james_000\.gra

dle\caches\modules-2\files-2.1\org.lwjgl.lwjgl\lwjgl\2.9.4-nightly-20150209\6975

17568c68e78ae0b4544145af031c81082dfe\lwjgl-2.9.4-nightly-20150209.jar

 

TESTOUTPUT:INFO:  Adding File to context from classpath: C:\Users\james_000\.gra

dle\caches\modules-2\files-2.1\org.lwjgl.lwjgl\lwjgl_util\2.9.4-nightly-20150209

\d51a7c040a721d13efdfbd34f8b257b2df882ad0\lwjgl_util-2.9.4-nightly-20150209.jar

 

TESTOUTPUT:INFO:  Adding File to context from classpath: C:\Users\james_000\.gra

dle\caches\modules-2\files-2.1\tv.twitch\twitch\6.5\320a2dfd18513a5f41b4e75729df

684488cbd925\twitch-6.5.jar

 

TESTOUTPUT:INFO:  Adding File to context from classpath: C:\Users\james_000\.gra

dle\caches\modules-2\files-2.1\net.java.jinput\jinput-platform\2.0.5\7ff832a6eb9

ab6a767f1ade2b548092d0fa64795\jinput-platform-2.0.5-natives-linux.jar

 

TESTOUTPUT:INFO:  Adding File to context from classpath: C:\Users\james_000\.gra

dle\caches\modules-2\files-2.1\net.java.jinput\jinput-platform\2.0.5\385ee093e01

f587f30ee1c8a2ee7d408fd732e16\jinput-platform-2.0.5-natives-windows.jar

 

TESTOUTPUT:INFO:  Adding File to context from classpath: C:\Users\james_000\.gra

dle\caches\modules-2\files-2.1\net.java.jinput\jinput-platform\2.0.5\53f9c919f34

d2ca9de8c51fc4e1e8282029a9232\jinput-platform-2.0.5-natives-osx.jar

 

TESTOUTPUT:INFO:  Adding File to context from classpath: C:\Users\james_000\.gra

dle\caches\modules-2\files-2.1\com.google.code.findbugs\jsr305\2.0.1\516c03b21d5

0a644d538de0f0369c620989cd8f0\jsr305-2.0.1.jar

 

TESTOUTPUT:INFO:  Adding File to context from classpath: C:\Users\james_000\.gra

dle\caches\modules-2\files-2.1\tv.twitch\twitch-platform\6.5\206c4ccaecdbcfd2a16

31150c69a97bbc9c20c11\twitch-platform-6.5-natives-windows-32.jar

 

TESTOUTPUT:INFO:  Adding File to context from classpath: C:\Users\james_000\.gra

dle\caches\modules-2\files-2.1\tv.twitch\twitch-platform\6.5\9fdd0fd5aed0817063d

cf95b69349a171f447ebd\twitch-platform-6.5-natives-windows-64.jar

 

TESTOUTPUT:INFO:  Adding File to context from classpath: C:\Users\james_000\.gra

dle\caches\modules-2\files-2.1\tv.twitch\twitch-platform\6.5\5f9d1ee26257b3a33f0

ca06fed335ef462af659f\twitch-platform-6.5-natives-osx.jar

 

TESTOUTPUT:INFO:  Adding File to context from classpath: C:\Users\james_000\.gra

dle\caches\modules-2\files-2.1\tv.twitch\twitch-external-platform\4.5\18215140f0

10c05b9f86ef6f0f8871954d2ccebf\twitch-external-platform-4.5-natives-windows-32.j

ar

 

TESTOUTPUT:INFO:  Adding File to context from classpath: C:\Users\james_000\.gra

dle\caches\modules-2\files-2.1\tv.twitch\twitch-external-platform\4.5\c3cde57891

b935d41b6680a9c5e1502eeab76d86\twitch-external-platform-4.5-natives-windows-64.j

ar

 

TESTOUTPUT:INFO:  Adding File to context from classpath: C:\Users\james_000\.gra

dle\caches\modules-2\files-2.1\org.lwjgl.lwjgl\lwjgl-platform\2.9.4-nightly-2015

0209\b84d5102b9dbfabfeb5e43c7e2828d98a7fc80e0\lwjgl-platform-2.9.4-nightly-20150

209-natives-windows.jar

 

TESTOUTPUT:INFO:  Adding File to context from classpath: C:\Users\james_000\.gra

dle\caches\modules-2\files-2.1\org.lwjgl.lwjgl\lwjgl-platform\2.9.4-nightly-2015

0209\931074f46c795d2f7b30ed6395df5715cfd7675b\lwjgl-platform-2.9.4-nightly-20150

209-natives-linux.jar

 

TESTOUTPUT:INFO:  Adding File to context from classpath: C:\Users\james_000\.gra

dle\caches\modules-2\files-2.1\org.lwjgl.lwjgl\lwjgl-platform\2.9.4-nightly-2015

0209\bcab850f8f487c3f4c4dbabde778bb82bd1a40ed\lwjgl-platform-2.9.4-nightly-20150

209-natives-osx.jar

 

TESTOUTPUT:INFO:  Adding File to context from classpath: C:\Program Files\Java\j

dk1.8.0_91\jre\lib\resources.jar

 

TESTOUTPUT:INFO:  Adding File to context from classpath: C:\Program Files\Java\j

dk1.8.0_91\jre\lib\rt.jar

 

TESTOUTPUT:INFO:  Adding File to context from classpath: C:\Program Files\Java\j

dk1.8.0_91\jre\lib\jsse.jar

 

TESTOUTPUT:INFO:  Adding File to context from classpath: C:\Program Files\Java\j

dk1.8.0_91\jre\lib\jce.jar

 

TESTOUTPUT:INFO:  Adding File to context from classpath: C:\Program Files\Java\j

dk1.8.0_91\jre\lib\charsets.jar

 

TESTOUTPUT:INFO:  Adding File to context from classpath: C:\Program Files\Java\j

dk1.8.0_91\jre\lib\jfr.jar

 

 

org.jetbrains.java.decompiler.LVTTest > testMCContainerPlayer FAILED

    java.lang.AssertionError at LVTTest.java:62

 

org.jetbrains.java.decompiler.MinecraftDecompilationTest > testJar FAILED

    java.lang.RuntimeException at MinecraftDecompilationTest.java:52

TESTOUTPUT:WARN:  Nested class pkg/TestInnerClassConstructor$1 has no constructo

r!

 

TESTOUTPUT:WARN:  Unreferenced anonymous class pkg/TestInnerClassConstructor$1!

 

TESTOUTPUT:WARN:  Invalid signature: SourceFile

 

 

37 tests completed, 2 failed

:test FAILED

 

FAILURE: Build failed with an exception.

 

* What went wrong:

Execution failed for task ':test'.

> There were failing tests. See the report at: file:///C:/Users/james_000/Downlo

ads/FernFlower-master/build/reports/tests/index.html

 

* Try:

Run with --stacktrace option to get the stack trace. Run with --info or --debug

option to get more log output.

 

BUILD FAILED

 

Total time: 1 mins 6.068 secs

 

C:\Users\james_000\Downloads\FernFlower-master>

 

 

I need FernFlower to decompile (does it deob as well? if not, thats ok, it saves me having to delete the already deobbed jar anyways) a mod that I am going to start making an addon for. Any ideas what's going wrong? I really need to know what is wrong.

I love solving puzzles and also coding. What a great combo! I also want to have a career in programming when I have gone through university. 9GAG and Quora stand in the way of me ascending from mediocre programmer to ...meh programmer and beyond!

 

I am always looking for fun projects to look at and maybe be a part of. If you have a project and want to co-operate, email me via jamesyeoman10@gmail.com

 

Keep coding :)

Link to comment
Share on other sites

Funny thing about Github repos: they have an issue tracker where you can post this, because this is the wrongest place.

 

That said:

> There were failing tests. See the report at: file:///C:/Users/james_000/Downlo

ads/FernFlower-master/build/reports/tests/index.html

Apparently I'm a complete and utter jerk and come to this forum just like to make fun of people, be confrontational, and make your personal life miserable.  If you think this is the case, JUST REPORT ME.  Otherwise you're just going to get reported when you reply to my posts and point it out, because odds are, I was trying to be nice.

 

Exception: If you do not understand Java, I WILL NOT HELP YOU and your thread will get locked.

 

DO NOT PM ME WITH PROBLEMS. No help will be given.

Link to comment
Share on other sites

Join the conversation

You can post now and register later. If you have an account, sign in now to post with your account.
Note: Your post will require moderator approval before it will be visible.

Guest
Reply to this topic...

×   Pasted as rich text.   Restore formatting

  Only 75 emoji are allowed.

×   Your link has been automatically embedded.   Display as a link instead

×   Your previous content has been restored.   Clear editor

×   You cannot paste images directly. Upload or insert images from URL.

 Share



×
×
  • Create New...

Important Information

By using this site, you agree to our Terms of Use.