Jump to content
Search In
  • More options...
Find results that contain...
Find results in...

[SOLVED] [1.7.2]Forge fails to initialize the game


Chocolate_with
 Share

Recommended Posts

  • Replies 55
  • Created
  • Last Reply

Top Posters In This Topic

Nope it crashes with error:

Caused by: java.lang.NoSuchFieldError: rock
at com.survivaloverhaul.common.block.SampleBlock.<init>(SampleBlock.java:12)
at com.survivaloverhaul.common.survivaloverhaul.preInit(survivaloverhaul.java:31)

 

line 12 at SampleBlock.java:

	super(Material.rock);

 

line 31 in survivaloverhaul:

Block SampleBlock = (new SampleBlock(3000, 0)).setBlockName("SampleBlock");

 

yes I have changed those.., since I noticed some crash errors in eclipse.. but eclipse don't give crash errors anymore with these codes.

 

 

----

Rechecked the logs when I used the "gradlew.bat build" in command prompt.

There is 1 error given, wich is:

:compileJava
warning: [options] bootstrap class path not set in conjunction with -source 1.6
1 warining

Link to comment
Share on other sites

Can't upload it as attachment.

due error " Cannot access attachments upload path! "

 

So I made a copy of the original one and opened it with Notepad ++.

Here is the info you wanted:

 

buildscript {
    repositories {
        mavenCentral()
        maven {
            name = "forge"
            url = "http://files.minecraftforge.net/maven"
        }
        maven {
            name = "sonatype"
            url = "https://oss.sonatype.org/content/repositories/snapshots/"
        }
    }
    dependencies {
        classpath 'net.minecraftforge.gradle:ForgeGradle:1.2-SNAPSHOT'
    }
}

apply plugin: 'forge'

version = "1.0"
group= "com.yourname.modid" // http://maven.apache.org/guides/mini/guide-naming-conventions.html
archivesBaseName = "modid"

minecraft {
    version = "1.7.2-10.12.1.1060"
    assetDir = "eclipse/assets"
}

processResources
{
    // this will ensure that this task is redone when the versions change.
    inputs.property "version", project.version
    inputs.property "mcversion", project.minecraft.version

    // replace stuff in mcmod.info, nothing else
    from(sourceSets.main.resources.srcDirs) {
        include 'mcmod.info'
                
        // replace version and mcversion
        expand 'version':project.version, 'mcversion':project.minecraft.version
    }
        
    // copy everything else, thats not the mcmod.info
    from(sourceSets.main.resources.srcDirs) {
        exclude 'mcmod.info'
    }
}

Link to comment
Share on other sites

You didnt get the jar from build/libs if it still references 'rock'

Upload your gradle log, upload your jar file, and follow the damn tutorials correctly its literally 2 commands to setup and release a mod:

I do Forge for free, however the servers to run it arn't free, so anything is appreciated.
Patreon: http://www.patreon.com/lexmanos
Paypal: http://paypal.me/LexManos

BitCoin: 1Q8rWvUNMM2T1ZfDaFeeYQyVXtYoeT6tTn

Link to comment
Share on other sites

...., Really LexManos.

 

You still don't get it eh?

 

I redo these tutorial every time on how to export it and everytime it is only my original client that crashes with that error:

Caused by: java.lang.NoSuchFieldError: rock
at com.survivaloverhaul.common.block.SampleBlock.<init>(SampleBlock.java:12)
at com.survivaloverhaul.common.survivaloverhaul.preInit(survivaloverhaul.java:31)

 

Oh and I did get that .jar out of build/libs.

 

It simply fails every time to initialize the game due that error, no matter what we try.

Please pay more attention than instead of just saying that I do everything wrong.

 

Also to be honest, I am not the only one with this problem.

Oh and gradle.log is empty every time, so we are running out of options already.

-------------------------

 

@diesieben07,

 

I am kind of wondering now.., I just got it in my mind again.

I did install "JDK 8 64-bit Snapshot before it was released", because Java 7 update 51 was laggy for me.

But should that "JDK 8 64-bit Snapshot" cannot read the code correctly?

Link to comment
Share on other sites

rock is a static class variable of the Material class. It has to be references with it's class name:

 

Material.rock

 

Not just rock.

Link to comment
Share on other sites

rock is a static class variable of the Material class. It has to be references with it's class name:

 

Material.rock

 

Not just rock.

 

So..., there stans Material.rock in the code.

Or do you mean that I need to change:

public SampleBlock(int i, Material rock) {

 

To

 

public static SampleBlock(int i, Material rock) {

?

Link to comment
Share on other sites

No

This has NOTHING WHAT SO EVER to do with your code. Jesus

This is your reobf issue.

Somehow you are not running the build command and it is not running reobf.

You need to start posting your actual jar files

Logs of gradle running {stored in .gradle/gradle.log}

Seriously, start providing some useful information like im telling you to and I won't ban you -.-

I do Forge for free, however the servers to run it arn't free, so anything is appreciated.
Patreon: http://www.patreon.com/lexmanos
Paypal: http://paypal.me/LexManos

BitCoin: 1Q8rWvUNMM2T1ZfDaFeeYQyVXtYoeT6tTn

Link to comment
Share on other sites

.gradle is empty, I'm telling you.

I think when I'm back home I go do something else first.

Update to JDK 8 (full release).

Download and install forge again, in a different folder.

Reinstall Eclipse.(yes I messed up Eclipse yesterday)

Then run gradlew.bat again with following the tutorial again.

 

And hopefully it will make the logs.

Because the current folder may have the attribute Read-only.

 

--------

Update:

.gradle gradle log fixed.

 

It is not empty anymore.

See here are the logs.., oh and I'm still confused why the attachment option isn't working.

Oh before I forgot to say.., I did double run the command

 

gradlew setupDevWorkspace eclipse

****************************
Powered By MCP:            
http://mcp.ocean-labs.de/  
Searge, ProfMobius, Fesh0r,
R4wk, ZeuX, IngisKahn      
MCP Data version : unknown
****************************
:extractUserDev SKIPPED
:getAssetsIndex
:getAssets
:copyAssets
:downloadClient SKIPPED
:downloadServer SKIPPED
:mergeJars SKIPPED
:applyBinPatches SKIPPED
:downloadMcpTools UP-TO-DATE
:genSrgs SKIPPED
:deobfBinJar SKIPPED
:extractNatives UP-TO-DATE
:setupDevWorkspace
:eclipseClasspath
:eclipseJdt
:eclipseProject
:eclipse

BUILD SUCCESSFUL

Total time: 20.025 secs

 

 

 

Before reinstall, the logs did said only this:

****************************
Powered By MCP:            
http://mcp.ocean-labs.de/  
Searge, ProfMobius, Fesh0r,
R4wk, ZeuX, IngisKahn      
MCP Data version : unknown
****************************

Link to comment
Share on other sites

Any idea how I can change it, so Ecplipse will use JDK 7?

 

and whoops I forgot this time to run gradlew build.

 

Nevermind, changed it.

 

Here is the log:

 

****************************
Powered By MCP:            
http://mcp.ocean-labs.de/  
Searge, ProfMobius, Fesh0r,
R4wk, ZeuX, IngisKahn      
MCP Data version : unknown
****************************
:compileApiJava UP-TO-DATE
:processApiResources UP-TO-DATE
:apiClasses UP-TO-DATE
:sourceMainJava
:compileJavawarning: [options] bootstrap class path not set in conjunction with -source 1.6
1 warning

:processResources
:classes
:jar
:compileTestJava UP-TO-DATE
:processTestResources UP-TO-DATE
:testClasses UP-TO-DATE
:test UP-TO-DATE
:extractUserDev SKIPPED
:genSrgs SKIPPED
:reobf
:assemble
:check UP-TO-DATE
:build

BUILD SUCCESSFUL

Total time: 20.259 secs

Link to comment
Share on other sites

My advice: Don't have Java 8 installed at all. It's a pain in the butt to tell everything to use Java 7 when there is also Java 8 on the system.

Ok, now that you've run gradlew build, what are the exact steps you take to make your mod run in the actual minecraft client (outside of eclipse).

Link to comment
Share on other sites

I think I'm doing that wrong whole the time, but I didn't have problems with it in older versions.

 

I have changed the package names by the way.

 

What I do is:

 

Export -> JAR File -> add "com.choco.project" and "com.choco.project.block" and "modid-1.0.jar" -> Finish

 

modid-1.0.jar by the way.

Link to comment
Share on other sites

Jesus christ. We have been telling you about 1000 times now, that you cannot get the jar by exporting it form eclipse. You must run gradlew build which will generate your mod jar inside build/libs.

 

Oh yeah, about that.

 

See this error.

****************************
Powered By MCP:            
http://mcp.ocean-labs.de/  
Searge, ProfMobius, Fesh0r,
R4wk, ZeuX, IngisKahn      
MCP Data version : unknown
****************************
:compileApiJava UP-TO-DATE
:processApiResources UP-TO-DATE
:apiClasses UP-TO-DATE
:sourceMainJava UP-TO-DATE
:compileJava UP-TO-DATE
:processResources FAILED

FAILURE: Build failed with an exception.

* What went wrong:
Execution failed for task ':processResources'.
> Could not copy file 'C:\Users\Davey\Desktop\Minecraft modding 2\src\main\resources\mcmod.info' to 'C:\Users\Davey\Desktop\Minecraft modding 2\build\resources\main\mcmod.info'.

* Try:
Run with --stacktrace option to get the stack trace. Run with --info or --debug option to get more log output.

BUILD FAILED

Total time: 11.045 secs

 

 

But that mcmod.info is in that folder.

Link to comment
Share on other sites

Run with --debug or --info (not sure which you need) to get more info on why the copy fails.

With Gradlew.bat --stacktrace , you can see what is causing it.

So you might want to read it.

 

 

Gradlew.bat --Debug

23:26:56.866 [DEBUG] [org.gradle.configuration.project.BuildScriptProcessor] Timing: Running the build script took 14.373 secs
23:26:56.897 [LIFECYCLE] [org.gradle.api.Project] ****************************
23:26:56.912 [LIFECYCLE] [org.gradle.api.Project]  Powered By MCP:            
23:26:56.912 [LIFECYCLE] [org.gradle.api.Project]  http://mcp.ocean-labs.de/  
23:26:56.928 [LIFECYCLE] [org.gradle.api.Project]  Searge, ProfMobius, Fesh0r,
23:26:56.928 [LIFECYCLE] [org.gradle.api.Project]  R4wk, ZeuX, IngisKahn      
23:26:56.944 [iNFO] [org.gradle.api.Project] Resolving:  MCP Data version : {MCP_VERSION}
23:26:56.959 [iNFO] [org.gradle.api.Project] Resolved:   MCP Data version : unknown
23:26:56.959 [LIFECYCLE] [org.gradle.api.Project]  MCP Data version : unknown
23:26:56.975 [LIFECYCLE] [org.gradle.api.Project] ****************************
23:26:56.975 [iNFO] [org.gradle.api.Project] Resolving: net.minecraftforge:{API_NAME}:{API_VERSION}
23:26:56.990 [iNFO] [org.gradle.api.Project] Resolved:  net.minecraftforge:forge:1.7.2-10.12.1.1060
23:26:56.990 [iNFO] [org.gradle.api.Project] Resolving: {USER_DEV}/dev.json
23:26:57.006 [iNFO] [org.gradle.api.Project] Resolved:  C:/Users/Davey/.gradle/caches/minecraft/net/minecraftforge/forge/1.7.2-10.12.1.1060/unpacked/dev.json
23:26:57.006 [iNFO] [org.gradle.api.Project] Resolving: {USER_DEV}/dev.json
23:26:57.022 [iNFO] [org.gradle.api.Project] Resolved:  C:/Users/Davey/.gradle/caches/minecraft/net/minecraftforge/forge/1.7.2-10.12.1.1060/unpacked/dev.json
23:26:57.302 [DEBUG] [org.gradle.api.internal.artifacts.ivyservice.resolveengine.DefaultDependencyResolver] Resolving configuration ':minecraftNatives'
23:26:57.318 [DEBUG] [org.gradle.api.internal.artifacts.ivyservice.ivyresolve.memcache.InMemoryDependencyMetadataCache] Reusing in-memory cache for repo 'forge' [58d026f73bd51b2d7316bd092d31aca0].
23:26:57.334 [DEBUG] [org.gradle.api.internal.artifacts.ivyservice.ivyresolve.memcache.InMemoryDependencyMetadataCache] Reusing in-memory cache for repo 'MavenRepo' [e9d03b7c6586155fbee8fb2de8b5b149].
23:26:57.334 [DEBUG] [org.gradle.api.internal.artifacts.ivyservice.ivyresolve.memcache.InMemoryDependencyMetadataCache] Creating new in-memory cache for repo 'minecraft' [1a583fa30149d818dec07b24fb2d3986].
23:26:57.365 [DEBUG] [org.gradle.api.internal.artifacts.ivyservice.resolveengine.DependencyGraphBuilder] Visiting configuration com.uourname.modid:Minecraft modding 2:1.0(minecraftNatives).
23:26:57.380 [DEBUG] [org.gradle.api.internal.artifacts.ivyservice.resolveengine.DependencyGraphBuilder] Visiting dependency com.uourname.modid:Minecraft modding 2:1.0(minecraftNatives) -> org.lwjgl.lwjgl:lwjgl-platform:2.9.0(dependency: org.lwjgl.lwjgl#lwjgl-platform;2.9.0 {minecraftNatives=[default]})
23:26:57.396 [DEBUG] [org.gradle.api.internal.artifacts.ivyservice.resolveengine.DependencyGraphBuilder] Selecting new module version org.lwjgl.lwjgl:lwjgl-platform:2.9.0
23:26:57.396 [DEBUG] [org.gradle.api.internal.artifacts.ivyservice.ivyresolve.UserResolverChain] Attempting to resolve module 'org.lwjgl.lwjgl:lwjgl-platform:2.9.0' using repositories [forge, MavenRepo, minecraft]
23:26:57.412 [DEBUG] [org.gradle.api.internal.artifacts.ivyservice.ivyresolve.CachingModuleVersionRepository] Detected non-existence of module 'org.lwjgl.lwjgl#lwjgl-platform;2.9.0' in resolver cache 'forge'
23:26:57.427 [DEBUG] [org.gradle.api.internal.artifacts.ivyservice.ivyresolve.parser.IvyXmlModuleDescriptorParser] post 1.3 ivy file: using exact as default matcher
23:26:57.443 [DEBUG] [org.gradle.api.internal.artifacts.ivyservice.ivyresolve.CachingModuleVersionRepository] Using cached module metadata for module 'org.lwjgl.lwjgl#lwjgl-platform;2.9.0' in 'MavenRepo'
23:26:57.458 [DEBUG] [org.gradle.api.internal.artifacts.ivyservice.ivyresolve.UserResolverChain] Using module 'org.lwjgl.lwjgl:lwjgl-platform:2.9.0' from repository 'MavenRepo'
23:26:57.474 [DEBUG] [org.gradle.api.internal.artifacts.ivyservice.resolveengine.DependencyGraphBuilder] Visiting dependency com.uourname.modid:Minecraft modding 2:1.0(minecraftNatives) -> net.java.jinput:jinput-platform:2.0.5(dependency: net.java.jinput#jinput-platform;2.0.5 {minecraftNatives=[default]})
23:26:57.490 [DEBUG] [org.gradle.api.internal.artifacts.ivyservice.resolveengine.DependencyGraphBuilder] Selecting new module version net.java.jinput:jinput-platform:2.0.5
23:26:57.505 [DEBUG] [org.gradle.api.internal.artifacts.ivyservice.ivyresolve.UserResolverChain] Attempting to resolve module 'net.java.jinput:jinput-platform:2.0.5' using repositories [forge, MavenRepo, minecraft]
23:26:57.521 [DEBUG] [org.gradle.api.internal.artifacts.ivyservice.ivyresolve.CachingModuleVersionRepository] Detected non-existence of module 'net.java.jinput#jinput-platform;2.0.5' in resolver cache 'forge'
23:26:57.536 [DEBUG] [org.gradle.api.internal.artifacts.ivyservice.ivyresolve.parser.IvyXmlModuleDescriptorParser] post 1.3 ivy file: using exact as default matcher
23:26:57.552 [DEBUG] [org.gradle.api.internal.artifacts.ivyservice.ivyresolve.CachingModuleVersionRepository] Using cached module metadata for module 'net.java.jinput#jinput-platform;2.0.5' in 'MavenRepo'
23:26:57.568 [DEBUG] [org.gradle.api.internal.artifacts.ivyservice.ivyresolve.UserResolverChain] Using module 'net.java.jinput:jinput-platform:2.0.5' from repository 'MavenRepo'
23:26:57.583 [DEBUG] [org.gradle.api.internal.artifacts.ivyservice.resolveengine.DependencyGraphBuilder] Visiting configuration org.lwjgl.lwjgl:lwjgl-platform:2.9.0(default).
23:26:57.599 [DEBUG] [org.gradle.api.internal.artifacts.ivyservice.resolveengine.DependencyGraphBuilder] Visiting configuration net.java.jinput:jinput-platform:2.0.5(default).
23:26:57.599 [DEBUG] [org.gradle.api.internal.artifacts.ivyservice.resolveengine.DependencyGraphBuilder] Attaching com.uourname.modid:Minecraft modding 2:1.0(minecraftNatives) to its parents.
23:26:57.614 [DEBUG] [org.gradle.api.internal.artifacts.ivyservice.resolveengine.DependencyGraphBuilder] Attaching org.lwjgl.lwjgl:lwjgl-platform:2.9.0(default) to its parents.
23:26:57.630 [DEBUG] [org.gradle.api.internal.artifacts.ivyservice.resolveengine.DependencyGraphBuilder] Attaching net.java.jinput:jinput-platform:2.0.5(default) to its parents.
23:26:57.646 [DEBUG] [org.gradle.api.internal.artifacts.ivyservice.resolveengine.oldresult.TransientConfigurationResultsBuilder] Flushing resolved configuration data in Binary store in C:\Users\Davey\AppData\Local\Temp\gradle3189074344331550376.bin. Wrote root com.uourname.modid:Minecraft modding 2:1.0:minecraftNatives.
23:26:57.677 [DEBUG] [org.gradle.api.internal.artifacts.ivyservice.ivyresolve.CachingModuleVersionRepository] Found artifact 'org.lwjgl.lwjgl:lwjgl-platform:2.9.0:lwjgl-platform-natives-windows.jar' in resolver cache: C:\Users\Davey\.gradle\caches\modules-2\files-2.1\org.lwjgl.lwjgl\lwjgl-platform\2.9.0\3f11873dc8e84c854ec7c5a8fd2e869f8aaef764\lwjgl-platform-2.9.0-natives-windows.jar
23:26:57.692 [DEBUG] [org.gradle.api.internal.artifacts.ivyservice.ivyresolve.CachingModuleVersionRepository] Found artifact 'net.java.jinput:jinput-platform:2.0.5:jinput-platform-natives-windows.jar' in resolver cache: C:\Users\Davey\.gradle\caches\modules-2\files-2.1\net.java.jinput\jinput-platform\2.0.5\385ee093e01f587f30ee1c8a2ee7d408fd732e16\jinput-platform-2.0.5-natives-windows.jar
23:26:57.708 [iNFO] [org.gradle.api.Project] ADDING NATIVE: C:\Users\Davey\.gradle\caches\modules-2\files-2.1\org.lwjgl.lwjgl\lwjgl-platform\2.9.0\3f11873dc8e84c854ec7c5a8fd2e869f8aaef764\lwjgl-platform-2.9.0-natives-windows.jar
23:26:57.708 [iNFO] [org.gradle.api.Project] ADDING NATIVE: C:\Users\Davey\.gradle\caches\modules-2\files-2.1\net.java.jinput\jinput-platform\2.0.5\385ee093e01f587f30ee1c8a2ee7d408fd732e16\jinput-platform-2.0.5-natives-windows.jar
23:26:57.755 [DEBUG] [org.gradle.api.internal.artifacts.ivyservice.resolveengine.DefaultDependencyResolver] Resolving configuration ':userDevPackageDepConfig'
23:26:57.770 [DEBUG] [org.gradle.api.internal.artifacts.ivyservice.ivyresolve.memcache.InMemoryDependencyMetadataCache] Reusing in-memory cache for repo 'forge' [58d026f73bd51b2d7316bd092d31aca0].
23:26:57.786 [DEBUG] [org.gradle.api.internal.artifacts.ivyservice.ivyresolve.memcache.InMemoryDependencyMetadataCache] Reusing in-memory cache for repo 'MavenRepo' [e9d03b7c6586155fbee8fb2de8b5b149].
23:26:57.802 [DEBUG] [org.gradle.api.internal.artifacts.ivyservice.ivyresolve.memcache.InMemoryDependencyMetadataCache] Reusing in-memory cache for repo 'minecraft' [1a583fa30149d818dec07b24fb2d3986].
23:26:57.817 [DEBUG] [org.gradle.api.internal.artifacts.ivyservice.resolveengine.DependencyGraphBuilder] Visiting configuration com.uourname.modid:Minecraft modding 2:1.0(userDevPackageDepConfig).
23:26:57.817 [DEBUG] [org.gradle.api.internal.artifacts.ivyservice.resolveengine.DependencyGraphBuilder] Visiting dependency com.uourname.modid:Minecraft modding 2:1.0(userDevPackageDepConfig) -> net.minecraftforge:forge:1.7.2-10.12.1.1060(dependency: net.minecraftforge#forge;1.7.2-10.12.1.1060 {userDevPackageDepConfig=[default]})
23:26:57.833 [DEBUG] [org.gradle.api.internal.artifacts.ivyservice.resolveengine.DependencyGraphBuilder] Selecting new module version net.minecraftforge:forge:1.7.2-10.12.1.1060
23:26:57.848 [DEBUG] [org.gradle.api.internal.artifacts.ivyservice.ivyresolve.UserResolverChain] Attempting to resolve module 'net.minecraftforge:forge:1.7.2-10.12.1.1060' using repositories [forge, MavenRepo, minecraft]
23:26:57.864 [DEBUG] [org.gradle.api.internal.artifacts.ivyservice.ivyresolve.parser.IvyXmlModuleDescriptorParser] post 1.3 ivy file: using exact as default matcher
23:26:57.880 [DEBUG] [org.gradle.api.internal.artifacts.ivyservice.ivyresolve.CachingModuleVersionRepository] Using cached module metadata for module 'net.minecraftforge#forge;1.7.2-10.12.1.1060' in 'forge'
23:26:57.880 [DEBUG] [org.gradle.api.internal.artifacts.ivyservice.ivyresolve.CachingModuleVersionRepository] Detected non-existence of module 'net.minecraftforge#forge;1.7.2-10.12.1.1060' in resolver cache 'MavenRepo'
23:26:57.926 [DEBUG] [org.gradle.api.internal.artifacts.repositories.resolver.ExternalResourceResolver] Loading https://libraries.minecraft.net/net/minecraftforge/forge/1.7.2-10.12.1.1060/forge-1.7.2-10.12.1.1060.pom
23:26:57.942 [DEBUG] [org.gradle.api.internal.externalresource.transfer.DefaultCacheAwareExternalResourceAccessor] Constructing external resource: https://libraries.minecraft.net/net/minecraftforge/forge/1.7.2-10.12.1.1060/forge-1.7.2-10.12.1.1060.pom
23:26:57.958 [DEBUG] [org.gradle.cache.internal.btree.BTreePersistentIndexedCache] Opening cache artifact-at-url.bin (C:\Users\Davey\.gradle\caches\modules-2\metadata-2.2\artifact-at-url.bin)
23:26:57.989 [DEBUG] [org.gradle.api.internal.externalresource.transport.http.HttpResourceAccessor] Constructing external resource: https://libraries.minecraft.net/net/minecraftforge/forge/1.7.2-10.12.1.1060/forge-1.7.2-10.12.1.1060.pom
23:26:58.004 [DEBUG] [org.gradle.api.internal.externalresource.transport.http.HttpClientHelper] Performing HTTP GET: https://libraries.minecraft.net/net/minecraftforge/forge/1.7.2-10.12.1.1060/forge-1.7.2-10.12.1.1060.pom
23:26:58.582 [DEBUG] [org.apache.http.impl.conn.PoolingClientConnectionManager] Connection request: [route: {s}->https://libraries.minecraft.net][total kept alive: 0; route allocated: 0 of 5; total allocated: 0 of 10]
23:26:58.613 [DEBUG] [org.apache.http.impl.conn.PoolingClientConnectionManager] Connection leased: [id: 0][route: {s}->https://libraries.minecraft.net][total kept alive: 0; route allocated: 1 of 5; total allocated: 1 of 10]
23:26:58.894 [DEBUG] [org.apache.http.impl.conn.DefaultClientConnectionOperator] Connecting to libraries.minecraft.net:443
23:26:59.315 [DEBUG] [org.apache.http.client.protocol.RequestAddCookies] CookieSpec selected: best-match
23:26:59.346 [DEBUG] [org.apache.http.client.protocol.RequestAuthCache] Auth cache not set in the context
23:26:59.362 [DEBUG] [org.apache.http.client.protocol.RequestTargetAuthentication] Target auth state: UNCHALLENGED
23:26:59.377 [DEBUG] [org.apache.http.client.protocol.RequestProxyAuthentication] Proxy auth state: UNCHALLENGED
23:26:59.393 [DEBUG] [org.apache.http.impl.client.SystemDefaultHttpClient] Attempt 1 to execute request
23:26:59.393 [DEBUG] [org.apache.http.impl.conn.DefaultClientConnection] Sending request: GET /net/minecraftforge/forge/1.7.2-10.12.1.1060/forge-1.7.2-10.12.1.1060.pom HTTP/1.1
23:26:59.408 [DEBUG] [org.apache.http.headers] >> GET /net/minecraftforge/forge/1.7.2-10.12.1.1060/forge-1.7.2-10.12.1.1060.pom HTTP/1.1
23:26:59.424 [DEBUG] [org.apache.http.headers] >> Accept-Encoding: gzip,deflate
23:26:59.424 [DEBUG] [org.apache.http.headers] >> Host: libraries.minecraft.net
23:26:59.440 [DEBUG] [org.apache.http.headers] >> Connection: Keep-Alive
23:26:59.455 [DEBUG] [org.apache.http.headers] >> User-Agent: Gradle/1.11 (Windows 7;6.1;amd64) (Oracle Corporation;1.8.0_05;25.5-b02)
23:26:59.580 [DEBUG] [org.apache.http.impl.conn.DefaultClientConnection] Receiving response: HTTP/1.1 403 Forbidden
23:26:59.596 [DEBUG] [org.apache.http.headers] << HTTP/1.1 403 Forbidden
23:26:59.596 [DEBUG] [org.apache.http.headers] << Content-Type: application/xml
23:26:59.611 [DEBUG] [org.apache.http.headers] << Transfer-Encoding: chunked
23:26:59.611 [DEBUG] [org.apache.http.headers] << Connection: keep-alive
23:26:59.627 [DEBUG] [org.apache.http.headers] << Date: Mon, 26 May 2014 21:27:02 GMT
23:26:59.627 [DEBUG] [org.apache.http.headers] << Server: AmazonS3
23:26:59.642 [DEBUG] [org.apache.http.headers] << X-Cache: Error from cloudfront
23:26:59.642 [DEBUG] [org.apache.http.headers] << Via: 1.1 afe891444e2f39f570631ae6dcd2c867.cloudfront.net (CloudFront)
23:26:59.658 [DEBUG] [org.apache.http.headers] << X-Amz-Cf-Id: 6PYbhwlY8m0RxSnEDoMDfewIXGXRa7rKaLyoZaVOfw3X4qwnmh8naA==
23:26:59.674 [DEBUG] [org.apache.http.impl.client.SystemDefaultHttpClient] Connection can be kept alive indefinitely
23:26:59.705 [DEBUG] [org.apache.http.impl.conn.PoolingClientConnectionManager] Connection [id: 0][route: {s}->https://libraries.minecraft.net] can be kept alive indefinitely
23:26:59.705 [DEBUG] [org.apache.http.impl.conn.PoolingClientConnectionManager] Connection released: [id: 0][route: {s}->https://libraries.minecraft.net][total kept alive: 1; route allocated: 1 of 5; total allocated: 1 of 10]
23:26:59.720 [iNFO] [org.gradle.api.internal.externalresource.transport.http.HttpClientHelper] Failed to get resource: GET. [HTTP HTTP/1.1 403 Forbidden: https://libraries.minecraft.net/net/minecraftforge/forge/1.7.2-10.12.1.1060/forge-1.7.2-10.12.1.1060.pom]
23:26:59.736 [DEBUG] [org.gradle.api.internal.artifacts.ivyservice.ivyresolve.UserResolverChain] Using module 'net.minecraftforge:forge:1.7.2-10.12.1.1060' from repository 'forge'
23:26:59.767 [DEBUG] [org.gradle.api.internal.artifacts.ivyservice.ivyresolve.UserResolverChain] Discarding resolve failure.
org.gradle.api.UncheckedIOException: Could not GET 'https://libraries.minecraft.net/net/minecraftforge/forge/1.7.2-10.12.1.1060/forge-1.7.2-10.12.1.1060.pom'. Received status code 403 from server: Forbidden
at org.gradle.api.internal.externalresource.transport.http.HttpClientHelper.processResponse(HttpClientHelper.java:121)
at org.gradle.api.internal.externalresource.transport.http.HttpClientHelper.performGet(HttpClientHelper.java:70)
at org.gradle.api.internal.externalresource.transport.http.HttpResourceAccessor.getResource(HttpResourceAccessor.java:46)
at org.gradle.api.internal.externalresource.transport.http.HttpResourceAccessor.getResource(HttpResourceAccessor.java:32)
at org.gradle.api.internal.externalresource.transfer.ProgressLoggingExternalResourceAccessor.getResource(ProgressLoggingExternalResourceAccessor.java:38)
at org.gradle.api.internal.externalresource.transfer.DefaultCacheAwareExternalResourceAccessor.getResource(DefaultCacheAwareExternalResourceAccessor.java:60)
at org.gradle.api.internal.externalresource.transport.DefaultExternalResourceRepository.getResource(DefaultExternalResourceRepository.java:65)
at org.gradle.api.internal.artifacts.repositories.resolver.ExternalResourceResolver.getResource(ExternalResourceResolver.java:427)
at org.gradle.api.internal.artifacts.repositories.resolver.ExternalResourceResolver.findStaticResourceUsingPatterns(ExternalResourceResolver.java:307)
at org.gradle.api.internal.artifacts.repositories.resolver.ExternalResourceResolver.findMetaDataFileUsingAnyPattern(ExternalResourceResolver.java:266)
at org.gradle.api.internal.artifacts.repositories.resolver.ExternalResourceResolver.findStaticDependency(ExternalResourceResolver.java:170)
at org.gradle.api.internal.artifacts.repositories.resolver.ExternalResourceResolver.getDependency(ExternalResourceResolver.java:165)
at org.gradle.api.internal.artifacts.repositories.resolver.MavenResolver.getDependency(MavenResolver.java:81)
at org.gradle.api.internal.artifacts.repositories.resolver.ExternalResourceResolver.getDependency(ExternalResourceResolver.java:157)
at org.gradle.api.internal.artifacts.ivyservice.ivyresolve.CacheLockingModuleVersionRepository$1.run(CacheLockingModuleVersionRepository.java:46)
at org.gradle.internal.Factories$1.create(Factories.java:22)
at org.gradle.cache.internal.DefaultCacheAccess.longRunningOperation(DefaultCacheAccess.java:237)
at org.gradle.cache.internal.DefaultCacheAccess.longRunningOperation(DefaultCacheAccess.java:308)
at org.gradle.cache.internal.DefaultPersistentDirectoryStore.longRunningOperation(DefaultPersistentDirectoryStore.java:114)
at org.gradle.cache.internal.DefaultCacheFactory$ReferenceTrackingCache.longRunningOperation(DefaultCacheFactory.java:185)
at org.gradle.api.internal.artifacts.ivyservice.DefaultCacheLockingManager.longRunningOperation(DefaultCacheLockingManager.java:57)
at org.gradle.api.internal.artifacts.ivyservice.ivyresolve.CacheLockingModuleVersionRepository.getDependency(CacheLockingModuleVersionRepository.java:44)
at org.gradle.api.internal.artifacts.ivyservice.ivyresolve.CachingModuleVersionRepository.getDependency(CachingModuleVersionRepository.java:90)
at org.gradle.api.internal.artifacts.ivyservice.ivyresolve.memcache.CachedRepository.getDependency(CachedRepository.java:55)
at org.gradle.api.internal.artifacts.ivyservice.ivyresolve.UserResolverChain$RepositoryResolveState.resolve(UserResolverChain.java:184)
at org.gradle.api.internal.artifacts.ivyservice.ivyresolve.UserResolverChain.findLatestModule(UserResolverChain.java:98)
at org.gradle.api.internal.artifacts.ivyservice.ivyresolve.UserResolverChain.findLatestModule(UserResolverChain.java:81)
at org.gradle.api.internal.artifacts.ivyservice.ivyresolve.UserResolverChain.resolve(UserResolverChain.java:56)
at org.gradle.api.internal.artifacts.ivyservice.clientmodule.ClientModuleResolver.resolve(ClientModuleResolver.java:34)
at org.gradle.api.internal.artifacts.ivyservice.projectmodule.ProjectDependencyResolver.resolve(ProjectDependencyResolver.java:48)
at org.gradle.api.internal.artifacts.ivyservice.ivyresolve.LazyDependencyToModuleResolver$AbstractVersionResolveResult.resolve(LazyDependencyToModuleResolver.java:86)
at org.gradle.api.internal.artifacts.ivyservice.resolveengine.DependencyGraphBuilder$ModuleVersionResolveState.resolve(DependencyGraphBuilder.java:650)
at org.gradle.api.internal.artifacts.ivyservice.resolveengine.DependencyGraphBuilder$ModuleVersionResolveState.getMetaData(DependencyGraphBuilder.java:661)
at org.gradle.api.internal.artifacts.ivyservice.resolveengine.DependencyGraphBuilder$DependencyEdge.calculateTargetConfigurations(DependencyGraphBuilder.java:337)
at org.gradle.api.internal.artifacts.ivyservice.resolveengine.DependencyGraphBuilder$DependencyEdge.attachToTargetConfigurations(DependencyGraphBuilder.java:311)
at org.gradle.api.internal.artifacts.ivyservice.resolveengine.DependencyGraphBuilder.traverseGraph(DependencyGraphBuilder.java:127)
at org.gradle.api.internal.artifacts.ivyservice.resolveengine.DependencyGraphBuilder.resolve(DependencyGraphBuilder.java:67)
at org.gradle.api.internal.artifacts.ivyservice.resolveengine.DefaultDependencyResolver$1.transform(DefaultDependencyResolver.java:108)
at org.gradle.api.internal.artifacts.ivyservice.resolveengine.DefaultDependencyResolver$1.transform(DefaultDependencyResolver.java:77)
at org.gradle.api.internal.artifacts.ivyservice.DefaultIvyContextManager.withIvy(DefaultIvyContextManager.java:61)
at org.gradle.api.internal.artifacts.ivyservice.resolveengine.DefaultDependencyResolver.resolve(DefaultDependencyResolver.java:77)
at org.gradle.api.internal.artifacts.ivyservice.CacheLockingArtifactDependencyResolver$1.create(CacheLockingArtifactDependencyResolver.java:39)
at org.gradle.api.internal.artifacts.ivyservice.CacheLockingArtifactDependencyResolver$1.create(CacheLockingArtifactDependencyResolver.java:37)
at org.gradle.cache.internal.DefaultCacheAccess.useCache(DefaultCacheAccess.java:187)
at org.gradle.cache.internal.DefaultPersistentDirectoryStore.useCache(DefaultPersistentDirectoryStore.java:102)
at org.gradle.cache.internal.DefaultCacheFactory$ReferenceTrackingCache.useCache(DefaultCacheFactory.java:189)
at org.gradle.api.internal.artifacts.ivyservice.DefaultCacheLockingManager.useCache(DefaultCacheLockingManager.java:61)
at org.gradle.api.internal.artifacts.ivyservice.CacheLockingArtifactDependencyResolver.resolve(CacheLockingArtifactDependencyResolver.java:37)
at org.gradle.api.internal.artifacts.ivyservice.SelfResolvingDependencyResolver.resolve(SelfResolvingDependencyResolver.java:41)
at org.gradle.api.internal.artifacts.ivyservice.ShortcircuitEmptyConfigsArtifactDependencyResolver.resolve(ShortcircuitEmptyConfigsArtifactDependencyResolver.java:51)
at org.gradle.api.internal.artifacts.ivyservice.ErrorHandlingArtifactDependencyResolver.resolve(ErrorHandlingArtifactDependencyResolver.java:44)
at org.gradle.api.internal.artifacts.ivyservice.DefaultConfigurationResolver.resolve(DefaultConfigurationResolver.java:42)
at org.gradle.api.internal.artifacts.configurations.DefaultConfiguration.resolveNow(DefaultConfiguration.java:240)
at org.gradle.api.internal.artifacts.configurations.DefaultConfiguration.getResolvedConfiguration(DefaultConfiguration.java:230)
at org.gradle.api.internal.artifacts.configurations.DefaultConfiguration_Decorated.getResolvedConfiguration(Unknown Source)
at org.gradle.api.internal.artifacts.configurations.DefaultConfiguration$ConfigurationFileCollection.getFiles(DefaultConfiguration.java:463)
at org.gradle.api.internal.artifacts.configurations.DefaultConfiguration.getFiles(DefaultConfiguration.java:202)
at org.gradle.api.internal.artifacts.configurations.DefaultConfiguration_Decorated.getFiles(Unknown Source)
at org.gradle.api.internal.file.AbstractFileCollection.getSingleFile(AbstractFileCollection.java:49)
at org.gradle.api.internal.artifacts.configurations.DefaultConfiguration_Decorated.getSingleFile(Unknown Source)
at net.minecraftforge.gradle.user.UserBasePlugin.delayedTaskConfig(UserBasePlugin.java:939)
at net.minecraftforge.gradle.user.patch.UserPatchBasePlugin.delayedTaskConfig(UserPatchBasePlugin.java:169)
at net.minecraftforge.gradle.user.UserBasePlugin.afterEvaluate(UserBasePlugin.java:909)
at net.minecraftforge.gradle.common.BasePlugin$2.execute(BasePlugin.java:102)
at net.minecraftforge.gradle.common.BasePlugin$2.execute(BasePlugin.java:98)
at org.gradle.listener.BroadcastDispatch$ActionInvocationHandler.dispatch(BroadcastDispatch.java:105)
at org.gradle.listener.BroadcastDispatch$ActionInvocationHandler.dispatch(BroadcastDispatch.java:94)
at org.gradle.listener.BroadcastDispatch.dispatch(BroadcastDispatch.java:79)
at org.gradle.listener.BroadcastDispatch.dispatch(BroadcastDispatch.java:31)
at org.gradle.messaging.dispatch.ProxyDispatchAdapter$DispatchingInvocationHandler.invoke(ProxyDispatchAdapter.java:93)
at com.sun.proxy.$Proxy13.afterEvaluate(Unknown Source)
at org.gradle.configuration.project.LifecycleProjectEvaluator.notifyAfterEvaluate(LifecycleProjectEvaluator.java:67)
at org.gradle.configuration.project.LifecycleProjectEvaluator.evaluate(LifecycleProjectEvaluator.java:61)
at org.gradle.api.internal.project.AbstractProject.evaluate(AbstractProject.java:507)
at org.gradle.api.internal.project.AbstractProject.evaluate(AbstractProject.java:82)
at org.gradle.configuration.DefaultBuildConfigurer.configure(DefaultBuildConfigurer.java:31)
at org.gradle.initialization.DefaultGradleLauncher.doBuildStages(DefaultGradleLauncher.java:142)
at org.gradle.initialization.DefaultGradleLauncher.doBuild(DefaultGradleLauncher.java:113)
at org.gradle.initialization.DefaultGradleLauncher.run(DefaultGradleLauncher.java:81)
at org.gradle.launcher.exec.InProcessBuildActionExecuter$DefaultBuildController.run(InProcessBuildActionExecuter.java:64)
at org.gradle.launcher.cli.ExecuteBuildAction.run(ExecuteBuildAction.java:33)
at org.gradle.launcher.cli.ExecuteBuildAction.run(ExecuteBuildAction.java:24)
at org.gradle.launcher.exec.InProcessBuildActionExecuter.execute(InProcessBuildActionExecuter.java:35)
at org.gradle.launcher.exec.InProcessBuildActionExecuter.execute(InProcessBuildActionExecuter.java:26)
at org.gradle.launcher.cli.RunBuildAction.run(RunBuildAction.java:50)
at org.gradle.internal.Actions$RunnableActionAdapter.execute(Actions.java:171)
at org.gradle.launcher.cli.CommandLineActionFactory$ParseAndBuildAction.execute(CommandLineActionFactory.java:201)
at org.gradle.launcher.cli.CommandLineActionFactory$ParseAndBuildAction.execute(CommandLineActionFactory.java:174)
at org.gradle.launcher.cli.CommandLineActionFactory$WithLogging.execute(CommandLineActionFactory.java:170)
at org.gradle.launcher.cli.CommandLineActionFactory$WithLogging.execute(CommandLineActionFactory.java:139)
at org.gradle.launcher.cli.ExceptionReportingAction.execute(ExceptionReportingAction.java:33)
at org.gradle.launcher.cli.ExceptionReportingAction.execute(ExceptionReportingAction.java:22)
at org.gradle.launcher.Main.doAction(Main.java:46)
at org.gradle.launcher.bootstrap.EntryPoint.run(EntryPoint.java:45)
at org.gradle.launcher.Main.main(Main.java:37)
at sun.reflect.NativeMethodAccessorImpl.invoke0(Native Method)
at sun.reflect.NativeMethodAccessorImpl.invoke(Unknown Source)
at sun.reflect.DelegatingMethodAccessorImpl.invoke(Unknown Source)
at java.lang.reflect.Method.invoke(Unknown Source)
at org.gradle.launcher.bootstrap.ProcessBootstrap.runNoExit(ProcessBootstrap.java:50)
at org.gradle.launcher.bootstrap.ProcessBootstrap.run(ProcessBootstrap.java:32)
at org.gradle.launcher.GradleMain.main(GradleMain.java:23)
at sun.reflect.NativeMethodAccessorImpl.invoke0(Native Method)
at sun.reflect.NativeMethodAccessorImpl.invoke(Unknown Source)
at sun.reflect.DelegatingMethodAccessorImpl.invoke(Unknown Source)
at java.lang.reflect.Method.invoke(Unknown Source)
at org.gradle.wrapper.BootstrapMainStarter.start(BootstrapMainStarter.java:30)
at org.gradle.wrapper.WrapperExecutor.execute(WrapperExecutor.java:127)
at org.gradle.wrapper.GradleWrapperMain.main(GradleWrapperMain.java:55)
23:27:00.032 [DEBUG] [org.gradle.api.internal.artifacts.ivyservice.resolveengine.DependencyGraphBuilder] Visiting configuration net.minecraftforge:forge:1.7.2-10.12.1.1060(default).
23:27:00.048 [DEBUG] [org.gradle.api.internal.artifacts.ivyservice.resolveengine.DependencyGraphBuilder] Attaching com.uourname.modid:Minecraft modding 2:1.0(userDevPackageDepConfig) to its parents.
23:27:00.048 [DEBUG] [org.gradle.api.internal.artifacts.ivyservice.resolveengine.DependencyGraphBuilder] Attaching net.minecraftforge:forge:1.7.2-10.12.1.1060(default) to its parents.
23:27:00.064 [DEBUG] [org.gradle.api.internal.artifacts.ivyservice.resolveengine.oldresult.TransientConfigurationResultsBuilder] Flushing resolved configuration data in Binary store in C:\Users\Davey\AppData\Local\Temp\gradle3189074344331550376.bin. Wrote root com.uourname.modid:Minecraft modding 2:1.0:userDevPackageDepConfig.
23:27:00.095 [DEBUG] [org.gradle.api.internal.artifacts.ivyservice.ivyresolve.CachingModuleVersionRepository] Found artifact 'net.minecraftforge:forge:1.7.2-10.12.1.1060:forge-userdev.jar' in resolver cache: C:\Users\Davey\.gradle\caches\modules-2\files-2.1\net.minecraftforge\forge\1.7.2-10.12.1.1060\c02a642fd017fedcb0cbffc6cdc94cff146c5677\forge-1.7.2-10.12.1.1060-userdev.jar
23:27:00.110 [iNFO] [org.gradle.api.Project] Resolving: {BUILD_DIR}/tmp/recompCls
23:27:00.126 [iNFO] [org.gradle.api.Project] Resolved:  C:/Users/Davey/Desktop/Minecraft modding 2/build/tmp/recompCls
23:27:00.142 [iNFO] [org.gradle.api.Project] Resolving: {API_CACHE_DIR}/forgeSrc-{API_VERSION}.jar
23:27:00.142 [iNFO] [org.gradle.api.Project] Resolved:  C:/Users/Davey/.gradle/caches/minecraft/net/minecraftforge/forge/1.7.2-10.12.1.1060/forgeSrc-1.7.2-10.12.1.1060.jar
23:27:00.157 [iNFO] [org.gradle.api.Project] Resolving: {BUILD_DIR}/natives
23:27:00.157 [iNFO] [org.gradle.api.Project] Resolved:  C:/Users/Davey/Desktop/Minecraft modding 2/build/natives
23:27:00.719 [DEBUG] [org.apache.http.impl.conn.PoolingClientConnectionManager] Connection manager is shutting down
23:27:00.719 [iNFO] [org.gradle.api.Project] Resolving: {BUILD_DIR}/natives
23:27:00.734 [DEBUG] [org.apache.http.impl.conn.DefaultClientConnection] Connection 0.0.0.0:51810<->216.137.59.128:443 closed
23:27:00.734 [iNFO] [org.gradle.api.Project] Resolved:  C:/Users/Davey/Desktop/Minecraft modding 2/build/natives
23:27:00.750 [DEBUG] [org.apache.http.impl.conn.DefaultClientConnection] Connection 0.0.0.0:51810<->216.137.59.128:443 closed
23:27:00.766 [iNFO] [org.gradle.api.Project] Resolving: {API_CACHE_DIR}/this-{API_VERSION}-doesnt.matter
23:27:00.766 [DEBUG] [org.apache.http.impl.conn.PoolingClientConnectionManager] Connection manager shut down
23:27:00.781 [iNFO] [org.gradle.api.Project] Resolved:  C:/Users/Davey/.gradle/caches/minecraft/net/minecraftforge/forge/1.7.2-10.12.1.1060/this-1.7.2-10.12.1.1060-doesnt.matter
23:27:00.812 [iNFO] [org.gradle.api.Project] Adding repo to : >> C:\Users\Davey\.gradle\caches\minecraft\net\minecraftforge\forge\1.7.2-10.12.1.1060
23:27:00.828 [iNFO] [org.gradle.api.Project] Resolving: {API_CACHE_DIR}/forgeSrc-{API_VERSION}-sources.jar
23:27:00.828 [iNFO] [org.gradle.api.Project] Resolved:  C:/Users/Davey/.gradle/caches/minecraft/net/minecraftforge/forge/1.7.2-10.12.1.1060/forgeSrc-1.7.2-10.12.1.1060-sources.jar
23:27:00.859 [iNFO] [org.gradle.api.Project] Resolving: {CACHE_DIR}/minecraft/assets/indexes/legacy.json
23:27:00.859 [iNFO] [org.gradle.api.Project] Resolved:  C:/Users/Davey/.gradle/caches/minecraft/assets/indexes/legacy.json
23:27:00.875 [iNFO] [org.gradle.api.Project] Resolving: {CACHE_DIR}/minecraft/assets/indexes/{ASSET_INDEX}.json
23:27:00.875 [iNFO] [org.gradle.api.Project] Resolved:  C:/Users/Davey/.gradle/caches/minecraft/assets/indexes/legacy.json
23:27:00.937 [iNFO] [org.gradle.BuildLogger] All projects evaluated.
23:27:01.062 [iNFO] [org.gradle.api.Project] Resolving: {BUILD_DIR}/sources/java
23:27:01.078 [iNFO] [org.gradle.api.Project] Resolved:  C:/Users/Davey/Desktop/Minecraft modding 2/build/sources/java
23:27:01.093 [iNFO] [org.gradle.api.Project] Resolving: {SRG_DIR}/srg.exc
23:27:01.093 [iNFO] [org.gradle.api.Project] Resolved:  C:/Users/Davey/.gradle/caches/minecraft/net/minecraftforge/forge/1.7.2-10.12.1.1060/srgs/srg.exc
23:27:01.109 [iNFO] [org.gradle.api.Project] Resolving: {SRG_DIR}/mcp-srg.srg
23:27:01.109 [iNFO] [org.gradle.api.Project] Resolved:  C:/Users/Davey/.gradle/caches/minecraft/net/minecraftforge/forge/1.7.2-10.12.1.1060/srgs/mcp-srg.srg
23:27:01.124 [iNFO] [org.gradle.api.Project] Resolving: {USER_DEV}/conf/methods.csv
23:27:01.124 [iNFO] [org.gradle.api.Project] Resolved:  C:/Users/Davey/.gradle/caches/minecraft/net/minecraftforge/forge/1.7.2-10.12.1.1060/unpacked/conf/methods.csv
23:27:01.140 [iNFO] [org.gradle.api.Project] Resolving: {API_CACHE_DIR}/{API_NAME}-{API_VERSION}-srg.jar
23:27:01.140 [iNFO] [org.gradle.api.Project] Resolved:  C:/Users/Davey/.gradle/caches/minecraft/net/minecraftforge/forge/1.7.2-10.12.1.1060/forge-1.7.2-10.12.1.1060-srg.jar
23:27:01.156 [iNFO] [org.gradle.api.Project] Resolving: {API_CACHE_DIR}/forgeSrc-{API_VERSION}.jar
23:27:01.156 [iNFO] [org.gradle.api.Project] Resolved:  C:/Users/Davey/.gradle/caches/minecraft/net/minecraftforge/forge/1.7.2-10.12.1.1060/forgeSrc-1.7.2-10.12.1.1060.jar
23:27:01.171 [iNFO] [org.gradle.api.Project] Resolving: {USER_DEV}/conf/packaged.srg
23:27:01.171 [iNFO] [org.gradle.api.Project] Resolved:  C:/Users/Davey/.gradle/caches/minecraft/net/minecraftforge/forge/1.7.2-10.12.1.1060/unpacked/conf/packaged.srg
23:27:01.187 [iNFO] [org.gradle.api.Project] Resolving: {USER_DEV}/conf/packaged.exc
23:27:01.187 [iNFO] [org.gradle.api.Project] Resolved:  C:/Users/Davey/.gradle/caches/minecraft/net/minecraftforge/forge/1.7.2-10.12.1.1060/unpacked/conf/packaged.exc
23:27:01.187 [iNFO] [org.gradle.api.Project] Resolving: {USER_DEV}/conf/methods.csv
23:27:01.202 [iNFO] [org.gradle.api.Project] Resolved:  C:/Users/Davey/.gradle/caches/minecraft/net/minecraftforge/forge/1.7.2-10.12.1.1060/unpacked/conf/methods.csv
23:27:01.202 [iNFO] [org.gradle.api.Project] Resolving: {USER_DEV}/conf/fields.csv
23:27:01.218 [iNFO] [org.gradle.api.Project] Resolved:  C:/Users/Davey/.gradle/caches/minecraft/net/minecraftforge/forge/1.7.2-10.12.1.1060/unpacked/conf/fields.csv
23:27:01.218 [iNFO] [org.gradle.api.Project] Resolving: C:\Users\Davey\.gradle\caches\modules-2\files-2.1\net.minecraftforge\forge\1.7.2-10.12.1.1060\c02a642fd017fedcb0cbffc6cdc94cff146c5677\forge-1.7.2-10.12.1.1060-userdev.jar
23:27:01.234 [iNFO] [org.gradle.api.Project] Resolved:  C:\Users\Davey\.gradle\caches\modules-2\files-2.1\net.minecraftforge\forge\1.7.2-10.12.1.1060\c02a642fd017fedcb0cbffc6cdc94cff146c5677\forge-1.7.2-10.12.1.1060-userdev.jar
23:27:01.249 [DEBUG] [org.gradle.execution.taskgraph.DefaultTaskGraphExecuter] Timing: Creating the DAG took 0.203 secs
23:27:01.249 [iNFO] [org.gradle.execution.TaskNameResolvingBuildConfigurationAction] Selected primary task 'build'
23:27:01.265 [iNFO] [org.gradle.BuildLogger] Tasks to be executed: [task ':compileApiJava', task ':processApiResources', task ':apiClasses', task ':sourceMainJava', task ':compileJava', task ':processResources', task ':classes', task ':jar', task ':compileTestJava', task ':processTestResources', task ':testClasses', task ':test', task ':extractUserDev', task ':genSrgs', task ':reobf', task ':assemble', task ':check', task ':build']
23:27:01.280 [iNFO] [org.gradle.execution.taskgraph.AbstractTaskPlanExecutor] :compileApiJava (Thread[main,5,main]) started.
23:27:01.280 [LIFECYCLE] [class org.gradle.TaskExecutionLogger] :compileApiJava
23:27:01.280 [DEBUG] [org.gradle.api.internal.tasks.execution.ExecuteAtMostOnceTaskExecuter] Starting to execute task ':compileApiJava'
23:27:01.296 [iNFO] [org.gradle.api.internal.tasks.execution.SkipEmptySourceFilesTaskExecuter] Skipping task ':compileApiJava' as it has no source files.
23:27:01.312 [DEBUG] [org.gradle.api.internal.tasks.execution.ExecuteAtMostOnceTaskExecuter] Finished executing task ':compileApiJava'
23:27:01.312 [LIFECYCLE] [class org.gradle.TaskExecutionLogger] :compileApiJava UP-TO-DATE
23:27:01.327 [iNFO] [org.gradle.execution.taskgraph.AbstractTaskPlanExecutor] :compileApiJava (Thread[main,5,main]) completed. Took 0.047 secs.
23:27:01.327 [iNFO] [org.gradle.execution.taskgraph.AbstractTaskPlanExecutor] :processApiResources (Thread[main,5,main]) started.
23:27:01.343 [LIFECYCLE] [class org.gradle.TaskExecutionLogger] :processApiResources
23:27:01.343 [DEBUG] [org.gradle.api.internal.tasks.execution.ExecuteAtMostOnceTaskExecuter] Starting to execute task ':processApiResources'
23:27:01.343 [iNFO] [org.gradle.api.internal.tasks.execution.SkipEmptySourceFilesTaskExecuter] Skipping task ':processApiResources' as it has no source files.
23:27:01.358 [DEBUG] [org.gradle.api.internal.tasks.execution.ExecuteAtMostOnceTaskExecuter] Finished executing task ':processApiResources'
23:27:01.358 [LIFECYCLE] [class org.gradle.TaskExecutionLogger] :processApiResources UP-TO-DATE
23:27:01.374 [iNFO] [org.gradle.execution.taskgraph.AbstractTaskPlanExecutor] :processApiResources (Thread[main,5,main]) completed. Took 0.031 secs.
23:27:01.374 [iNFO] [org.gradle.execution.taskgraph.AbstractTaskPlanExecutor] :apiClasses (Thread[main,5,main]) started.
23:27:01.390 [LIFECYCLE] [class org.gradle.TaskExecutionLogger] :apiClasses
23:27:01.390 [DEBUG] [org.gradle.api.internal.tasks.execution.ExecuteAtMostOnceTaskExecuter] Starting to execute task ':apiClasses'
23:27:01.405 [iNFO] [org.gradle.api.internal.tasks.execution.SkipTaskWithNoActionsExecuter] Skipping task ':apiClasses' as it has no actions.
23:27:01.405 [DEBUG] [org.gradle.api.internal.tasks.execution.ExecuteAtMostOnceTaskExecuter] Finished executing task ':apiClasses'
23:27:01.421 [LIFECYCLE] [class org.gradle.TaskExecutionLogger] :apiClasses UP-TO-DATE
23:27:01.421 [iNFO] [org.gradle.execution.taskgraph.AbstractTaskPlanExecutor] :apiClasses (Thread[main,5,main]) completed. Took 0.031 secs.
23:27:01.436 [iNFO] [org.gradle.execution.taskgraph.AbstractTaskPlanExecutor] :sourceMainJava (Thread[main,5,main]) started.
23:27:01.436 [LIFECYCLE] [class org.gradle.TaskExecutionLogger] :sourceMainJava
23:27:01.436 [DEBUG] [org.gradle.api.internal.tasks.execution.ExecuteAtMostOnceTaskExecuter] Starting to execute task ':sourceMainJava'
23:27:01.452 [DEBUG] [org.gradle.api.internal.tasks.execution.SkipUpToDateTaskExecuter] Determining if task ':sourceMainJava' is up-to-date
23:27:01.468 [DEBUG] [org.gradle.cache.internal.DefaultFileLockManager] Waiting to acquire exclusive lock on task history cache (C:\Users\Davey\Desktop\Minecraft modding 2\.gradle\1.11\taskArtifacts).
23:27:01.468 [DEBUG] [org.gradle.cache.internal.DefaultFileLockManager] Lock acquired.
23:27:01.483 [DEBUG] [org.gradle.cache.internal.btree.BTreePersistentIndexedCache] Opening cache taskArtifacts.bin (C:\Users\Davey\Desktop\Minecraft modding 2\.gradle\1.11\taskArtifacts\taskArtifacts.bin)
23:27:01.546 [DEBUG] [org.gradle.cache.internal.btree.BTreePersistentIndexedCache] Opening cache outputFileStates.bin (C:\Users\Davey\Desktop\Minecraft modding 2\.gradle\1.11\taskArtifacts\outputFileStates.bin)
23:27:01.561 [DEBUG] [org.gradle.cache.internal.btree.BTreePersistentIndexedCache] Opening cache fileHashes.bin (C:\Users\Davey\Desktop\Minecraft modding 2\.gradle\1.11\taskArtifacts\fileHashes.bin)
23:27:01.608 [DEBUG] [org.gradle.cache.internal.btree.BTreePersistentIndexedCache] Opening cache fileSnapshots.bin (C:\Users\Davey\Desktop\Minecraft modding 2\.gradle\1.11\taskArtifacts\fileSnapshots.bin)
23:27:01.639 [iNFO] [org.gradle.api.internal.tasks.execution.SkipUpToDateTaskExecuter] Skipping task ':sourceMainJava' as it is up-to-date (took 0.171 secs).
23:27:01.655 [DEBUG] [org.gradle.api.internal.tasks.execution.ExecuteAtMostOnceTaskExecuter] Finished executing task ':sourceMainJava'
23:27:01.655 [LIFECYCLE] [class org.gradle.TaskExecutionLogger] :sourceMainJava UP-TO-DATE
23:27:01.670 [iNFO] [org.gradle.execution.taskgraph.AbstractTaskPlanExecutor] :sourceMainJava (Thread[main,5,main]) completed. Took 0.234 secs.
23:27:01.670 [iNFO] [org.gradle.execution.taskgraph.AbstractTaskPlanExecutor] :compileJava (Thread[main,5,main]) started.
23:27:01.686 [LIFECYCLE] [class org.gradle.TaskExecutionLogger] :compileJava
23:27:01.686 [DEBUG] [org.gradle.api.internal.tasks.execution.ExecuteAtMostOnceTaskExecuter] Starting to execute task ':compileJava'
23:27:01.702 [DEBUG] [org.gradle.api.internal.tasks.execution.SkipUpToDateTaskExecuter] Determining if task ':compileJava' is up-to-date
23:27:01.733 [DEBUG] [org.gradle.api.internal.artifacts.ivyservice.resolveengine.DefaultDependencyResolver] Resolving configuration ':compile'
23:27:01.748 [DEBUG] [org.gradle.api.internal.artifacts.ivyservice.ivyresolve.memcache.InMemoryDependencyMetadataCache] Reusing in-memory cache for repo 'forge' [58d026f73bd51b2d7316bd092d31aca0].
23:27:01.748 [DEBUG] [org.gradle.api.internal.artifacts.ivyservice.ivyresolve.memcache.InMemoryDependencyMetadataCache] Reusing in-memory cache for repo 'MavenRepo' [e9d03b7c6586155fbee8fb2de8b5b149].
23:27:01.764 [DEBUG] [org.gradle.api.internal.artifacts.ivyservice.ivyresolve.memcache.InMemoryDependencyMetadataCache] Reusing in-memory cache for repo 'minecraft' [1a583fa30149d818dec07b24fb2d3986].
23:27:01.780 [DEBUG] [org.gradle.api.internal.artifacts.ivyservice.ivyresolve.memcache.InMemoryDependencyMetadataCache] Creating new in-memory cache for repo 'forgeFlatRepo' [adcf3f32252e328bcf404e0b80a9d1ae].
23:27:01.780 [DEBUG] [org.gradle.api.internal.artifacts.ivyservice.resolveengine.DependencyGraphBuilder] Visiting configuration com.uourname.modid:Minecraft modding 2:1.0(compile).
23:27:01.795 [DEBUG] [org.gradle.api.internal.artifacts.ivyservice.resolveengine.DependencyGraphBuilder] Visiting dependency com.uourname.modid:Minecraft modding 2:1.0(compile) -> :forgeSrc:1.7.2-10.12.1.1060(dependency: #forgeSrc;1.7.2-10.12.1.1060 {minecraft=[default]})
23:27:01.795 [DEBUG] [org.gradle.api.internal.artifacts.ivyservice.resolveengine.DependencyGraphBuilder] Selecting new module version :forgeSrc:1.7.2-10.12.1.1060
23:27:01.811 [DEBUG] [org.gradle.api.internal.artifacts.ivyservice.ivyresolve.UserResolverChain] Attempting to resolve module ':forgeSrc:1.7.2-10.12.1.1060' using repositories [forge, MavenRepo, minecraft, forgeFlatRepo]
23:27:01.826 [DEBUG] [org.gradle.api.internal.artifacts.ivyservice.ivyresolve.CachingModuleVersionRepository] Detected non-existence of module '#forgeSrc;1.7.2-10.12.1.1060' in resolver cache 'forge'
23:27:01.826 [DEBUG] [org.gradle.api.internal.artifacts.ivyservice.ivyresolve.CachingModuleVersionRepository] Detected non-existence of module '#forgeSrc;1.7.2-10.12.1.1060' in resolver cache 'MavenRepo'
23:27:01.842 [DEBUG] [org.gradle.api.internal.artifacts.repositories.resolver.ExternalResourceResolver] Loading https://libraries.minecraft.net//forgeSrc/1.7.2-10.12.1.1060/forgeSrc-1.7.2-10.12.1.1060.pom
23:27:01.842 [DEBUG] [org.gradle.api.internal.externalresource.transfer.DefaultCacheAwareExternalResourceAccessor] Constructing external resource: https://libraries.minecraft.net//forgeSrc/1.7.2-10.12.1.1060/forgeSrc-1.7.2-10.12.1.1060.pom
23:27:01.858 [DEBUG] [org.gradle.api.internal.externalresource.transport.http.HttpResourceAccessor] Constructing external resource: https://libraries.minecraft.net//forgeSrc/1.7.2-10.12.1.1060/forgeSrc-1.7.2-10.12.1.1060.pom
23:27:01.858 [DEBUG] [org.gradle.api.internal.externalresource.transport.http.HttpClientHelper] Performing HTTP GET: https://libraries.minecraft.net//forgeSrc/1.7.2-10.12.1.1060/forgeSrc-1.7.2-10.12.1.1060.pom
23:27:01.889 [DEBUG] [org.apache.http.impl.conn.PoolingClientConnectionManager] Connection request: [route: {s}->https://libraries.minecraft.net][total kept alive: 0; route allocated: 0 of 5; total allocated: 0 of 10]
23:27:01.889 [DEBUG] [org.apache.http.impl.conn.PoolingClientConnectionManager] Connection leased: [id: 1][route: {s}->https://libraries.minecraft.net][total kept alive: 0; route allocated: 1 of 5; total allocated: 1 of 10]
23:27:01.904 [DEBUG] [org.apache.http.impl.conn.DefaultClientConnectionOperator] Connecting to libraries.minecraft.net:443
23:27:01.998 [DEBUG] [org.apache.http.client.protocol.RequestAddCookies] CookieSpec selected: best-match
23:27:02.014 [DEBUG] [org.apache.http.client.protocol.RequestAuthCache] Auth cache not set in the context
23:27:02.014 [DEBUG] [org.apache.http.client.protocol.RequestTargetAuthentication] Target auth state: UNCHALLENGED
23:27:02.029 [DEBUG] [org.apache.http.client.protocol.RequestProxyAuthentication] Proxy auth state: UNCHALLENGED
23:27:02.029 [DEBUG] [org.apache.http.impl.client.SystemDefaultHttpClient] Attempt 1 to execute request
23:27:02.045 [DEBUG] [org.apache.http.impl.conn.DefaultClientConnection] Sending request: GET /forgeSrc/1.7.2-10.12.1.1060/forgeSrc-1.7.2-10.12.1.1060.pom HTTP/1.1
23:27:02.045 [DEBUG] [org.apache.http.headers] >> GET /forgeSrc/1.7.2-10.12.1.1060/forgeSrc-1.7.2-10.12.1.1060.pom HTTP/1.1
23:27:02.060 [DEBUG] [org.apache.http.headers] >> Accept-Encoding: gzip,deflate
23:27:02.060 [DEBUG] [org.apache.http.headers] >> Host: libraries.minecraft.net
23:27:02.076 [DEBUG] [org.apache.http.headers] >> Connection: Keep-Alive
23:27:02.076 [DEBUG] [org.apache.http.headers] >> User-Agent: Gradle/1.11 (Windows 7;6.1;amd64) (Oracle Corporation;1.8.0_05;25.5-b02)
23:27:02.185 [DEBUG] [org.apache.http.impl.conn.DefaultClientConnection] Receiving response: HTTP/1.1 403 Forbidden
23:27:02.185 [DEBUG] [org.apache.http.headers] << HTTP/1.1 403 Forbidden
23:27:02.201 [DEBUG] [org.apache.http.headers] << Content-Type: application/xml
23:27:02.201 [DEBUG] [org.apache.http.headers] << Transfer-Encoding: chunked
23:27:02.216 [DEBUG] [org.apache.http.headers] << Connection: keep-alive
23:27:02.216 [DEBUG] [org.apache.http.headers] << Date: Mon, 26 May 2014 21:27:05 GMT
23:27:02.216 [DEBUG] [org.apache.http.headers] << Server: AmazonS3
23:27:02.232 [DEBUG] [org.apache.http.headers] << X-Cache: Error from cloudfront
23:27:02.232 [DEBUG] [org.apache.http.headers] << Via: 1.1 d9552fc5d203b7c80e0dc882434351b8.cloudfront.net (CloudFront)
23:27:02.248 [DEBUG] [org.apache.http.headers] << X-Amz-Cf-Id: _5ghb652pjw96x-IVguLl4skATsP4ckC98HJ36SjMIpYRBZYOOFz2g==
23:27:02.248 [DEBUG] [org.apache.http.impl.client.SystemDefaultHttpClient] Connection can be kept alive indefinitely
23:27:02.263 [DEBUG] [org.apache.http.impl.conn.PoolingClientConnectionManager] Connection [id: 1][route: {s}->https://libraries.minecraft.net] can be kept alive indefinitely
23:27:02.263 [DEBUG] [org.apache.http.impl.conn.PoolingClientConnectionManager] Connection released: [id: 1][route: {s}->https://libraries.minecraft.net][total kept alive: 1; route allocated: 1 of 5; total allocated: 1 of 10]
23:27:02.279 [iNFO] [org.gradle.api.internal.externalresource.transport.http.HttpClientHelper] Failed to get resource: GET. [HTTP HTTP/1.1 403 Forbidden: https://libraries.minecraft.net//forgeSrc/1.7.2-10.12.1.1060/forgeSrc-1.7.2-10.12.1.1060.pom]
23:27:02.279 [DEBUG] [org.gradle.api.internal.artifacts.repositories.resolver.ExternalResourceResolver] Loading C:\Users\Davey\.gradle\caches\minecraft\net\minecraftforge\forge\1.7.2-10.12.1.1060/forgeSrc-1.7.2-10.12.1.1060.jar
23:27:02.497 [DEBUG] [org.gradle.api.internal.artifacts.repositories.resolver.ExternalResourceResolver] No meta-data file found for module '#forgeSrc;1.7.2-10.12.1.1060' in repository 'forgeFlatRepo', using default data instead.
23:27:02.513 [DEBUG] [org.gradle.api.internal.artifacts.ivyservice.ivyresolve.UserResolverChain] Using module ':forgeSrc:1.7.2-10.12.1.1060' from repository 'forgeFlatRepo'
23:27:02.513 [DEBUG] [org.gradle.api.internal.artifacts.ivyservice.ivyresolve.UserResolverChain] Discarding resolve failure.
org.gradle.api.UncheckedIOException: Could not GET 'https://libraries.minecraft.net//forgeSrc/1.7.2-10.12.1.1060/forgeSrc-1.7.2-10.12.1.1060.pom'. Received status code 403 from server: Forbidden
at org.gradle.api.internal.externalresource.transport.http.HttpClientHelper.processResponse(HttpClientHelper.java:121)
at org.gradle.api.internal.externalresource.transport.http.HttpClientHelper.performGet(HttpClientHelper.java:70)
at org.gradle.api.internal.externalresource.transport.http.HttpResourceAccessor.getResource(HttpResourceAccessor.java:46)
at org.gradle.api.internal.externalresource.transport.http.HttpResourceAccessor.getResource(HttpResourceAccessor.java:32)
at org.gradle.api.internal.externalresource.transfer.ProgressLoggingExternalResourceAccessor.getResource(ProgressLoggingExternalResourceAccessor.java:38)
at org.gradle.api.internal.externalresource.transfer.DefaultCacheAwareExternalResourceAccessor.getResource(DefaultCacheAwareExternalResourceAccessor.java:60)
at org.gradle.api.internal.externalresource.transport.DefaultExternalResourceRepository.getResource(DefaultExternalResourceRepository.java:65)
at org.gradle.api.internal.artifacts.repositories.resolver.ExternalResourceResolver.getResource(ExternalResourceResolver.java:427)
at org.gradle.api.internal.artifacts.repositories.resolver.ExternalResourceResolver.findStaticResourceUsingPatterns(ExternalResourceResolver.java:307)
at org.gradle.api.internal.artifacts.repositories.resolver.ExternalResourceResolver.findMetaDataFileUsingAnyPattern(ExternalResourceResolver.java:266)
at org.gradle.api.internal.artifacts.repositories.resolver.ExternalResourceResolver.findStaticDependency(ExternalResourceResolver.java:170)
at org.gradle.api.internal.artifacts.repositories.resolver.ExternalResourceResolver.getDependency(ExternalResourceResolver.java:165)
at org.gradle.api.internal.artifacts.repositories.resolver.MavenResolver.getDependency(MavenResolver.java:81)
at org.gradle.api.internal.artifacts.repositories.resolver.ExternalResourceResolver.getDependency(ExternalResourceResolver.java:157)
at org.gradle.api.internal.artifacts.ivyservice.ivyresolve.CacheLockingModuleVersionRepository$1.run(CacheLockingModuleVersionRepository.java:46)
at org.gradle.internal.Factories$1.create(Factories.java:22)
at org.gradle.cache.internal.DefaultCacheAccess.longRunningOperation(DefaultCacheAccess.java:237)
at org.gradle.cache.internal.DefaultCacheAccess.longRunningOperation(DefaultCacheAccess.java:308)
at org.gradle.cache.internal.DefaultPersistentDirectoryStore.longRunningOperation(DefaultPersistentDirectoryStore.java:114)
at org.gradle.cache.internal.DefaultCacheFactory$ReferenceTrackingCache.longRunningOperation(DefaultCacheFactory.java:185)
at org.gradle.api.internal.artifacts.ivyservice.DefaultCacheLockingManager.longRunningOperation(DefaultCacheLockingManager.java:57)
at org.gradle.api.internal.artifacts.ivyservice.ivyresolve.CacheLockingModuleVersionRepository.getDependency(CacheLockingModuleVersionRepository.java:44)
at org.gradle.api.internal.artifacts.ivyservice.ivyresolve.CachingModuleVersionRepository.getDependency(CachingModuleVersionRepository.java:90)
at org.gradle.api.internal.artifacts.ivyservice.ivyresolve.memcache.CachedRepository.getDependency(CachedRepository.java:55)
at org.gradle.api.internal.artifacts.ivyservice.ivyresolve.UserResolverChain$RepositoryResolveState.resolve(UserResolverChain.java:184)
at org.gradle.api.internal.artifacts.ivyservice.ivyresolve.UserResolverChain.findLatestModule(UserResolverChain.java:98)
at org.gradle.api.internal.artifacts.ivyservice.ivyresolve.UserResolverChain.findLatestModule(UserResolverChain.java:81)
at org.gradle.api.internal.artifacts.ivyservice.ivyresolve.UserResolverChain.resolve(UserResolverChain.java:56)
at org.gradle.api.internal.artifacts.ivyservice.clientmodule.ClientModuleResolver.resolve(ClientModuleResolver.java:34)
at org.gradle.api.internal.artifacts.ivyservice.projectmodule.ProjectDependencyResolver.resolve(ProjectDependencyResolver.java:48)
at org.gradle.api.internal.artifacts.ivyservice.ivyresolve.LazyDependencyToModuleResolver$AbstractVersionResolveResult.resolve(LazyDependencyToModuleResolver.java:86)
at org.gradle.api.internal.artifacts.ivyservice.resolveengine.DependencyGraphBuilder$ModuleVersionResolveState.resolve(DependencyGraphBuilder.java:650)
at org.gradle.api.internal.artifacts.ivyservice.resolveengine.DependencyGraphBuilder$ModuleVersionResolveState.getMetaData(DependencyGraphBuilder.java:661)
at org.gradle.api.internal.artifacts.ivyservice.resolveengine.DependencyGraphBuilder$DependencyEdge.calculateTargetConfigurations(DependencyGraphBuilder.java:337)
at org.gradle.api.internal.artifacts.ivyservice.resolveengine.DependencyGraphBuilder$DependencyEdge.attachToTargetConfigurations(DependencyGraphBuilder.java:311)
at org.gradle.api.internal.artifacts.ivyservice.resolveengine.DependencyGraphBuilder.traverseGraph(DependencyGraphBuilder.java:127)
at org.gradle.api.internal.artifacts.ivyservice.resolveengine.DependencyGraphBuilder.resolve(DependencyGraphBuilder.java:67)
at org.gradle.api.internal.artifacts.ivyservice.resolveengine.DefaultDependencyResolver$1.transform(DefaultDependencyResolver.java:108)
at org.gradle.api.internal.artifacts.ivyservice.resolveengine.DefaultDependencyResolver$1.transform(DefaultDependencyResolver.java:77)
at org.gradle.api.internal.artifacts.ivyservice.DefaultIvyContextManager.withIvy(DefaultIvyContextManager.java:61)
at org.gradle.api.internal.artifacts.ivyservice.resolveengine.DefaultDependencyResolver.resolve(DefaultDependencyResolver.java:77)
at org.gradle.api.internal.artifacts.ivyservice.CacheLockingArtifactDependencyResolver$1.create(CacheLockingArtifactDependencyResolver.java:39)
at org.gradle.api.internal.artifacts.ivyservice.CacheLockingArtifactDependencyResolver$1.create(CacheLockingArtifactDependencyResolver.java:37)
at org.gradle.cache.internal.DefaultCacheAccess.useCache(DefaultCacheAccess.java:187)
at org.gradle.cache.internal.DefaultPersistentDirectoryStore.useCache(DefaultPersistentDirectoryStore.java:102)
at org.gradle.cache.internal.DefaultCacheFactory$ReferenceTrackingCache.useCache(DefaultCacheFactory.java:189)
at org.gradle.api.internal.artifacts.ivyservice.DefaultCacheLockingManager.useCache(DefaultCacheLockingManager.java:61)
at org.gradle.api.internal.artifacts.ivyservice.CacheLockingArtifactDependencyResolver.resolve(CacheLockingArtifactDependencyResolver.java:37)
at org.gradle.api.internal.artifacts.ivyservice.SelfResolvingDependencyResolver.resolve(SelfResolvingDependencyResolver.java:41)
at org.gradle.api.internal.artifacts.ivyservice.ShortcircuitEmptyConfigsArtifactDependencyResolver.resolve(ShortcircuitEmptyConfigsArtifactDependencyResolver.java:51)
at org.gradle.api.internal.artifacts.ivyservice.ErrorHandlingArtifactDependencyResolver.resolve(ErrorHandlingArtifactDependencyResolver.java:44)
at org.gradle.api.internal.artifacts.ivyservice.DefaultConfigurationResolver.resolve(DefaultConfigurationResolver.java:42)
at org.gradle.api.internal.artifacts.configurations.DefaultConfiguration.resolveNow(DefaultConfiguration.java:240)
at org.gradle.api.internal.artifacts.configurations.DefaultConfiguration.getResolvedConfiguration(DefaultConfiguration.java:230)
at org.gradle.api.internal.artifacts.configurations.DefaultConfiguration_Decorated.getResolvedConfiguration(Unknown Source)
at org.gradle.api.internal.artifacts.configurations.DefaultConfiguration$ConfigurationFileCollection.getFiles(DefaultConfiguration.java:463)
at org.gradle.api.internal.artifacts.configurations.DefaultConfiguration.getFiles(DefaultConfiguration.java:202)
at org.gradle.api.internal.artifacts.configurations.DefaultConfiguration_Decorated.getFiles(Unknown Source)
at org.gradle.api.internal.file.collections.DefaultFileCollectionResolveContext$FileTreeConverter.convertInto(DefaultFileCollectionResolveContext.java:191)
at org.gradle.api.internal.file.collections.DefaultFileCollectionResolveContext.doResolve(DefaultFileCollectionResolveContext.java:103)
at org.gradle.api.internal.file.collections.DefaultFileCollectionResolveContext.resolveAsFileTrees(DefaultFileCollectionResolveContext.java:75)
at org.gradle.api.internal.file.collections.DefaultFileCollectionResolveContext$FileTreeConverter.convertInto(DefaultFileCollectionResolveContext.java:182)
at org.gradle.api.internal.file.collections.DefaultFileCollectionResolveContext.doResolve(DefaultFileCollectionResolveContext.java:98)
at org.gradle.api.internal.file.collections.DefaultFileCollectionResolveContext.resolveAsFileTrees(DefaultFileCollectionResolveContext.java:75)
at org.gradle.api.internal.file.CompositeFileCollection$1.resolve(CompositeFileCollection.java:88)
at org.gradle.api.internal.file.CompositeFileCollection.getSourceCollections(CompositeFileCollection.java:143)
at org.gradle.api.internal.file.CompositeFileTree.getSourceCollections(CompositeFileTree.java:30)
at org.gradle.api.internal.file.CompositeFileCollection.getFiles(CompositeFileCollection.java:38)
at org.gradle.api.internal.changedetection.state.DefaultFileSnapshotter.snapshot(DefaultFileSnapshotter.java:44)
at org.gradle.api.internal.changedetection.rules.InputFilesStateChangeRule.create(InputFilesStateChangeRule.java:33)
at org.gradle.api.internal.changedetection.rules.TaskUpToDateState.<init>(TaskUpToDateState.java:46)
at org.gradle.api.internal.changedetection.changes.DefaultTaskArtifactStateRepository$TaskArtifactStateImpl.getStates(DefaultTaskArtifactStateRepository.java:126)
at org.gradle.api.internal.changedetection.changes.DefaultTaskArtifactStateRepository$TaskArtifactStateImpl.isUpToDate(DefaultTaskArtifactStateRepository.java:69)
at org.gradle.api.internal.tasks.execution.SkipUpToDateTaskExecuter.execute(SkipUpToDateTaskExecuter.java:52)
at org.gradle.api.internal.tasks.execution.ValidatingTaskExecuter.execute(ValidatingTaskExecuter.java:58)
at org.gradle.api.internal.tasks.execution.SkipEmptySourceFilesTaskExecuter.execute(SkipEmptySourceFilesTaskExecuter.java:42)
at org.gradle.api.internal.tasks.execution.SkipTaskWithNoActionsExecuter.execute(SkipTaskWithNoActionsExecuter.java:52)
at org.gradle.api.internal.tasks.execution.SkipOnlyIfTaskExecuter.execute(SkipOnlyIfTaskExecuter.java:53)
at org.gradle.api.internal.tasks.execution.ExecuteAtMostOnceTaskExecuter.execute(ExecuteAtMostOnceTaskExecuter.java:43)
at org.gradle.api.internal.AbstractTask.executeWithoutThrowingTaskFailure(AbstractTask.java:289)
at org.gradle.execution.taskgraph.AbstractTaskPlanExecutor$TaskExecutorWorker.executeTask(AbstractTaskPlanExecutor.java:79)
at org.gradle.execution.taskgraph.AbstractTaskPlanExecutor$TaskExecutorWorker.processTask(AbstractTaskPlanExecutor.java:63)
at org.gradle.execution.taskgraph.AbstractTaskPlanExecutor$TaskExecutorWorker.run(AbstractTaskPlanExecutor.java:51)
at org.gradle.execution.taskgraph.DefaultTaskPlanExecutor.process(DefaultTaskPlanExecutor.java:23)
at org.gradle.execution.taskgraph.DefaultTaskGraphExecuter.execute(DefaultTaskGraphExecuter.java:86)
at org.gradle.execution.SelectedTaskExecutionAction.execute(SelectedTaskExecutionAction.java:29)
at org.gradle.execution.DefaultBuildExecuter.execute(DefaultBuildExecuter.java:61)
at org.gradle.execution.DefaultBuildExecuter.access$200(DefaultBuildExecuter.java:23)
at org.gradle.execution.DefaultBuildExecuter$2.proceed(DefaultBuildExecuter.java:67)
at org.gradle.execution.DryRunBuildExecutionAction.execute(DryRunBuildExecutionAction.java:32)
at org.gradle.execution.DefaultBuildExecuter.execute(DefaultBuildExecuter.java:61)
at org.gradle.execution.DefaultBuildExecuter.execute(DefaultBuildExecuter.java:54)
at org.gradle.initialization.DefaultGradleLauncher.doBuildStages(DefaultGradleLauncher.java:166)
at org.gradle.initialization.DefaultGradleLauncher.doBuild(DefaultGradleLauncher.java:113)
at org.gradle.initialization.DefaultGradleLauncher.run(DefaultGradleLauncher.java:81)
at org.gradle.launcher.exec.InProcessBuildActionExecuter$DefaultBuildController.run(InProcessBuildActionExecuter.java:64)
at org.gradle.launcher.cli.ExecuteBuildAction.run(ExecuteBuildAction.java:33)
at org.gradle.launcher.cli.ExecuteBuildAction.run(ExecuteBuildAction.java:24)
at org.gradle.launcher.exec.InProcessBuildActionExecuter.execute(InProcessBuildActionExecuter.java:35)
at org.gradle.launcher.exec.InProcessBuildActionExecuter.execute(InProcessBuildActionExecuter.java:26)
at org.gradle.launcher.cli.RunBuildAction.run(RunBuildAction.java:50)
at org.gradle.internal.Actions$RunnableActionAdapter.execute(Actions.java:171)
at org.gradle.launcher.cli.CommandLineActionFactory$ParseAndBuildAction.execute(CommandLineActionFactory.java:201)
at org.gradle.launcher.cli.CommandLineActionFactory$ParseAndBuildAction.execute(CommandLineActionFactory.java:174)
at org.gradle.launcher.cli.CommandLineActionFactory$WithLogging.execute(CommandLineActionFactory.java:170)
at org.gradle.launcher.cli.CommandLineActionFactory$WithLogging.execute(CommandLineActionFactory.java:139)
at org.gradle.launcher.cli.ExceptionReportingAction.execute(ExceptionReportingAction.java:33)
at org.gradle.launcher.cli.ExceptionReportingAction.execute(ExceptionReportingAction.java:22)
at org.gradle.launcher.Main.doAction(Main.java:46)
at org.gradle.launcher.bootstrap.EntryPoint.run(EntryPoint.java:45)
at org.gradle.launcher.Main.main(Main.java:37)
at sun.reflect.NativeMethodAccessorImpl.invoke0(Native Method)
at sun.reflect.NativeMethodAccessorImpl.invoke(Unknown Source)
at sun.reflect.DelegatingMethodAccessorImpl.invoke(Unknown Source)
at java.lang.reflect.Method.invoke(Unknown Source)
at org.gradle.launcher.bootstrap.ProcessBootstrap.runNoExit(ProcessBootstrap.java:50)
at org.gradle.launcher.bootstrap.ProcessBootstrap.run(ProcessBootstrap.java:32)
at org.gradle.launcher.GradleMain.main(GradleMain.java:23)
at sun.reflect.NativeMethodAccessorImpl.invoke0(Native Method)
at sun.reflect.NativeMethodAccessorImpl.invoke(Unknown Source)
at sun.reflect.DelegatingMethodAccessorImpl.invoke(Unknown Source)
at java.lang.reflect.Method.invoke(Unknown Source)
at org.gradle.wrapper.BootstrapMainStarter.start(BootstrapMainStarter.java:30)
at org.gradle.wrapper.WrapperExecutor.execute(WrapperExecutor.java:127)
at org.gradle.wrapper.GradleWrapperMain.main(GradleWrapperMain.java:55)
23:27:02.700 [DEBUG] [org.gradle.api.internal.artifacts.ivyservice.resolveengine.DependencyGraphBuilder] Visiting dependency com.uourname.modid:Minecraft modding 2:1.0(compile) -> net.minecraft:launchwrapper:1.9(dependency: net.minecraft#launchwrapper;1.9 {minecraftDeps=[default]})
23:27:02.700 [DEBUG] [org.gradle.api.internal.artifacts.ivyservice.resolveengine.DependencyGraphBuilder] Selecting new module version net.minecraft:launchwrapper:1.9
23:27:02.716 [DEBUG] [org.gradle.api.internal.artifacts.ivyservice.ivyresolve.UserResolverChain] Attempting to resolve module 'net.minecraft:launchwrapper:1.9' using repositories [forge, MavenRepo, minecraft, forgeFlatRepo]
23:27:02.716 [DEBUG] [org.gradle.api.internal.artifacts.ivyservice.ivyresolve.CachingModuleVersionRepository] Detected non-existence of module 'net.minecraft#launchwrapper;1.9' in resolver cache 'forge'
23:27:02.731 [DEBUG] [org.gradle.api.internal.artifacts.ivyservice.ivyresolve.CachingModuleVersionRepository] Detected non-existence of module 'net.minecraft#launchwrapper;1.9' in resolver cache 'MavenRepo'
23:27:02.747 [DEBUG] [org.gradle.api.internal.artifacts.ivyservice.ivyresolve.parser.IvyXmlModuleDescriptorParser] post 1.3 ivy file: using exact as default matcher
23:27:02.762 [DEBUG] [org.gradle.api.internal.artifacts.ivyservice.ivyresolve.CachingModuleVersionRepository] Using cached module metadata for module 'net.minecraft#launchwrapper;1.9' in 'minecraft'
23:27:02.762 [DEBUG] [org.gradle.api.internal.artifacts.ivyservice.ivyresolve.UserResolverChain] Using module 'net.minecraft:launchwrapper:1.9' from repository 'minecraft'
23:27:02.778 [DEBUG] [org.gradle.api.internal.artifacts.ivyservice.resolveengine.DependencyGraphBuilder] Visiting dependency com.uourname.modid:Minecraft modding 2:1.0(compile) -> org.ow2.asm:asm-debug-all:4.1(dependency: org.ow2.asm#asm-debug-all;4.1 {minecraftDeps=[default]})
23:27:02.794 [DEBUG] [org.gradle.api.internal.artifacts.ivyservice.resolveengine.DependencyGraphBuilder] Selecting new module version org.ow2.asm:asm-debug-all:4.1
23:27:02.794 [DEBUG] [org.gradle.api.internal.artifacts.ivyservice.ivyresolve.UserResolverChain] Attempting to resolve module 'org.ow2.asm:asm-debug-all:4.1' using repositories [forge, MavenRepo, minecraft, forgeFlatRepo]
23:27:02.809 [DEBUG] [org.gradle.api.internal.artifacts.ivyservice.ivyresolve.CachingModuleVersionRepository] Detected non-existence of module 'org.ow2.asm#asm-debug-all;4.1' in resolver cache 'forge'
23:27:02.809 [DEBUG] [org.gradle.api.internal.artifacts.ivyservice.ivyresolve.UserResolverChain] Using module 'org.ow2.asm:asm-debug-all:4.1' from repository 'MavenRepo'
23:27:02.825 [DEBUG] [org.gradle.api.internal.artifacts.ivyservice.resolveengine.DependencyGraphBuilder] Visiting dependency com.uourname.modid:Minecraft modding 2:1.0(compile) -> org.scala-lang:scala-library:2.10.2(dependency: org.scala-lang#scala-library;2.10.2 {minecraftDeps=[default]})
23:27:02.840 [DEBUG] [org.gradle.api.internal.artifacts.ivyservice.resolveengine.DependencyGraphBuilder] Selecting new module version org.scala-lang:scala-library:2.10.2
23:27:02.840 [DEBUG] [org.gradle.api.internal.artifacts.ivyservice.ivyresolve.UserResolverChain] Attempting to resolve module 'org.scala-lang:scala-library:2.10.2' using repositories [forge, MavenRepo, minecraft, forgeFlatRepo]
23:27:02.856 [DEBUG] [org.gradle.api.internal.artifacts.ivyservice.ivyresolve.CachingModuleVersionRepository] Detected non-existence of module 'org.scala-lang#scala-library;2.10.2' in resolver cache 'forge'
23:27:02.856 [DEBUG] [org.gradle.api.internal.artifacts.ivyservice.ivyresolve.parser.IvyXmlModuleDescriptorParser] post 1.3 ivy file: using exact as default matcher
23:27:02.872 [DEBUG] [org.gradle.api.internal.artifacts.ivyservice.ivyresolve.CachingModuleVersionRepository] Using cached module metadata for module 'org.scala-lang#scala-library;2.10.2' in 'MavenRepo'
23:27:02.887 [DEBUG] [org.gradle.api.internal.artifacts.ivyservice.ivyresolve.UserResolverChain] Using module 'org.scala-lang:scala-library:2.10.2' from repository 'MavenRepo'
23:27:02.887 [DEBUG] [org.gradle.api.internal.artifacts.ivyservice.resolveengine.DependencyGraphBuilder] Visiting dependency com.uourname.modid:Minecraft modding 2:1.0(compile) -> org.scala-lang:scala-compiler:2.10.2(dependency: org.scala-lang#scala-compiler;2.10.2 {minecraftDeps=[default]})
23:27:02.903 [DEBUG] [org.gradle.api.internal.artifacts.ivyservice.resolveengine.DependencyGraphBuilder] Selecting new module version org.scala-lang:scala-compiler:2.10.2
23:27:02.903 [DEBUG] [org.gradle.api.internal.artifacts.ivyservice.ivyresolve.UserResolverChain] Attempting to resolve module 'org.scala-lang:scala-compiler:2.10.2' using repositories [forge, MavenRepo, minecraft, forgeFlatRepo]
23:27:02.918 [DEBUG] [org.gradle.api.internal.artifacts.ivyservice.ivyresolve.CachingModuleVersionRepository] Detected non-existence of module 'org.scala-lang#scala-compiler;2.10.2' in resolver cache 'forge'
23:27:02.918 [DEBUG] [org.gradle.api.internal.artifacts.ivyservice.ivyresolve.parser.IvyXmlModuleDescriptorParser] post 1.3 ivy file: using exact as default matcher
23:27:02.934 [DEBUG] [org.gradle.api.internal.artifacts.ivyservice.ivyresolve.CachingModuleVersionRepository] Using cached module metadata for module 'org.scala-lang#scala-compiler;2.10.2' in 'MavenRepo'
23:27:02.950 [DEBUG] [org.gradle.api.internal.artifacts.ivyservice.ivyresolve.UserResolverChain] Using module 'org.scala-lang:scala-compiler:2.10.2' from repository 'MavenRepo'
23:27:02.950 [DEBUG] [org.gradle.api.internal.artifacts.ivyservice.resolveengine.DependencyGraphBuilder] Visiting dependency com.uourname.modid:Minecraft modding 2:1.0(compile) -> net.sf.jopt-simple:jopt-simple:4.5(dependency: net.sf.jopt-simple#jopt-simple;4.5 {minecraftDeps=[default]})
23:27:02.965 [DEBUG] [org.gradle.api.internal.artifacts.ivyservice.resolveengine.DependencyGraphBuilder] Selecting new module version net.sf.jopt-simple:jopt-simple:4.5
23:27:02.981 [DEBUG] [org.gradle.api.internal.artifacts.ivyservice.ivyresolve.UserResolverChain] Attempting to resolve module 'net.sf.jopt-simple:jopt-simple:4.5' using repositories [forge, MavenRepo, minecraft, forgeFlatRepo]
23:27:02.981 [DEBUG] [org.gradle.api.internal.artifacts.ivyservice.ivyresolve.CachingModuleVersionRepository] Detected non-existence of module 'net.sf.jopt-simple#jopt-simple;4.5' in resolver cache 'forge'
23:27:02.996 [DEBUG] [org.gradle.api.internal.artifacts.ivyservice.ivyresolve.UserResolverChain] Using module 'net.sf.jopt-simple:jopt-simple:4.5' from repository 'MavenRepo'
23:27:02.996 [DEBUG] [org.gradle.api.internal.artifacts.ivyservice.resolveengine.DependencyGraphBuilder] Visiting dependency com.uourname.modid:Minecraft modding 2:1.0(compile) -> java3d:vecmath:1.3.1(dependency: java3d#vecmath;1.3.1 {minecraftDeps=[default]})
23:27:03.012 [DEBUG] [org.gradle.api.internal.artifacts.ivyservice.resolveengine.DependencyGraphBuilder] Selecting new module version java3d:vecmath:1.3.1
23:27:03.012 [DEBUG] [org.gradle.api.internal.artifacts.ivyservice.ivyresolve.UserResolverChain] Attempting to resolve module 'java3d:vecmath:1.3.1' using repositories [forge, MavenRepo, minecraft, forgeFlatRepo]
23:27:03.028 [DEBUG] [org.gradle.api.internal.artifacts.ivyservice.ivyresolve.CachingModuleVersionRepository] Detected non-existence of module 'java3d#vecmath;1.3.1' in resolver cache 'forge'
23:27:03.043 [DEBUG] [org.gradle.api.internal.artifacts.ivyservice.ivyresolve.parser.IvyXmlModuleDescriptorParser] post 1.3 ivy file: using exact as default matcher
23:27:03.043 [DEBUG] [org.gradle.api.internal.artifacts.ivyservice.ivyresolve.CachingModuleVersionRepository] Using cached module metadata for module 'java3d#vecmath;1.3.1' in 'MavenRepo'
23:27:03.059 [DEBUG] [org.gradle.api.internal.artifacts.ivyservice.ivyresolve.UserResolverChain] Using module 'java3d:vecmath:1.3.1' from repository 'MavenRepo'
23:27:03.059 [DEBUG] [org.gradle.api.internal.artifacts.ivyservice.resolveengine.DependencyGraphBuilder] Visiting dependency com.uourname.modid:Minecraft modding 2:1.0(compile) -> net.sf.trove4j:trove4j:3.0.3(dependency: net.sf.trove4j#trove4j;3.0.3 {minecraftDeps=[default]})
23:27:03.074 [DEBUG] [org.gradle.api.internal.artifacts.ivyservice.resolveengine.DependencyGraphBuilder] Selecting new module version net.sf.trove4j:trove4j:3.0.3
23:27:03.074 [DEBUG] [org.gradle.api.internal.artifacts.ivyservice.ivyresolve.UserResolverChain] Attempting to resolve module 'net.sf.trove4j:trove4j:3.0.3' using repositories [forge, MavenRepo, minecraft, forgeFlatRepo]
23:27:03.090 [DEBUG] [org.gradle.api.internal.artifacts.ivyservice.ivyresolve.CachingModuleVersionRepository] Detected non-existence of module 'net.sf.trove4j#trove4j;3.0.3' in resolver cache 'forge'
23:27:03.106 [DEBUG] [org.gradle.api.internal.artifacts.ivyservice.ivyresolve.parser.IvyXmlModuleDescriptorParser] post 1.3 ivy file: using exact as default matcher
23:27:03.106 [DEBUG] [org.gradle.api.internal.artifacts.ivyservice.ivyresolve.CachingModuleVersionRepository] Using cached module metadata for module 'net.sf.trove4j#trove4j;3.0.3' in 'MavenRepo'
23:27:03.121 [DEBUG] [org.gradle.api.internal.artifacts.ivyservice.ivyresolve.UserResolverChain] Using module 'net.sf.trove4j:trove4j:3.0.3' from repository 'MavenRepo'
23:27:03.121 [DEBUG] [org.gradle.api.internal.artifacts.ivyservice.resolveengine.DependencyGraphBuilder] Visiting dependency com.uourname.modid:Minecraft modding 2:1.0(compile) -> com.ibm.icu:icu4j-core-mojang:51.2(dependency: com.ibm.icu#icu4j-core-mojang;51.2 {minecraftDeps=[default]})
23:27:03.137 [DEBUG] [org.gradle.api.internal.artifacts.ivyservice.resolveengine.DependencyGraphBuilder] Selecting new module version com.ibm.icu:icu4j-core-mojang:51.2
23:27:03.137 [DEBUG] [org.gradle.api.internal.artifacts.ivyservice.ivyresolve.UserResolverChain] Attempting to resolve module 'com.ibm.icu:icu4j-core-mojang:51.2' using repositories [forge, MavenRepo, minecraft, forgeFlatRepo]
23:27:03.152 [DEBUG] [org.gradle.api.internal.artifacts.ivyservice.ivyresolve.CachingModuleVersionRepository] Detected non-existence of module 'com.ibm.icu#icu4j-core-mojang;51.2' in resolver cache 'forge'
23:27:03.152 [DEBUG] [org.gradle.api.internal.artifacts.ivyservice.ivyresolve.CachingModuleVersionRepository] Detected non-existence of module 'com.ibm.icu#icu4j-core-mojang;51.2' in resolver cache 'MavenRepo'
23:27:03.168 [DEBUG] [org.gradle.api.internal.artifacts.ivyservice.ivyresolve.parser.IvyXmlModuleDescriptorParser] post 1.3 ivy file: using exact as default matcher
23:27:03.184 [DEBUG] [org.gradle.api.internal.artifacts.ivyservice.ivyresolve.CachingModuleVersionRepository] Using cached module metadata for module 'com.ibm.icu#icu4j-core-mojang;51.2' in 'minecraft'
23:27:03.184 [DEBUG] [org.gradle.api.internal.artifacts.ivyservice.ivyresolve.UserResolverChain] Using module 'com.ibm.icu:icu4j-core-mojang:51.2' from repository 'minecraft'
23:27:03.199 [DEBUG] [org.gradle.api.internal.artifacts.ivyservice.resolveengine.DependencyGraphBuilder] Visiting dependency com.uourname.modid:Minecraft modding 2:1.0(compile) -> lzma:lzma:0.0.1(dependency: lzma#lzma;0.0.1 {minecraftDeps=[default]})
23:27:03.199 [DEBUG] [org.gradle.api.internal.artifacts.ivyservice.resolveengine.DependencyGraphBuilder] Selecting new module version lzma:lzma:0.0.1
23:27:03.215 [DEBUG] [org.gradle.api.internal.artifacts.ivyservice.ivyresolve.UserResolverChain] Attempting to resolve module 'lzma:lzma:0.0.1' using repositories [forge, MavenRepo, minecraft, forgeFlatRepo]
23:27:03.215 [DEBUG] [org.gradle.api.internal.artifacts.ivyservice.ivyresolve.CachingModuleVersionRepository] Detected non-existence of module 'lzma#lzma;0.0.1' in resolver cache 'forge'
23:27:03.230 [DEBUG] [org.gradle.api.internal.artifacts.ivyservice.ivyresolve.CachingModuleVersionRepository] Detected non-existence of module 'lzma#lzma;0.0.1' in resolver cache 'MavenRepo'
23:27:03.246 [DEBUG] [org.gradle.api.internal.artifacts.ivyservice.ivyresolve.parser.IvyXmlModuleDescriptorParser] post 1.3 ivy file: using exact as default matcher
23:27:03.246 [DEBUG] [org.gradle.api.internal.artifacts.ivyservice.ivyresolve.CachingModuleVersionRepository] Using cached module metadata for module 'lzma#lzma;0.0.1' in 'minecraft'
23:27:03.262 [DEBUG] [org.gradle.api.internal.artifacts.ivyservice.ivyresolve.UserResolverChain] Using module 'lzma:lzma:0.0.1' from repository 'minecraft'
23:27:03.277 [DEBUG] [org.gradle.api.internal.artifacts.ivyservice.resolveengine.DependencyGraphBuilder] Visiting dependency com.uourname.modid:Minecraft modding 2:1.0(compile) -> com.paulscode:codecjorbis:20101023(dependency: com.paulscode#codecjorbis;20101023 {minecraftDeps=[default]})
23:27:03.277 [DEBUG] [org.gradle.api.internal.artifacts.ivyservice.resolveengine.DependencyGraphBuilder] Selecting new module version com.paulscode:codecjorbis:20101023
23:27:03.293 [DEBUG] [org.gradle.api.internal.artifacts.ivyservice.ivyresolve.UserResolverChain] Attempting to resolve module 'com.paulscode:codecjorbis:20101023' using repositories [forge, MavenRepo, minecraft, forgeFlatRepo]
23:27:03.293 [DEBUG] [org.gradle.api.internal.artifacts.ivyservice.ivyresolve.CachingModuleVersionRepository] Detected non-existence of module 'com.paulscode#codecjorbis;20101023' in resolver cache 'forge'
23:27:03.308 [DEBUG] [org.gradle.api.internal.artifacts.ivyservice.ivyresolve.CachingModuleVersionRepository] Detected non-existence of module 'com.paulscode#codecjorbis;20101023' in resolver cache 'MavenRepo'
23:27:03.324 [DEBUG] [org.gradle.api.internal.artifacts.ivyservice.ivyresolve.parser.IvyXmlModuleDescriptorParser] post 1.3 ivy file: using exact as default matcher
23:27:03.324 [DEBUG] [org.gradle.api.internal.artifacts.ivyservice.ivyresolve.CachingModuleVersionRepository] Using cached module metadata for module 'com.paulscode#codecjorbis;20101023' in 'minecraft'
23:27:03.340 [DEBUG] [org.gradle.api.internal.artifacts.ivyservice.ivyresolve.UserResolverChain] Using module 'com.paulscode:codecjorbis:20101023' from repository 'minecraft'
23:27:03.340 [DEBUG] [org.gradle.api.internal.artifacts.ivyservice.resolveengine.DependencyGraphBuilder] Visiting dependency com.uourname.modid:Minecraft modding 2:1.0(compile) -> com.paulscode:codecwav:20101023(dependency: com.paulscode#codecwav;20101023 {minecraftDeps=[default]})
23:27:03.355 [DEBUG] [org.gradle.api.internal.artifacts.ivyservice.resolveengine.DependencyGraphBuilder] Selecting new module version com.paulscode:codecwav:20101023
23:27:03.371 [DEBUG] [org.gradle.api.internal.artifacts.ivyservice.ivyresolve.UserResolverChain] Attempting to resolve module 'com.paulscode:codecwav:20101023' using repositories [forge, MavenRepo, minecraft, forgeFlatRepo]
23:27:03.371 [DEBUG] [org.gradle.api.internal.artifacts.ivyservice.ivyresolve.CachingModuleVersionRepository] Detected non-existence of module 'com.paulscode#codecwav;20101023' in resolver cache 'forge'
23:27:03.386 [DEBUG] [org.gradle.api.internal.artifacts.ivyservice.ivyresolve.CachingModuleVersionRepository] Detected non-existence of module 'com.paulscode#codecwav;20101023' in resolver cache 'MavenRepo'
23:27:03.386 [DEBUG] [org.gradle.api.internal.artifacts.ivyservice.ivyresolve.parser.IvyXmlModuleDescriptorParser] post 1.3 ivy file: using exact as default matcher
23:27:03.402 [DEBUG] [org.gradle.api.internal.artifacts.ivyservice.ivyresolve.CachingModuleVersionRepository] Using cached module metadata for module 'com.paulscode#codecwav;20101023' in 'minecraft'
23:27:03.418 [DEBUG] [org.gradle.api.internal.artifacts.ivyservice.ivyresolve.UserResolverChain] Using module 'com.paulscode:codecwav:20101023' from repository 'minecraft'
23:27:03.418 [DEBUG] [org.gradle.api.internal.artifacts.ivyservice.resolveengine.DependencyGraphBuilder] Visiting dependency com.uourname.modid:Minecraft modding 2:1.0(compile) -> com.paulscode:libraryjavasound:20101123(dependency: com.paulscode#libraryjavasound;20101123 {minecraftDeps=[default]})
23:27:03.433 [DEBUG] [org.gradle.api.internal.artifacts.ivyservice.resolveengine.DependencyGraphBuilder] Selecting new module version com.paulscode:libraryjavasound:20101123
23:27:03.433 [DEBUG] [org.gradle.api.internal.artifacts.ivyservice.ivyresolve.UserResolverChain] Attempting to resolve module 'com.paulscode:libraryjavasound:20101123' using repositories [forge, MavenRepo, minecraft, forgeFlatRepo]
23:27:03.449 [DEBUG] [org.gradle.api.internal.artifacts.ivyservice.ivyresolve.CachingModuleVersionRepository] Detected non-existence of module 'com.paulscode#libraryjavasound;20101123' in resolver cache 'forge'
23:27:03.449 [DEBUG] [org.gradle.api.internal.artifacts.ivyservice.ivyresolve.CachingModuleVersionRepository] Detected non-existence of module 'com.paulscode#libraryjavasound;20101123' in resolver cache 'MavenRepo'
23:27:03.464 [DEBUG] [org.gradle.api.internal.artifacts.ivyservice.ivyresolve.parser.IvyXmlModuleDescriptorParser] post 1.3 ivy file: using exact as default matcher
23:27:03.480 [DEBUG] [org.gradle.api.internal.artifacts.ivyservice.ivyresolve.CachingModuleVersionRepository] Using cached module metadata for module 'com.paulscode#libraryjavasound;20101123' in 'minecraft'
23:27:03.496 [DEBUG] [org.gradle.api.internal.artifacts.ivyservice.ivyresolve.UserResolverChain] Using module 'com.paulscode:libraryjavasound:20101123' from repository 'minecraft'
23:27:03.496 [DEBUG] [org.gradle.api.internal.artifacts.ivyservice.resolveengine.DependencyGraphBuilder] Visiting dependency com.uourname.modid:Minecraft modding 2:1.0(compile) -> com.paulscode:librarylwjglopenal:20100824(dependency: com.paulscode#librarylwjglopenal;20100824 {minecraftDeps=[default]})
23:27:03.511 [DEBUG] [org.gradle.api.internal.artifacts.ivyservice.resolveengine.DependencyGraphBuilder] Selecting new module version com.paulscode:librarylwjglopenal:20100824
23:27:03.527 [DEBUG] [org.gradle.api.internal.artifacts.ivyservice.ivyresolve.UserResolverChain] Attempting to resolve module 'com.paulscode:librarylwjglopenal:20100824' using repositories [forge, MavenRepo, minecraft, forgeFlatRepo]
23:27:03.527 [DEBUG] [org.gradle.api.internal.artifacts.ivyservice.ivyresolve.CachingModuleVersionRepository] Detected non-existence of module 'com.paulscode#librarylwjglopenal;20100824' in resolver cache 'forge'
23:27:03.542 [DEBUG] [org.gradle.api.internal.artifacts.ivyservice.ivyresolve.CachingModuleVersionRepository] Detected non-existence of module 'com.paulscode#librarylwjglopenal;20100824' in resolver cache 'MavenRepo'
23:27:03.558 [DEBUG] [org.gradle.api.internal.artifacts.ivyservice.ivyresolve.parser.IvyXmlModuleDescriptorParser] post 1.3 ivy file: using exact as default matcher
23:27:03.558 [DEBUG] [org.gradle.api.internal.artifacts.ivyservice.ivyresolve.CachingModuleVersionRepository] Using cached module metadata for module 'com.paulscode#librarylwjglopenal;20100824' in 'minecraft'
23:27:03.574 [DEBUG] [org.gradle.api.internal.artifacts.ivyservice.ivyresolve.UserResolverChain] Using module 'com.paulscode:librarylwjglopenal:20100824' from repository 'minecraft'
23:27:03.574 [DEBUG] [org.gradle.api.internal.artifacts.ivyservice.resolveengine.DependencyGraphBuilder] Visiting dependency com.uourname.modid:Minecraft modding 2:1.0(compile) -> com.paulscode:soundsystem:20120107(dependency: com.paulscode#soundsystem;20120107 {minecraftDeps=[default]})
23:27:03.589 [DEBUG] [org.gradle.api.internal.artifacts.ivyservice.resolveengine.DependencyGraphBuilder] Selecting new module version com.paulscode:soundsystem:20120107
23:27:03.589 [DEBUG] [org.gradle.api.internal.artifacts.ivyservice.ivyresolve.UserResolverChain] Attempting to resolve module 'com.paulscode:soundsystem:20120107' using repositories [forge, MavenRepo, minecraft, forgeFlatRepo]
23:27:03.605 [DEBUG] [org.gradle.api.internal.artifacts.ivyservice.ivyresolve.CachingModuleVersionRepository] Detected non-existence of module 'com.paulscode#soundsystem;20120107' in resolver cache 'forge'
23:27:03.620 [DEBUG] [org.gradle.api.internal.artifacts.ivyservice.ivyresolve.CachingModuleVersionRepository] Detected non-existence of module 'com.paulscode#soundsystem;20120107' in resolver cache 'MavenRepo'
23:27:03.620 [DEBUG] [org.gradle.api.internal.artifacts.ivyservice.ivyresolve.parser.IvyXmlModuleDescriptorParser] post 1.3 ivy file: using exact as default matcher
23:27:03.636 [DEBUG] [org.gradle.api.internal.artifacts.ivyservice.ivyresolve.CachingModuleVersionRepository] Using cached module metadata for module 'com.paulscode#soundsystem;20120107' in 'minecraft'
23:27:03.636 [DEBUG] [org.gradle.api.internal.artifacts.ivyservice.ivyresolve.UserResolverChain] Using module 'com.paulscode:soundsystem:20120107' from repository 'minecraft'
23:27:03.652 [DEBUG] [org.gradle.api.internal.artifacts.ivyservice.resolveengine.DependencyGraphBuilder] Visiting dependency com.uourname.modid:Minecraft modding 2:1.0(compile) -> io.netty:netty-all:4.0.10.Final(dependency: io.netty#netty-all;4.0.10.Final {minecraftDeps=[default]})
23:27:03.667 [DEBUG] [org.gradle.api.internal.artifacts.ivyservice.resolveengine.DependencyGraphBuilder] Selecting new module version io.netty:netty-all:4.0.10.Final
23:27:03.667 [DEBUG] [org.gradle.api.internal.artifacts.ivyservice.ivyresolve.UserResolverChain] Attempting to resolve module 'io.netty:netty-all:4.0.10.Final' using repositories [forge, MavenRepo, minecraft, forgeFlatRepo]
23:27:03.683 [DEBUG] [org.gradle.api.internal.artifacts.ivyservice.ivyresolve.CachingModuleVersionRepository] Detected non-existence of module 'io.netty#netty-all;4.0.10.Final' in resolver cache 'forge'
23:27:03.683 [DEBUG] [org.gradle.api.internal.artifacts.ivyservice.ivyresolve.parser.IvyXmlModuleDescriptorParser] post 1.3 ivy file: using exact as default matcher
23:27:03.698 [DEBUG] [org.gradle.api.internal.artifacts.ivyservice.ivyresolve.CachingModuleVersionRepository] Using cached module metadata for module 'io.netty#netty-all;4.0.10.Final' in 'MavenRepo'
23:27:03.730 [DEBUG] [org.gradle.api.internal.artifacts.ivyservice.ivyresolve.UserResolverChain] Using module 'io.netty:netty-all:4.0.10.Final' from repository 'MavenRepo'
23:27:03.730 [DEBUG] [org.gradle.api.internal.artifacts.ivyservice.resolveengine.DependencyGraphBuilder] Visiting dependency com.uourname.modid:Minecraft modding 2:1.0(compile) -> com.google.guava:guava:15.0(dependency: com.google.guava#guava;15.0 {minecraftDeps=[default]})
23:27:03.745 [DEBUG] [org.gradle.api.internal.artifacts.ivyservice.resolveengine.DependencyGraphBuilder] Selecting new module version com.google.guava:guava:15.0
23:27:03.745 [DEBUG] [org.gradle.api.internal.artifacts.ivyservice.ivyresolve.UserResolverChain] Attempting to resolve module 'com.google.guava:guava:15.0' using repositories [forge, MavenRepo, minecraft, forgeFlatRepo]
23:27:03.761 [DEBUG] [org.gradle.api.internal.artifacts.ivyservice.ivyresolve.CachingModuleVersionRepository] Detected non-existence of module 'com.google.guava#guava;15.0' in resolver cache 'forge'
23:27:03.761 [DEBUG] [org.gradle.api.internal.artifacts.ivyservice.ivyresolve.UserResolverChain] Using module 'com.google.guava:guava:15.0' from repository 'MavenRepo'
23:27:03.776 [DEBUG] [org.gradle.api.internal.artifacts.ivyservice.resolveengine.DependencyGraphBuilder] Visiting dependency com.uourname.modid:Minecraft modding 2:1.0(compile) -> org.apache.commons:commons-lang3:3.1(dependency: org.apache.commons#commons-lang3;3.1 {minecraftDeps=[default]})
23:27:03.776 [DEBUG] [org.gradle.api.internal.artifacts.ivyservice.resolveengine.DependencyGraphBuilder] Selecting new module version org.apache.commons:commons-lang3:3.1
23:27:03.792 [DEBUG] [org.gradle.api.internal.artifacts.ivyservice.ivyresolve.UserResolverChain] Attempting to resolve module 'org.apache.commons:commons-lang3:3.1' using repositories [forge, MavenRepo, minecraft, forgeFlatRepo]
23:27:03.792 [DEBUG] [org.gradle.api.internal.artifacts.ivyservice.ivyresolve.CachingModuleVersionRepository] Detected non-existence of module 'org.apache.commons#commons-lang3;3.1' in resolver cache 'forge'
23:27:03.808 [DEBUG] [org.gradle.api.internal.artifacts.ivyservice.ivyresolve.parser.IvyXmlModuleDescriptorParser] post 1.3 ivy file: using exact as default matcher
23:27:03.823 [DEBUG] [org.gradle.api.internal.artifacts.ivyservice.ivyresolve.CachingModuleVersionRepository] Using cached module metadata for module 'org.apache.commons#commons-lang3;3.1' in 'MavenRepo'
23:27:03.839 [DEBUG] [org.gradle.api.internal.artifacts.ivyservice.ivyresolve.UserResolverChain] Using module 'org.apache.commons:commons-lang3:3.1' from repository 'MavenRepo'
23:27:03.839 [DEBUG] [org.gradle.api.internal.artifacts.ivyservice.resolveengine.DependencyGraphBuilder] Visiting dependency com.uourname.modid:Minecraft modding 2:1.0(compile) -> commons-io:commons-io:2.4(dependency: commons-io#commons-io;2.4 {minecraftDeps=[default]})
23:27:03.854 [DEBUG] [org.gradle.api.internal.artifacts.ivyservice.resolveengine.DependencyGraphBuilder] Selecting new module version commons-io:commons-io:2.4
23:27:03.854 [DEBUG] [org.gradle.api.internal.artifacts.ivyservice.ivyresolve.UserResolverChain] Attempting to resolve module 'commons-io:commons-io:2.4' using repositories [forge, MavenRepo, minecraft, forgeFlatRepo]
23:27:03.870 [DEBUG] [org.gradle.api.internal.artifacts.ivyservice.ivyresolve.CachingModuleVersionRepository] Detected non-existence of module 'commons-io#commons-io;2.4' in resolver cache 'forge'
23:27:03.886 [DEBUG] [org.gradle.api.internal.artifacts.ivyservice.ivyresolve.parser.IvyXmlModuleDescriptorParser] post 1.3 ivy file: using exact as default matcher
23:27:03.886 [DEBUG] [org.gradle.api.internal.artifacts.ivyservice.ivyresolve.CachingModuleVersionRepository] Using cached module metadata for module 'commons-io#commons-io;2.4' in 'MavenRepo'
23:27:03.901 [DEBUG] [org.gradle.api.internal.artifacts.ivyservice.ivyresolve.UserResolverChain] Using module 'commons-io:commons-io:2.4' from repository 'MavenRepo'
23:27:03.917 [DEBUG] [org.gradle.api.internal.artifacts.ivyservice.resolveengine.DependencyGraphBuilder] Visiting dependency com.uourname.modid:Minecraft modding 2:1.0(compile) -> net.java.jinput:jinput:2.0.5(dependency: net.java.jinput#jinput;2.0.5 {minecraftDeps=[default]})
23:27:03.917 [DEBUG] [org.gradle.api.internal.artifacts.ivyservice.resolveengine.DependencyGraphBuilder] Selecting new module version net.java.jinput:jinput:2.0.5
23:27:03.932 [DEBUG] [org.gradle.api.internal.artifacts.ivyservice.ivyresolve.UserResolverChain] Attempting to resolve module 'net.java.jinput:jinput:2.0.5' using repositories [forge, MavenRepo, minecraft, forgeFlatRepo]
23:27:03.932 [DEBUG] [org.gradle.api.internal.artifacts.ivyservice.ivyresolve.CachingModuleVersionRepository] Detected non-existence of module 'net.java.jinput#jinput;2.0.5' in resolver cache 'forge'
23:27:03.948 [DEBUG] [org.gradle.api.internal.artifacts.ivyservice.ivyresolve.parser.IvyXmlModuleDescriptorParser] post 1.3 ivy file: using exact as default matcher
23:27:03.964 [DEBUG] [org.gradle.api.internal.artifacts.ivyservice.ivyresolve.CachingModuleVersionRepository] Using cached module metadata for module 'net.java.jinput#jinput;2.0.5' in 'MavenRepo'
23:27:03.964 [DEBUG] [org.gradle.api.internal.artifacts.ivyservice.ivyresolve.UserResolverChain] Using module 'net.java.jinput:jinput:2.0.5' from repository 'MavenRepo'
23:27:03.979 [DEBUG] [org.gradle.api.internal.artifacts.ivyservice.resolveengine.DependencyGraphBuilder] Visiting dependency com.uourname.modid:Minecraft modding 2:1.0(compile) -> net.java.jutils:jutils:1.0.0(dependency: net.java.jutils#jutils;1.0.0 {minecraftDeps=[default]})
23:27:03.979 [DEBUG] [org.gradle.api.internal.artifacts.ivyservice.resolveengine.DependencyGraphBuilder] Selecting new module version net.java.jutils:jutils:1.0.0
23:27:03.995 [DEBUG] [org.gradle.api.internal.artifacts.ivyservice.ivyresolve.UserResolverChain] Attempting to resolve module 'net.java.jutils:jutils:1.0.0' using repositories [forge, MavenRepo, minecraft, forgeFlatRepo]
23:27:03.995 [DEBUG] [org.gradle.api.internal.artifacts.ivyservice.ivyresolve.CachingModuleVersionRepository] Detected non-existence of module 'net.java.jutils#jutils;1.0.0' in resolver cache 'forge'
23:27:04.010 [DEBUG] [org.gradle.api.internal.artifacts.ivyservice.ivyresolve.parser.IvyXmlModuleDescriptorParser] post 1.3 ivy file: using exact as default matcher
23:27:04.026 [DEBUG] [org.gradle.api.internal.artifacts.ivyservice.ivyresolve.CachingModuleVersionRepository] Using cached module metadata for module 'net.java.jutils#jutils;1.0.0' in 'MavenRepo'
23:27:04.026 [DEBUG] [org.gradle.api.internal.artifacts.ivyservice.ivyresolve.UserResolverChain] Using module 'net.java.jutils:jutils:1.0.0' from repository 'MavenRepo'
23:27:04.042 [DEBUG] [org.gradle.api.internal.artifacts.ivyservice.resolveengine.DependencyGraphBuilder] Visiting dependency com.uourname.modid:Minecraft modding 2:1.0(compile) -> com.google.code.gson:gson:2.2.4(dependency: com.google.code.gson#gson;2.2.4 {minecraftDeps=[default]})
23:27:04.042 [DEBUG] [org.gradle.api.internal.artifacts.ivyservice.resolveengine.DependencyGraphBuilder] Selecting new module version com.google.code.gson:gson:2.2.4
23:27:04.057 [DEBUG] [org.gradle.api.internal.artifacts.ivyservice.ivyresolve.UserResolverChain] Attempting to resolve module 'com.google.code.gson:gson:2.2.4' using repositories [forge, MavenRepo, minecraft, forgeFlatRepo]
23:27:04.057 [DEBUG] [org.gradle.api.internal.artifacts.ivyservice.ivyresolve.CachingModuleVersionRepository] Detected non-existence of module 'com.google.code.gson#gson;2.2.4' in resolver cache 'forge'
23:27:04.073 [DEBUG] [org.gradle.api.internal.artifacts.ivyservice.ivyresolve.UserResolverChain] Using module 'com.google.code.gson:gson:2.2.4' from repository 'MavenRepo'
23:27:04.088 [DEBUG] [org.gradle.api.internal.artifacts.ivyservice.resolveengine.DependencyGraphBuilder] Visiting dependency com.uourname.modid:Minecraft modding 2:1.0(compile) -> com.mojang:authlib:1.3(dependency: com.mojang#authlib;1.3 {minecraftDeps=[default]})
23:27:04.088 [DEBUG] [org.gradle.api.internal.artifacts.ivyservice.resolveengine.DependencyGraphBuilder] Selecting new module version com.mojang:authlib:1.3
23:27:04.104 [DEBUG] [org.gradle.api.internal.artifacts.ivyservice.ivyresolve.UserResolverChain] Attempting to resolve module 'com.mojang:authlib:1.3' using repositories [forge, MavenRepo, minecraft, forgeFlatRepo]
23:27:04.104 [DEBUG] [org.gradle.api.internal.artifacts.ivyservice.ivyresolve.CachingModuleVersionRepository] Detected non-existence of module 'com.mojang#authlib;1.3' in resolver cache 'forge'
23:27:04.120 [DEBUG] [org.gradle.api.internal.artifacts.ivyservice.ivyresolve.CachingModuleVersionRepository] Detected non-existence of module 'com.mojang#authlib;1.3' in resolver cache 'MavenRepo'
23:27:04.120 [DEBUG] [org.gradle.api.internal.artifacts.ivyservice.ivyresolve.parser.IvyXmlModuleDescriptorParser] post 1.3 ivy file: using exact as default matcher
23:27:04.135 [DEBUG] [org.gradle.api.internal.artifacts.ivyservice.ivyresolve.CachingModuleVersionRepository] Using cached module metadata for module 'com.mojang#authlib;1.3' in 'minecraft'
23:27:04.151 [DEBUG] [org.gradle.api.internal.artifacts.ivyservice.ivyresolve.UserResolverChain] Using module 'com.mojang:authlib:1.3' from repository 'minecraft'
23:27:04.151 [DEBUG] [org.gradle.api.internal.artifacts.ivyservice.resolveengine.DependencyGraphBuilder] Visiting dependency com.uourname.modid:Minecraft modding 2:1.0(compile) -> org.apache.logging.log4j:log4j-api:2.0-beta9(dependency: org.apache.logging.log4j#log4j-api;2.0-beta9 {minecraftDeps=[default]})
23:27:04.166 [DEBUG] [org.gradle.api.internal.artifacts.ivyservice.resolveengine.DependencyGraphBuilder] Selecting new module version org.apache.logging.log4j:log4j-api:2.0-beta9
23:27:04.166 [DEBUG] [org.gradle.api.internal.artifacts.ivyservice.ivyresolve.UserResolverChain] Attempting to resolve module 'org.apache.logging.log4j:log4j-api:2.0-beta9' using repositories [forge, MavenRepo, minecraft, forgeFlatRepo]
23:27:04.182 [DEBUG] [org.gradle.api.internal.artifacts.ivyservice.ivyresolve.CachingModuleVersionRepository] Detected non-existence of module 'org.apache.logging.log4j#log4j-api;2.0-beta9' in resolver cache 'forge'
23:27:04.198 [DEBUG] [org.gradle.api.internal.artifacts.ivyservice.ivyresolve.parser.IvyXmlModuleDescriptorParser] post 1.3 ivy file: using exact as default matcher
23:27:04.198 [DEBUG] [org.gradle.api.internal.artifacts.ivyservice.ivyresolve.CachingModuleVersionRepository] Using cached module metadata for module 'org.apache.logging.log4j#log4j-api;2.0-beta9' in 'MavenRepo'
23:27:04.213 [DEBUG] [org.gradle.api.internal.artifacts.ivyservice.ivyresolve.UserResolverChain] Using module 'org.apache.logging.log4j:log4j-api:2.0-beta9' from repository 'MavenRepo'
23:27:04.229 [DEBUG] [org.gradle.api.internal.artifacts.ivyservice.resolveengine.DependencyGraphBuilder] Visiting dependency com.uourname.modid:Minecraft modding 2:1.0(compile) -> org.apache.logging.log4j:log4j-core:2.0-beta9(dependency: org.apache.logging.log4j#log4j-core;2.0-beta9 {minecraftDeps=[default]})
23:27:04.229 [DEBUG] [org.gradle.api.internal.artifacts.ivyservice.resolveengine.DependencyGraphBuilder] Selecting new module version org.apache.logging.log4j:log4j-core:2.0-beta9
23:27:04.244 [DEBUG] [org.gradle.api.internal.artifacts.ivyservice.ivyresolve.UserResolverChain] Attempting to resolve module 'org.apache.logging.log4j:log4j-core:2.0-beta9' using repositories [forge, MavenRepo, minecraft, forgeFlatRepo]
23:27:04.244 [DEBUG] [org.gradle.api.internal.artifacts.ivyservice.ivyresolve.CachingModuleVersionRepository] Detected non-existence of module 'org.apache.logging.log4j#log4j-core;2.0-beta9' in resolver cache 'forge'
23:27:04.260 [DEBUG] [org.gradle.api.internal.artifacts.ivyservice.ivyresolve.parser.IvyXmlModuleDescriptorParser] post 1.3 ivy file: using exact as default matcher
23:27:04.276 [DEBUG] [org.gradle.api.internal.artifacts.ivyservice.ivyresolve.CachingModuleVersionRepository] Using cached module metadata for module 'org.apache.logging.log4j#log4j-core;2.0-beta9' in 'MavenRepo'
23:27:04.276 [DEBUG] [org.gradle.api.internal.artifacts.ivyservice.ivyresolve.UserResolverChain] Using module 'org.apache.logging.log4j:log4j-core:2.0-beta9' from repository 'MavenRepo'
23:27:04.291 [DEBUG] [org.gradle.api.internal.artifacts.ivyservice.resolveengine.DependencyGraphBuilder] Visiting dependency com.uourname.modid:Minecraft modding 2:1.0(compile) -> org.lwjgl.lwjgl:lwjgl:2.9.0(dependency: org.lwjgl.lwjgl#lwjgl;2.9.0 {minecraftDeps=[default]})
23:27:04.291 [DEBUG] [org.gradle.api.internal.artifacts.ivyservice.resolveengine.DependencyGraphBuilder] Selecting new module version org.lwjgl.lwjgl:lwjgl:2.9.0
23:27:04.307 [DEBUG] [org.gradle.api.internal.artifacts.ivyservice.ivyresolve.UserResolverChain] Attempting to resolve module 'org.lwjgl.lwjgl:lwjgl:2.9.0' using repositories [forge, MavenRepo, minecraft, forgeFlatRepo]
23:27:04.307 [DEBUG] [org.gradle.api.internal.artifacts.ivyservice.ivyresolve.CachingModuleVersionRepository] Detected non-existence of module 'org.lwjgl.lwjgl#lwjgl;2.9.0' in resolver cache 'forge'
23:27:04.322 [DEBUG] [org.gradle.api.internal.artifacts.ivyservice.ivyresolve.parser.IvyXmlModuleDescriptorParser] post 1.3 ivy file: using exact as default matcher
23:27:04.338 [DEBUG] [org.gradle.api.internal.artifacts.ivyservice.ivyresolve.CachingModuleVersionRepository] Using cached module metadata for module 'org.lwjgl.lwjgl#lwjgl;2.9.0' in 'MavenRepo'
23:27:04.354 [DEBUG] [org.gradle.api.internal.artifacts.ivyservice.ivyresolve.UserResolverChain] Using module 'org.lwjgl.lwjgl:lwjgl:2.9.0' from repository 'MavenRepo'
23:27:04.354 [DEBUG] [org.gradle.api.internal.artifacts.ivyservice.resolveengine.DependencyGraphBuilder] Visiting dependency com.uourname.modid:Minecraft modding 2:1.0(compile) -> org.lwjgl.lwjgl:lwjgl_util:2.9.0(dependency: org.lwjgl.lwjgl#lwjgl_util;2.9.0 {minecraftDeps=[default]})
23:27:04.369 [DEBUG] [org.gradle.api.internal.artifacts.ivyservice.resolveengine.DependencyGraphBuilder] Selecting new module version org.lwjgl.lwjgl:lwjgl_util:2.9.0
23:27:04.369 [DEBUG] [org.gradle.api.internal.artifacts.ivyservice.ivyresolve.UserResolverChain] Attempting to resolve module 'org.lwjgl.lwjgl:lwjgl_util:2.9.0' using repositories [forge, MavenRepo, minecraft, forgeFlatRepo]
23:27:04.385 [DEBUG] [org.gradle.api.internal.artifacts.ivyservice.ivyresolve.CachingModuleVersionRepository] Detected non-existence of module 'org.lwjgl.lwjgl#lwjgl_util;2.9.0' in resolver cache 'forge'
23:27:04.385 [DEBUG] [org.gradle.api.internal.artifacts.ivyservice.ivyresolve.parser.IvyXmlModuleDescriptorParser] post 1.3 ivy file: using exact as default matcher
23:27:04.400 [DEBUG] [org.gradle.api.internal.artifacts.ivyservice.ivyresolve.CachingModuleVersionRepository] Using cached module metadata for module 'org.lwjgl.lwjgl#lwjgl_util;2.9.0' in 'MavenRepo'
23:27:04.463 [DEBUG] [org.gradle.api.internal.artifacts.ivyservice.ivyresolve.UserResolverChain] Using module 'org.lwjgl.lwjgl:lwjgl_util:2.9.0' from repository 'MavenRepo'
23:27:04.478 [DEBUG] [org.gradle.api.internal.artifacts.ivyservice.resolveengine.DependencyGraphBuilder] Visiting configuration :forgeSrc:1.7.2-10.12.1.1060(default).
23:27:04.494 [DEBUG] [org.gradle.api.internal.artifacts.ivyservice.resolveengine.DependencyGraphBuilder] Visiting configuration net.minecraft:launchwrapper:1.9(default).
23:27:04.494 [DEBUG] [org.gradle.api.internal.artifacts.ivyservice.resolveengine.DependencyGraphBuilder] Visiting dependency net.minecraft:launchwrapper:1.9(default) -> org.lwjgl.lwjgl:lwjgl:2.9.0(dependency: org.lwjgl.lwjgl#lwjgl;2.9.0 {compile=[compile(*), master(*)], runtime=[runtime(*)]})
23:27:04.510 [DEBUG] [org.gradle.api.internal.artifacts.ivyservice.resolveengine.DependencyGraphBuilder] Visiting dependency net.minecraft:launchwrapper:1.9(default) -> org.apache.logging.log4j:log4j-core:2.0-beta9(dependency: org.apache.logging.log4j#log4j-core;2.0-beta9 {compile=[compile(*), master(*)], runtime=[runtime(*)]})
23:27:04.525 [DEBUG] [org.gradle.api.internal.artifacts.ivyservice.resolveengine.DependencyGraphBuilder] Visiting dependency net.minecraft:launchwrapper:1.9(default) -> org.apache.logging.log4j:log4j-api:2.0-beta9(dependency: org.apache.logging.log4j#log4j-api;2.0-beta9 {compile=[compile(*), master(*)], runtime=[runtime(*)]})
23:27:04.541 [DEBUG] [org.gradle.api.internal.artifacts.ivyservice.resolveengine.DependencyGraphBuilder] Visiting dependency net.minecraft:launchwrapper:1.9(default) -> net.sf.jopt-simple:jopt-simple:4.5(dependency: net.sf.jopt-simple#jopt-simple;4.5 {compile=[compile(*), master(*)], runtime=[runtime(*)]})
23:27:04.556 [DEBUG] [org.gradle.api.internal.artifacts.ivyservice.resolveengine.DependencyGraphBuilder] Visiting dependency net.minecraft:launchwrapper:1.9(default) -> org.ow2.asm:asm-debug-all:4.1(dependency: org.ow2.asm#asm-debug-all;4.1 {compile=[compile(*), master(*)], runtime=[runtime(*)]})
23:27:04.556 [DEBUG] [org.gradle.api.internal.artifacts.ivyservice.resolveengine.DependencyGraphBuilder] Visiting configuration org.ow2.asm:asm-debug-all:4.1(default).
23:27:04.572 [DEBUG] [org.gradle.api.internal.artifacts.ivyservice.resolveengine.DependencyGraphBuilder] Visiting configuration org.scala-lang:scala-library:2.10.2(default).
23:27:04.572 [DEBUG] [org.gradle.api.internal.artifacts.ivyservice.resolveengine.DependencyGraphBuilder] Visiting configuration org.scala-lang:scala-compiler:2.10.2(default).
23:27:04.588 [DEBUG] [org.gradle.api.internal.artifacts.ivyservice.resolveengine.DependencyGraphBuilder] Visiting dependency org.scala-lang:scala-compiler:2.10.2(default) -> org.scala-lang:scala-library:2.10.2(dependency: org.scala-lang#scala-library;2.10.2 {compile=[compile(*), master(*)], runtime=[runtime(*)]})
23:27:04.588 [DEBUG] [org.gradle.api.internal.artifacts.ivyservice.resolveengine.DependencyGraphBuilder] Visiting dependency org.scala-lang:scala-compiler:2.10.2(default) -> org.scala-lang:scala-reflect:2.10.2(dependency: org.scala-lang#scala-reflect;2.10.2 {compile=[compile(*), master(*)], runtime=[runtime(*)]})
23:27:04.603 [DEBUG] [org.gradle.api.internal.artifacts.ivyservice.resolveengine.DependencyGraphBuilder] Selecting new module version org.scala-lang:scala-reflect:2.10.2
23:27:04.619 [DEBUG] [org.gradle.api.internal.artifacts.ivyservice.ivyresolve.UserResolverChain] Attempting to resolve module 'org.scala-lang:scala-reflect:2.10.2' using repositories [forge, MavenRepo, minecraft, forgeFlatRepo]
23:27:04.619 [DEBUG] [org.gradle.api.internal.artifacts.ivyservice.ivyresolve.CachingModuleVersionRepository] Detected non-existence of module 'org.scala-lang#scala-reflect;2.10.2' in resolver cache 'forge'
23:27:04.634 [DEBUG] [org.gradle.api.internal.artifacts.ivyservice.ivyresolve.parser.IvyXmlModuleDescriptorParser] post 1.3 ivy file: using exact as default matcher
23:27:04.650 [DEBUG] [org.gradle.api.internal.artifacts.ivyservice.ivyresolve.CachingModuleVersionRepository] Using cached module metadata for module 'org.scala-lang#scala-reflect;2.10.2' in 'MavenRepo'
23:27:04.650 [DEBUG] [org.gradle.api.internal.artifacts.ivyservice.ivyresolve.UserResolverChain] Using module 'org.scala-lang:scala-reflect:2.10.2' from repository 'MavenRepo'
23:27:04.666 [DEBUG] [org.gradle.api.internal.artifacts.ivyservice.resolveengine.DependencyGraphBuilder] Visiting configuration net.sf.jopt-simple:jopt-simple:4.5(default).
23:27:04.666 [DEBUG] [org.gradle.api.internal.artifacts.ivyservice.resolveengine.DependencyGraphBuilder] Visiting configuration java3d:vecmath:1.3.1(default).
23:27:04.681 [DEBUG] [org.gradle.api.internal.artifacts.ivyservice.resolveengine.DependencyGraphBuilder] Visiting configuration net.sf.trove4j:trove4j:3.0.3(default).
23:27:04.681 [DEBUG] [org.gradle.api.internal.artifacts.ivyservice.resolveengine.DependencyGraphBuilder] Visiting configuration com.ibm.icu:icu4j-core-mojang:51.2(default).
23:27:04.697 [DEBUG] [org.gradle.api.internal.artifacts.ivyservice.resolveengine.DependencyGraphBuilder] Visiting configuration lzma:lzma:0.0.1(default).
23:27:04.697 [DEBUG] [org.gradle.api.internal.artifacts.ivyservice.resolveengine.DependencyGraphBuilder] Visiting configuration com.paulscode:codecjorbis:20101023(default).
23:27:04.712 [DEBUG] [org.gradle.api.internal.artifacts.ivyservice.resolveengine.DependencyGraphBuilder] Visiting dependency com.paulscode:codecjorbis:20101023(default) -> com.paulscode:soundsystem:20120107(dependency: com.paulscode#soundsystem;20120107 {compile=[compile(*), master(*)], runtime=[runtime(*)]})
23:27:04.712 [DEBUG] [org.gradle.api.internal.artifacts.ivyservice.resolveengine.DependencyGraphBuilder] Visiting configuration com.paulscode:codecwav:20101023(default).
23:27:04.728 [DEBUG] [org.gradle.api.internal.artifacts.ivyservice.resolveengine.DependencyGraphBuilder] Visiting dependency com.paulscode:codecwav:20101023(default) -> com.paulscode:soundsystem:20120107(dependency: com.paulscode#soundsystem;20120107 {compile=[compile(*), master(*)], runtime=[runtime(*)]})
23:27:04.728 [DEBUG] [org.gradle.api.internal.artifacts.ivyservice.resolveengine.DependencyGraphBuilder] Visiting configuration com.paulscode:libraryjavasound:20101123(default).
23:27:04.744 [DEBUG] [org.gradle.api.internal.artifacts.ivyservice.resolveengine.DependencyGraphBuilder] Visiting dependency com.paulscode:libraryjavasound:20101123(default) -> com.paulscode:soundsystem:20120107(dependency: com.paulscode#soundsystem;20120107 {compile=[compile(*), master(*)], runtime=[runtime(*)]})
23:27:04.744 [DEBUG] [org.gradle.api.internal.artifacts.ivyservice.resolveengine.DependencyGraphBuilder] Visiting configuration com.paulscode:librarylwjglopenal:20100824(default).
23:27:04.759 [DEBUG] [org.gradle.api.internal.artifacts.ivyservice.resolveengine.DependencyGraphBuilder] Visiting dependency com.paulscode:librarylwjglopenal:20100824(default) -> com.paulscode:soundsystem:20120107(dependency: com.paulscode#soundsystem;20120107 {compile=[compile(*), master(*)], runtime=[runtime(*)]})
23:27:04.759 [DEBUG] [org.gradle.api.internal.artifacts.ivyservice.resolveengine.DependencyGraphBuilder] Visiting dependency com.paulscode:librarylwjglopenal:20100824(default) -> org.lwjgl.lwjgl:lwjgl:2.8.3(dependency: org.lwjgl.lwjgl#lwjgl;2.8.3 {compile=[compile(*), master(*)], runtime=[runtime(*)]})
23:27:04.775 [DEBUG] [org.gradle.api.internal.artifacts.ivyservice.resolveengine.DependencyGraphBuilder] Found new conflicting module version org.lwjgl.lwjgl:lwjgl:2.8.3
23:27:04.790 [DEBUG] [org.gradle.api.internal.artifacts.ivyservice.resolveengine.DependencyGraphBuilder] Visiting configuration com.paulscode:soundsystem:20120107(default).
23:27:04.790 [DEBUG] [org.gradle.api.internal.artifacts.ivyservice.resolveengine.DependencyGraphBuilder] Visiting configuration io.netty:netty-all:4.0.10.Final(default).
23:27:04.806 [DEBUG] [org.gradle.api.internal.artifacts.ivyservice.resolveengine.DependencyGraphBuilder] Visiting configuration com.google.guava:guava:15.0(default).
23:27:04.822 [DEBUG] [org.gradle.api.internal.artifacts.ivyservice.resolveengine.DependencyGraphBuilder] Visiting configuration org.apache.commons:commons-lang3:3.1(default).
23:27:04.837 [DEBUG] [org.gradle.api.internal.artifacts.ivyservice.resolveengine.DependencyGraphBuilder] Visiting configuration commons-io:commons-io:2.4(default).
23:27:04.837 [DEBUG] [org.gradle.api.internal.artifacts.ivyservice.resolveengine.DependencyGraphBuilder] Visiting configuration net.java.jinput:jinput:2.0.5(default).
23:27:04.853 [DEBUG] [org.gradle.api.internal.artifacts.ivyservice.resolveengine.DependencyGraphBuilder] Visiting dependency net.java.jinput:jinput:2.0.5(default) -> net.java.jutils:jutils:1.0.0(dependency: net.java.jutils#jutils;1.0.0 {compile=[compile(*), master(*)], runtime=[runtime(*)]})
23:27:04.868 [DEBUG] [org.gradle.api.internal.artifacts.ivyservice.resolveengine.DependencyGraphBuilder] Visiting dependency net.java.jinput:jinput:2.0.5(default) -> net.java.jinput:jinput-platform:2.0.5(dependency: net.java.jinput#jinput-platform;2.0.5 {runtime=[compile(*), runtime(*), master(*)]})
23:27:04.868 [DEBUG] [org.gradle.api.internal.artifacts.ivyservice.resolveengine.DependencyGraphBuilder] Selecting new module version net.java.jinput:jinput-platform:2.0.5
23:27:04.884 [DEBUG] [org.gradle.api.internal.artifacts.ivyservice.ivyresolve.UserResolverChain] Attempting to resolve module 'net.java.jinput:jinput-platform:2.0.5' using repositories [forge, MavenRepo, minecraft, forgeFlatRepo]
23:27:04.900 [DEBUG] [org.gradle.api.internal.artifacts.ivyservice.ivyresolve.UserResolverChain] Using module 'net.java.jinput:jinput-platform:2.0.5' from repository 'MavenRepo'
23:27:04.900 [DEBUG] [org.gradle.api.internal.artifacts.ivyservice.resolveengine.DependencyGraphBuilder] Visiting dependency net.java.jinput:jinput:2.0.5(default) -> net.java.jinput:jinput-platform:2.0.5(dependency: net.java.jinput#jinput-platform;2.0.5 {runtime=[compile(*), runtime(*), master(*)]})
23:27:04.915 [DEBUG] [org.gradle.api.internal.artifacts.ivyservice.resolveengine.DependencyGraphBuilder] Visiting dependency net.java.jinput:jinput:2.0.5(default) -> net.java.jinput:jinput-platform:2.0.5(dependency: net.java.jinput#jinput-platform;2.0.5 {runtime=[compile(*), runtime(*), master(*)]})
23:27:04.931 [DEBUG] [org.gradle.api.internal.artifacts.ivyservice.resolveengine.DependencyGraphBuilder] Visiting configuration net.java.jutils:jutils:1.0.0(default).
23:27:04.946 [DEBUG] [org.gradle.api.internal.artifacts.ivyservice.resolveengine.DependencyGraphBuilder] Visiting configuration com.google.code.gson:gson:2.2.4(default).
23:27:04.962 [DEBUG] [org.gradle.api.internal.artifacts.ivyservice.resolveengine.DependencyGraphBuilder] Visiting configuration com.mojang:authlib:1.3(default).
23:27:04.978 [DEBUG] [org.gradle.api.internal.artifacts.ivyservice.resolveengine.DependencyGraphBuilder] Visiting dependency com.mojang:authlib:1.3(default) -> org.apache.logging.log4j:log4j-core:2.0-beta9(dependency: org.apache.logging.log4j#log4j-core;2.0-beta9 {compile=[compile(*), master(*)], runtime=[runtime(*)]})
23:27:04.993 [DEBUG] [org.gradle.api.internal.artifacts.ivyservice.resolveengine.DependencyGraphBuilder] Visiting dependency com.mojang:authlib:1.3(default) -> com.google.guava:guava:15.0(dependency: com.google.guava#guava;15.0 {compile=[compile(*), master(*)], runtime=[runtime(*)]})
23:27:04.993 [DEBUG] [org.gradle.api.internal.artifacts.ivyservice.resolveengine.DependencyGraphBuilder] Visiting dependency com.mojang:authlib:1.3(default) -> org.apache.logging.log4j:log4j-api:2.0-beta9(dependency: org.apache.logging.log4j#log4j-api;2.0-beta9 {compile=[compile(*), master(*)], runtime=[runtime(*)]})
23:27:05.009 [DEBUG] [org.gradle.api.internal.artifacts.ivyservice.resolveengine.DependencyGraphBuilder] Visiting dependency com.mojang:authlib:1.3(default) -> commons-io:commons-io:2.4(dependency: commons-io#commons-io;2.4 {compile=[compile(*), master(*)], runtime=[runtime(*)]})
23:27:05.024 [DEBUG] [org.gradle.api.internal.artifacts.ivyservice.resolveengine.DependencyGraphBuilder] Visiting dependency com.mojang:authlib:1.3(default) -> com.google.code.gson:gson:2.2.2(dependency: com.google.code.gson#gson;2.2.2 {compile=[compile(*), master(*)], runtime=[runtime(*)]})
23:27:05.040 [DEBUG] [org.gradle.api.internal.artifacts.ivyservice.resolveengine.DependencyGraphBuilder] Found new conflicting module version com.google.code.gson:gson:2.2.2
23:27:05.056 [DEBUG] [org.gradle.api.internal.artifacts.ivyservice.resolveengine.DependencyGraphBuilder] Visiting dependency com.mojang:authlib:1.3(default) -> org.apache.commons:commons-lang3:3.1(dependency: org.apache.commons#commons-lang3;3.1 {compile=[compile(*), master(*)], runtime=[runtime(*)]})
23:27:05.071 [DEBUG] [org.gradle.api.internal.artifacts.ivyservice.resolveengine.DependencyGraphBuilder] Visiting configuration org.apache.logging.log4j:log4j-api:2.0-beta9(default).
23:27:05.071 [DEBUG] [org.gradle.api.internal.artifacts.ivyservice.resolveengine.DependencyGraphBuilder] Visiting configuration org.apache.logging.log4j:log4j-core:2.0-beta9(default).
23:27:05.087 [DEBUG] [org.gradle.api.internal.artifacts.ivyservice.resolveengine.DependencyGraphBuilder] Visiting dependency org.apache.logging.log4j:log4j-core:2.0-beta9(default) -> org.apache.logging.log4j:log4j-api:2.0-beta9(dependency: org.apache.logging.log4j#log4j-api;2.0-beta9 {compile=[compile(*), master(*)], runtime=[runtime(*)]})
23:27:05.087 [DEBUG] [org.gradle.api.internal.artifacts.ivyservice.resolveengine.DependencyGraphBuilder] Visiting configuration org.lwjgl.lwjgl:lwjgl:2.9.0(default).
23:27:05.102 [DEBUG] [org.gradle.api.internal.artifacts.ivyservice.resolveengine.DependencyGraphBuilder] version for org.lwjgl.lwjgl:lwjgl:2.9.0(default) is not selected. ignoring.
23:27:05.118 [DEBUG] [org.gradle.api.internal.artifacts.ivyservice.resolveengine.DependencyGraphBuilder] Visiting configuration org.lwjgl.lwjgl:lwjgl_util:2.9.0(default).
23:27:05.118 [DEBUG] [org.gradle.api.internal.artifacts.ivyservice.resolveengine.DependencyGraphBuilder] Visiting dependency org.lwjgl.lwjgl:lwjgl_util:2.9.0(default) -> org.lwjgl.lwjgl:lwjgl:2.9.0(dependency: org.lwjgl.lwjgl#lwjgl;2.9.0 {compile=[compile(*), master(*)], runtime=[runtime(*)]})
23:27:05.134 [DEBUG] [org.gradle.api.internal.artifacts.ivyservice.resolveengine.DependencyGraphBuilder] Visiting configuration org.lwjgl.lwjgl:lwjgl:2.9.0(compile).
23:27:05.149 [DEBUG] [org.gradle.api.internal.artifacts.ivyservice.resolveengine.DependencyGraphBuilder] version for org.lwjgl.lwjgl:lwjgl:2.9.0(compile) is not selected. ignoring.
23:27:05.149 [DEBUG] [org.gradle.api.internal.artifacts.ivyservice.resolveengine.DependencyGraphBuilder] Visiting configuration org.lwjgl.lwjgl:lwjgl:2.9.0(master).
23:27:05.165 [DEBUG] [org.gradle.api.internal.artifacts.ivyservice.resolveengine.DependencyGraphBuilder] version for org.lwjgl.lwjgl:lwjgl:2.9.0(master) is not selected. ignoring.
23:27:05.180 [DEBUG] [org.gradle.api.internal.artifacts.ivyservice.resolveengine.DependencyGraphBuilder] Visiting configuration org.lwjgl.lwjgl:lwjgl:2.9.0(runtime).
23:27:05.196 [DEBUG] [org.gradle.api.internal.artifacts.ivyservice.resolveengine.DependencyGraphBuilder] version for org.lwjgl.lwjgl:lwjgl:2.9.0(runtime) is not selected. ignoring.
23:27:05.212 [DEBUG] [org.gradle.api.internal.artifacts.ivyservice.resolveengine.DependencyGraphBuilder] Visiting configuration org.apache.logging.log4j:log4j-core:2.0-beta9(compile).
23:27:05.227 [DEBUG] [org.gradle.api.internal.artifacts.ivyservice.resolveengine.DependencyGraphBuilder] Visiting dependency org.apache.logging.log4j:log4j-core:2.0-beta9(compile) -> org.apache.logging.log4j:log4j-api:2.0-beta9(dependency: org.apache.logging.log4j#log4j-api;2.0-beta9 {compile=[compile(*), master(*)], runtime=[runtime(*)]})
23:27:05.227 [DEBUG] [org.gradle.api.internal.artifacts.ivyservice.resolveengine.DependencyGraphBuilder] Visiting configuration org.apache.logging.log4j:log4j-core:2.0-beta9(master).
23:27:05.243 [DEBUG] [org.gradle.api.internal.artifacts.ivyservice.resolveengine.DependencyGraphBuilder] Visiting configuration org.apache.logging.log4j:log4j-core:2.0-beta9(runtime).
23:27:05.258 [DEBUG] [org.gradle.api.internal.artifacts.ivyservice.resolveengine.DependencyGraphBuilder] Visiting dependency org.apache.logging.log4j:log4j-core:2.0-beta9(runtime) -> org.apache.logging.log4j:log4j-api:2.0-beta9(dependency: org.apache.logging.log4j#log4j-api;2.0-beta9 {compile=[compile(*), master(*)], runtime=[runtime(*)]})
23:27:05.258 [DEBUG] [org.gradle.api.internal.artifacts.ivyservice.resolveengine.DependencyGraphBuilder] Visiting configuration org.apache.logging.log4j:log4j-api:2.0-beta9(compile).
23:27:05.274 [DEBUG] [org.gradle.api.internal.artifacts.ivyservice.resolveengine.DependencyGraphBuilder] Visiting configuration org.apache.logging.log4j:log4j-api:2.0-beta9(master).
23:27:05.290 [DEBUG] [org.gradle.api.internal.artifacts.ivyservice.resolveengine.DependencyGraphBuilder] Visiting configuration org.apache.logging.log4j:log4j-api:2.0-beta9(runtime).
23:27:05.305 [DEBUG] [org.gradle.api.internal.artifacts.ivyservice.resolveengine.DependencyGraphBuilder] Visiting configuration net.sf.jopt-simple:jopt-simple:4.5(compile).
23:27:05.321 [DEBUG] [org.gradle.api.internal.artifacts.ivyservice.resolveengine.DependencyGraphBuilder] Visiting configuration net.sf.jopt-simple:jopt-simple:4.5(master).
23:27:05.321 [DEBUG] [org.gradle.api.internal.artifacts.ivyservice.resolveengine.DependencyGraphBuilder] Visiting configuration net.sf.jopt-simple:jopt-simple:4.5(runtime).
23:27:05.336 [DEBUG] [org.gradle.api.internal.artifacts.ivyservice.resolveengine.DependencyGraphBuilder] Visiting configuration org.ow2.asm:asm-debug-all:4.1(compile).
23:27:05.336 [DEBUG] [org.gradle.api.internal.artifacts.ivyservice.resolveengine.DependencyGraphBuilder] Visiting configuration org.ow2.asm:asm-debug-all:4.1(master).
23:27:05.352 [DEBUG] [org.gradle.api.internal.artifacts.ivyservice.resolveengine.DependencyGraphBuilder] Visiting configuration org.ow2.asm:asm-debug-all:4.1(runtime).
23:27:05.368 [DEBUG] [org.gradle.api.internal.artifacts.ivyservice.resolveengine.DependencyGraphBuilder] Visiting configuration org.scala-lang:scala-library:2.10.2(compile).
23:27:05.368 [DEBUG] [org.gradle.api.internal.artifacts.ivyservice.resolveengine.DependencyGraphBuilder] Visiting configuration org.scala-lang:scala-library:2.10.2(master).
23:27:05.383 [DEBUG] [org.gradle.api.internal.artifacts.ivyservice.resolveengine.DependencyGraphBuilder] Visiting configuration org.scala-lang:scala-library:2.10.2(runtime).
23:27:05.399 [DEBUG] [org.gradle.api.internal.artifacts.ivyservice.resolveengine.DependencyGraphBuilder] Visiting configuration org.scala-lang:scala-reflect:2.10.2(compile).
23:27:05.399 [DEBUG] [org.gradle.api.internal.artifacts.ivyservice.resolveengine.DependencyGraphBuilder] Visiting dependency org.scala-lang:scala-reflect:2.10.2(compile) -> org.scala-lang:scala-library:2.10.2(dependency: org.scala-lang#scala-library;2.10.2 {compile=[compile(*), master(*)], runtime=[runtime(*)]})
23:27:05.414 [DEBUG] [org.gradle.api.internal.artifacts.ivyservice.resolveengine.DependencyGraphBuilder] Visiting configuration org.scala-lang:scala-reflect:2.10.2(master).
23:27:05.414 [DEBUG] [org.gradle.api.internal.artifacts.ivyservice.resolveengine.DependencyGraphBuilder] Visiting configuration org.scala-lang:scala-reflect:2.10.2(runtime).
23:27:05.430 [DEBUG] [org.gradle.api.internal.artifacts.ivyservice.resolveengine.DependencyGraphBuilder] Visiting dependency org.scala-lang:scala-reflect:2.10.2(runtime) -> org.scala-lang:scala-library:2.10.2(dependency: org.scala-lang#scala-library;2.10.2 {compile=[compile(*), master(*)], runtime=[runtime(*)]})
23:27:05.430 [DEBUG] [org.gradle.api.internal.artifacts.ivyservice.resolveengine.DependencyGraphBuilder] Visiting configuration com.paulscode:soundsystem:20120107(compile).
23:27:05.446 [DEBUG] [org.gradle.api.internal.artifacts.ivyservice.resolveengine.DependencyGraphBuilder] Visiting configuration com.paulscode:soundsystem:20120107(master).
23:27:05.446 [DEBUG] [org.gradle.api.internal.artifacts.ivyservice.resolveengine.DependencyGraphBuilder] Visiting configuration com.paulscode:soundsystem:20120107(runtime).
23:27:05.461 [DEBUG] [org.gradle.api.internal.artifacts.ivyservice.resolveengine.DependencyGraphBuilder] Visiting configuration net.java.jutils:jutils:1.0.0(compile).
23:27:05.461 [DEBUG] [org.gradle.api.internal.artifacts.ivyservice.resolveengine.DependencyGraphBuilder] Visiting configuration net.java.jutils:jutils:1.0.0(master).
23:27:05.477 [DEBUG] [org.gradle.api.internal.artifacts.ivyservice.resolveengine.DependencyGraphBuilder] Visiting configuration net.java.jutils:jutils:1.0.0(runtime).
23:27:05.477 [DEBUG] [org.gradle.api.internal.artifacts.ivyservice.resolveengine.DependencyGraphBuilder] Visiting configuration net.java.jinput:jinput-platform:2.0.5(compile).
23:27:05.492 [DEBUG] [org.gradle.api.internal.artifacts.ivyservice.resolveengine.DependencyGraphBuilder] Visiting configuration net.java.jinput:jinput-platform:2.0.5(runtime).
23:27:05.492 [DEBUG] [org.gradle.api.internal.artifacts.ivyservice.resolveengine.DependencyGraphBuilder] Visiting configuration net.java.jinput:jinput-platform:2.0.5(master).
23:27:05.508 [DEBUG] [org.gradle.api.internal.artifacts.ivyservice.resolveengine.DependencyGraphBuilder] Visiting configuration com.google.guava:guava:15.0(compile).
23:27:05.508 [DEBUG] [org.gradle.api.internal.artifacts.ivyservice.resolveengine.DependencyGraphBuilder] Visiting configuration com.google.guava:guava:15.0(master).
23:27:05.524 [DEBUG] [org.gradle.api.internal.artifacts.ivyservice.resolveengine.DependencyGraphBuilder] Visiting configuration com.google.guava:guava:15.0(runtime).
23:27:05.524 [DEBUG] [org.gradle.api.internal.artifacts.ivyservice.resolveengine.DependencyGraphBuilder] Visiting configuration commons-io:commons-io:2.4(compile).
23:27:05.539 [DEBUG] [org.gradle.api.internal.artifacts.ivyservice.resolveengine.DependencyGraphBuilder] Visiting configuration commons-io:commons-io:2.4(master).
23:27:05.539 [DEBUG] [org.gradle.api.internal.artifacts.ivyservice.resolveengine.DependencyGraphBuilder] Visiting configuration commons-io:commons-io:2.4(runtime).
23:27:05.555 [DEBUG] [org.gradle.api.internal.artifacts.ivyservice.resolveengine.DependencyGraphBuilder] Visiting configuration org.apache.commons:commons-lang3:3.1(compile).
23:27:05.555 [DEBUG] [org.gradle.api.internal.artifacts.ivyservice.resolveengine.DependencyGraphBuilder] Visiting configuration org.apache.commons:commons-lang3:3.1(master).
23:27:05.570 [DEBUG] [org.gradle.api.internal.artifacts.ivyservice.resolveengine.DependencyGraphBuilder] Visiting configuration org.apache.commons:commons-lang3:3.1(runtime).
23:27:05.570 [DEBUG] [org.gradle.api.internal.artifacts.ivyservice.resolveengine.DependencyGraphBuilder] Visiting configuration org.scala-lang:scala-library:2.10.2(compile).
23:27:05.586 [DEBUG] [org.gradle.api.internal.artifacts.ivyservice.resolveengine.DependencyGraphBuilder] Changed edges for org.scala-lang:scala-library:2.10.2(compile) selects same versions as previous traversal. ignoring
23:27:05.586 [DEBUG] [org.gradle.api.internal.artifacts.ivyservice.resolveengine.DependencyGraphBuilder] Visiting configuration org.scala-lang:scala-library:2.10.2(master).
23:27:05.602 [DEBUG] [org.gradle.api.internal.artifacts.ivyservice.resolveengine.DependencyGraphBuilder] Changed edges for org.scala-lang:scala-library:2.10.2(master) selects same versions as previous traversal. ignoring
23:27:05.602 [DEBUG] [org.gradle.api.internal.artifacts.ivyservice.resolveengine.DependencyGraphBuilder] Visiting configuration org.scala-lang:scala-library:2.10.2(runtime).
23:27:05.617 [DEBUG] [org.gradle.api.internal.artifacts.ivyservice.resolveengine.DependencyGraphBuilder] Changed edges for org.scala-lang:scala-library:2.10.2(runtime) selects same versions as previous traversal. ignoring
23:27:05.633 [DEBUG] [org.gradle.api.internal.artifacts.ivyservice.resolveengine.DependencyGraphBuilder] Selected org.lwjgl.lwjgl:lwjgl:2.9.0 from conflicting modules [org.lwjgl.lwjgl:lwjgl:2.9.0, org.lwjgl.lwjgl:lwjgl:2.8.3].
23:27:05.633 [DEBUG] [org.gradle.api.internal.artifacts.ivyservice.resolveengine.DependencyGraphBuilder] Visiting configuration org.lwjgl.lwjgl:lwjgl:2.9.0(default).
23:27:05.648 [DEBUG] [org.gradle.api.internal.artifacts.ivyservice.resolveengine.DependencyGraphBuilder] Visiting dependency org.lwjgl.lwjgl:lwjgl:2.9.0(default) -> org.lwjgl.lwjgl:lwjgl-platform:2.9.0(dependency: org.lwjgl.lwjgl#lwjgl-platform;2.9.0 {compile=[compile(*), master(*)], runtime=[runtime(*)]})
23:27:05.648 [DEBUG] [org.gradle.api.internal.artifacts.ivyservice.resolveengine.DependencyGraphBuilder] Selecting new module version org.lwjgl.lwjgl:lwjgl-platform:2.9.0
23:27:05.664 [DEBUG] [org.gradle.api.internal.artifacts.ivyservice.ivyresolve.UserResolverChain] Attempting to resolve module 'org.lwjgl.lwjgl:lwjgl-platform:2.9.0' using repositories [forge, MavenRepo, minecraft, forgeFlatRepo]
23:27:05.664 [DEBUG] [org.gradle.api.internal.artifacts.ivyservice.ivyresolve.UserResolverChain] Using module 'org.lwjgl.lwjgl:lwjgl-platform:2.9.0' from repository 'MavenRepo'
23:27:05.680 [DEBUG] [org.gradle.api.internal.artifacts.ivyservice.resolveengine.DependencyGraphBuilder] Visiting dependency org.lwjgl.lwjgl:lwjgl:2.9.0(default) -> org.lwjgl.lwjgl:lwjgl-platform:2.9.0(dependency: org.lwjgl.lwjgl#lwjgl-platform;2.9.0 {compile=[compile(*), master(*)], runtime=[runtime(*)]})
23:27:05.680 [DEBUG] [org.gradle.api.internal.artifacts.ivyservice.resolveengine.DependencyGraphBuilder] Visiting dependency org.lwjgl.lwjgl:lwjgl:2.9.0(default) -> org.lwjgl.lwjgl:lwjgl-platform:2.9.0(dependency: org.lwjgl.lwjgl#lwjgl-platform;2.9.0 {compile=[compile(*), master(*)], runtime=[runtime(*)]})
23:27:05.695 [DEBUG] [org.gradle.api.internal.artifacts.ivyservice.resolveengine.DependencyGraphBuilder] Visiting dependency org.lwjgl.lwjgl:lwjgl:2.9.0(default) -> net.java.jinput:jinput:2.0.5(dependency: net.java.jinput#jinput;2.0.5 {compile=[compile(*), master(*)], runtime=[runtime(*)]})
23:27:05.695 [DEBUG] [org.gradle.api.internal.artifacts.ivyservice.resolveengine.DependencyGraphBuilder] Visiting configuration org.lwjgl.lwjgl:lwjgl:2.9.0(compile).
23:27:05.711 [DEBUG] [org.gradle.api.internal.artifacts.ivyservice.resolveengine.DependencyGraphBuilder] Visiting dependency org.lwjgl.lwjgl:lwjgl:2.9.0(compile) -> org.lwjgl.lwjgl:lwjgl-platform:2.9.0(dependency: org.lwjgl.lwjgl#lwjgl-platform;2.9.0 {compile=[compile(*), master(*)], runtime=[runtime(*)]})
23:27:05.711 [DEBUG] [org.gradle.api.internal.artifacts.ivyservice.resolveengine.DependencyGraphBuilder] Visiting dependency org.lwjgl.lwjgl:lwjgl:2.9.0(compile) -> org.lwjgl.lwjgl:lwjgl-platform:2.9.0(dependency: org.lwjgl.lwjgl#lwjgl-platform;2.9.0 {compile=[compile(*), master(*)], runtime=[runtime(*)]})
23:27:05.726 [DEBUG] [org.gradle.api.internal.artifacts.ivyservice.resolveengine.DependencyGraphBuilder] Visiting dependency org.lwjgl.lwjgl:lwjgl:2.9.0(compile) -> org.lwjgl.lwjgl:lwjgl-platform:2.9.0(dependency: org.lwjgl.lwjgl#lwjgl-platform;2.9.0 {compile=[compile(*), master(*)], runtime=[runtime(*)]})
23:27:05.742 [DEBUG] [org.gradle.api.internal.artifacts.ivyservice.resolveengine.DependencyGraphBuilder] Visiting dependency org.lwjgl.lwjgl:lwjgl:2.9.0(compile) -> net.java.jinput:jinput:2.0.5(dependency: net.java.jinput#jinput;2.0.5 {compile=[compile(*), master(*)], runtime=[runtime(*)]})
23:27:05.742 [DEBUG] [org.gradle.api.internal.artifacts.ivyservice.resolveengine.DependencyGraphBuilder] Visiting configuration org.lwjgl.lwjgl:lwjgl:2.9.0(master).
23:27:05.758 [DEBUG] [org.gradle.api.internal.artifacts.ivyservice.resolveengine.DependencyGraphBuilder] Visiting configuration org.lwjgl.lwjgl:lwjgl:2.9.0(runtime).
23:27:05.758 [DEBUG] [org.gradle.api.internal.artifacts.ivyservice.resolveengine.DependencyGraphBuilder] Visiting dependency org.lwjgl.lwjgl:lwjgl:2.9.0(runtime) -> org.lwjgl.lwjgl:lwjgl-platform:2.9.0(dependency: org.lwjgl.lwjgl#lwjgl-platform;2.9.0 {compile=[compile(*), master(*)], runtime=[runtime(*)]})
23:27:05.773 [DEBUG] [org.gradle.api.internal.artifacts.ivyservice.resolveengine.DependencyGraphBuilder] Visiting dependency org.lwjgl.lwjgl:lwjgl:2.9.0(runtime) -> org.lwjgl.lwjgl:lwjgl-platform:2.9.0(dependency: org.lwjgl.lwjgl#lwjgl-platform;2.9.0 {compile=[compile(*), master(*)], runtime=[runtime(*)]})
23:27:05.773 [DEBUG] [org.gradle.api.internal.artifacts.ivyservice.resolveengine.DependencyGraphBuilder] Visiting dependency org.lwjgl.lwjgl:lwjgl:2.9.0(runtime) -> org.lwjgl.lwjgl:lwjgl-platform:2.9.0(dependency: org.lwjgl.lwjgl#lwjgl-platform;2.9.0 {compile=[compile(*), master(*)], runtime=[runtime(*)]})
23:27:05.789 [DEBUG] [org.gradle.api.internal.artifacts.ivyservice.resolveengine.DependencyGraphBuilder] Visiting dependency org.lwjgl.lwjgl:lwjgl:2.9.0(runtime) -> net.java.jinput:jinput:2.0.5(dependency: net.java.jinput#jinput;2.0.5 {compile=[compile(*), master(*)], runtime=[runtime(*)]})
23:27:05.804 [DEBUG] [org.gradle.api.internal.artifacts.ivyservice.resolveengine.DependencyGraphBuilder] Visiting configuration org.lwjgl.lwjgl:lwjgl-platform:2.9.0(compile).
23:27:05.804 [DEBUG] [org.gradle.api.internal.artifacts.ivyservice.resolveengine.DependencyGraphBuilder] Visiting configuration org.lwjgl.lwjgl:lwjgl-platform:2.9.0(master).
23:27:05.820 [DEBUG] [org.gradle.api.internal.artifacts.ivyservice.resolveengine.DependencyGraphBuilder] Visiting configuration org.lwjgl.lwjgl:lwjgl-platform:2.9.0(runtime).
23:27:05.820 [DEBUG] [org.gradle.api.internal.artifacts.ivyservice.resolveengine.DependencyGraphBuilder] Visiting configuration net.java.jinput:jinput:2.0.5(compile).
23:27:05.836 [DEBUG] [org.gradle.api.internal.artifacts.ivyservice.resolveengine.DependencyGraphBuilder] Visiting dependency net.java.jinput:jinput:2.0.5(compile) -> net.java.jutils:jutils:1.0.0(dependency: net.java.jutils#jutils;1.0.0 {compile=[compile(*), master(*)], runtime=[runtime(*)]})
23:27:05.836 [DEBUG] [org.gradle.api.internal.artifacts.ivyservice.resolveengine.DependencyGraphBuilder] Visiting configuration net.java.jinput:jinput:2.0.5(master).
23:27:05.851 [DEBUG] [org.gradle.api.internal.artifacts.ivyservice.resolveengine.DependencyGraphBuilder] Visiting configuration net.java.jinput:jinput:2.0.5(runtime).
23:27:05.851 [DEBUG] [org.gradle.api.internal.artifacts.ivyservice.resolveengine.DependencyGraphBuilder] Visiting dependency net.java.jinput:jinput:2.0.5(runtime) -> net.java.jutils:jutils:1.0.0(dependency: net.java.jutils#jutils;1.0.0 {compile=[compile(*), master(*)], runtime=[runtime(*)]})
23:27:05.867 [DEBUG] [org.gradle.api.internal.artifacts.ivyservice.resolveengine.DependencyGraphBuilder] Visiting dependency net.java.jinput:jinput:2.0.5(runtime) -> net.java.jinput:jinput-platform:2.0.5(dependency: net.java.jinput#jinput-platform;2.0.5 {runtime=[compile(*), runtime(*), master(*)]})
23:27:05.867 [DEBUG] [org.gradle.api.internal.artifacts.ivyservice.resolveengine.DependencyGraphBuilder] Visiting dependency net.java.jinput:jinput:2.0.5(runtime) -> net.java.jinput:jinput-platform:2.0.5(dependency: net.java.jinput#jinput-platform;2.0.5 {runtime=[compile(*), runtime(*), master(*)]})
23:27:05.882 [DEBUG] [org.gradle.api.internal.artifacts.ivyservice.resolveengine.DependencyGraphBuilder] Visiting dependency net.java.jinput:jinput:2.0.5(runtime) -> net.java.jinput:jinput-platform:2.0.5(dependency: net.java.jinput#jinput-platform;2.0.5 {runtime=[compile(*), runtime(*), master(*)]})
23:27:05.882 [DEBUG] [org.gradle.api.internal.artifacts.ivyservice.resolveengine.DependencyGraphBuilder] Visiting configuration net.java.jutils:jutils:1.0.0(compile).
23:27:05.898 [DEBUG] [org.gradle.api.internal.artifacts.ivyservice.resolveengine.DependencyGraphBuilder] Changed edges for net.java.jutils:jutils:1.0.0(compile) selects same versions as previous traversal. ignoring
23:27:05.898 [DEBUG] [org.gradle.api.internal.artifacts.ivyservice.resolveengine.DependencyGraphBuilder] Visiting configuration net.java.jutils:jutils:1.0.0(master).
23:27:05.914 [DEBUG] [org.gradle.api.internal.artifacts.ivyservice.resolveengine.DependencyGraphBuilder] Changed edges for net.java.jutils:jutils:1.0.0(master) selects same versions as previous traversal. ignoring
23:27:05.914 [DEBUG] [org.gradle.api.internal.artifacts.ivyservice.resolveengine.DependencyGraphBuilder] Visiting configuration net.java.jutils:jutils:1.0.0(runtime).
23:27:05.929 [DEBUG] [org.gradle.api.internal.artifacts.ivyservice.resolveengine.DependencyGraphBuilder] Changed edges for net.java.jutils:jutils:1.0.0(runtime) selects same versions as previous traversal. ignoring
23:27:05.929 [DEBUG] [org.gradle.api.internal.artifacts.ivyservice.resolveengine.DependencyGraphBuilder] Visiting configuration net.java.jinput:jinput-platform:2.0.5(compile).
23:27:05.945 [DEBUG] [org.gradle.api.internal.artifacts.ivyservice.resolveengine.DependencyGraphBuilder] Changed edges for net.java.jinput:jinput-platform:2.0.5(compile) selects same versions as previous traversal. ignoring
23:27:05.945 [DEBUG] [org.gradle.api.internal.artifacts.ivyservice.resolveengine.DependencyGraphBuilder] Visiting configuration net.java.jinput:jinput-platform:2.0.5(runtime).
23:27:05.960 [DEBUG] [org.gradle.api.internal.artifacts.ivyservice.resolveengine.DependencyGraphBuilder] Changed edges for net.java.jinput:jinput-platform:2.0.5(runtime) selects same versions as previous traversal. ignoring
23:27:05.960 [DEBUG] [org.gradle.api.internal.artifacts.ivyservice.resolveengine.DependencyGraphBuilder] Visiting configuration net.java.jinput:jinput-platform:2.0.5(master).
23:27:05.976 [DEBUG] [org.gradle.api.internal.artifacts.ivyservice.resolveengine.DependencyGraphBuilder] Changed edges for net.java.jinput:jinput-platform:2.0.5(master) selects same versions as previous traversal. ignoring
23:27:05.976 [DEBUG] [org.gradle.api.internal.artifacts.ivyservice.resolveengine.DependencyGraphBuilder] Selected com.google.code.gson:gson:2.2.4 from conflicting modules [com.google.code.gson:gson:2.2.4, com.google.code.gson:gson:2.2.2].
23:27:05.992 [DEBUG] [org.gradle.api.internal.artifacts.ivyservice.resolveengine.DependencyGraphBuilder] Visiting configuration com.google.code.gson:gson:2.2.4(default).
23:27:05.992 [DEBUG] [org.gradle.api.internal.artifacts.ivyservice.resolveengine.DependencyGraphBuilder] Visiting configuration com.google.code.gson:gson:2.2.4(compile).
23:27:06.007 [DEBUG] [org.gradle.api.internal.artifacts.ivyservice.resolveengine.DependencyGraphBuilder] Visiting configuration com.google.code.gson:gson:2.2.4(master).
23:27:06.007 [DEBUG] [org.gradle.api.internal.artifacts.ivyservice.resolveengine.DependencyGraphBuilder] Visiting configuration com.google.code.gson:gson:2.2.4(runtime).
23:27:06.023 [DEBUG] [org.gradle.api.internal.artifacts.ivyservice.resolveengine.DependencyGraphBuilder] Attaching com.uourname.modid:Minecraft modding 2:1.0(compile) to its parents.
23:27:06.023 [DEBUG] [org.gradle.api.internal.artifacts.ivyservice.resolveengine.DependencyGraphBuilder] Attaching :forgeSrc:1.7.2-10.12.1.1060(default) to its parents.
23:27:06.038 [DEBUG] [org.gradle.api.internal.artifacts.ivyservice.resolveengine.DependencyGraphBuilder] Attaching net.minecraft:launchwrapper:1.9(default) to its parents.
23:27:06.038 [DEBUG] [org.gradle.api.internal.artifacts.ivyservice.resolveengine.DependencyGraphBuilder] Attaching org.ow2.asm:asm-debug-all:4.1(default) to its parents.
23:27:06.054 [DEBUG] [org.gradle.api.internal.artifacts.ivyservice.resolveengine.DependencyGraphBuilder] Attaching org.scala-lang:scala-library:2.10.2(default) to its parents.
23:27:06.054 [DEBUG] [org.gradle.api.internal.artifacts.ivyservice.resolveengine.DependencyGraphBuilder] Attaching org.scala-lang:scala-compiler:2.10.2(default) to its parents.
23:27:06.070 [DEBUG] [org.gradle.api.internal.artifacts.ivyservice.resolveengine.DependencyGraphBuilder] Attaching net.sf.jopt-simple:jopt-simple:4.5(default) to its parents.
23:27:06.070 [DEBUG] [org.gradle.api.internal.artifacts.ivyservice.resolveengine.DependencyGraphBuilder] Attaching java3d:vecmath:1.3.1(default) to its parents.
23:27:06.085 [DEBUG] [org.gradle.api.internal.artifacts.ivyservice.resolveengine.DependencyGraphBuilder] Attaching net.sf.trove4j:trove4j:3.0.3(default) to its parents.
23:27:06.085 [DEBUG] [org.gradle.api.internal.artifacts.ivyservice.resolveengine.DependencyGraphBuilder] Attaching com.ibm.icu:icu4j-core-mojang:51.2(default) to its parents.
23:27:06.101 [DEBUG] [org.gradle.api.internal.artifacts.ivyservice.resolveengine.DependencyGraphBuilder] Attaching lzma:lzma:0.0.1(default) to its parents.
23:27:06.101 [DEBUG] [org.gradle.api.internal.artifacts.ivyservice.resolveengine.DependencyGraphBuilder] Attaching com.paulscode:codecjorbis:20101023(default) to its parents.
23:27:06.116 [DEBUG] [org.gradle.api.internal.artifacts.ivyservice.resolveengine.DependencyGraphBuilder] Attaching com.paulscode:codecwav:20101023(default) to its parents.
23:27:06.116 [DEBUG] [org.gradle.api.internal.artifacts.ivyservice.resolveengine.DependencyGraphBuilder] Attaching com.paulscode:libraryjavasound:20101123(default) to its parents.
23:27:06.132 [DEBUG] [org.gradle.api.internal.artifacts.ivyservice.resolveengine.DependencyGraphBuilder] Attaching com.paulscode:librarylwjglopenal:20100824(default) to its parents.
23:27:06.132 [DEBUG] [org.gradle.api.internal.artifacts.ivyservice.resolveengine.DependencyGraphBuilder] Attaching com.paulscode:soundsystem:20120107(default) to its parents.
23:27:06.148 [DEBUG] [org.gradle.api.internal.artifacts.ivyservice.resolveengine.DependencyGraphBuilder] Attaching io.netty:netty-all:4.0.10.Final(default) to its parents.
23:27:06.148 [DEBUG] [org.gradle.api.internal.artifacts.ivyservice.resolveengine.DependencyGraphBuilder] Attaching com.google.guava:guava:15.0(default) to its parents.
23:27:06.163 [DEBUG] [org.gradle.api.internal.artifacts.ivyservice.resolveengine.DependencyGraphBuilder] Attaching org.apache.commons:commons-lang3:3.1(default) to its parents.
23:27:06.163 [DEBUG] [org.gradle.api.internal.artifacts.ivyservice.resolveengine.DependencyGraphBuilder] Attaching commons-io:commons-io:2.4(default) to its parents.
23:27:06.179 [DEBUG] [org.gradle.api.internal.artifacts.ivyservice.resolveengine.DependencyGraphBuilder] Attaching net.java.jinput:jinput:2.0.5(default) to its parents.
23:27:06.179 [DEBUG] [org.gradle.api.internal.artifacts.ivyservice.resolveengine.DependencyGraphBuilder] Attaching net.java.jutils:jutils:1.0.0(default) to its parents.
23:27:06.194 [DEBUG] [org.gradle.api.internal.artifacts.ivyservice.resolveengine.DependencyGraphBuilder] Attaching com.google.code.gson:gson:2.2.4(default) to its parents.
23:27:06.194 [DEBUG] [org.gradle.api.internal.artifacts.ivyservice.resolveengine.DependencyGraphBuilder] Attaching com.mojang:authlib:1.3(default) to its parents.
23:27:06.210 [DEBUG] [org.gradle.api.internal.artifacts.ivyservice.resolveengine.DependencyGraphBuilder] Attaching org.apache.logging.log4j:log4j-api:2.0-beta9(default) to its parents.
23:27:06.210 [DEBUG] [org.gradle.api.internal.artifacts.ivyservice.resolveengine.DependencyGraphBuilder] Attaching org.apache.logging.log4j:log4j-core:2.0-beta9(default) to its parents.
23:27:06.226 [DEBUG] [org.gradle.api.internal.artifacts.ivyservice.resolveengine.DependencyGraphBuilder] Attaching org.lwjgl.lwjgl:lwjgl:2.9.0(default) to its parents.
23:27:06.226 [DEBUG] [org.gradle.api.internal.artifacts.ivyservice.resolveengine.DependencyGraphBuilder] Attaching org.lwjgl.lwjgl:lwjgl_util:2.9.0(default) to its parents.
23:27:06.241 [DEBUG] [org.gradle.api.internal.artifacts.ivyservice.resolveengine.DependencyGraphBuilder] Attaching org.lwjgl.lwjgl:lwjgl:2.9.0(compile) to its parents.
23:27:06.241 [DEBUG] [org.gradle.api.internal.artifacts.ivyservice.resolveengine.DependencyGraphBuilder] Attaching org.lwjgl.lwjgl:lwjgl:2.9.0(master) to its parents.
23:27:06.257 [DEBUG] [org.gradle.api.internal.artifacts.ivyservice.resolveengine.DependencyGraphBuilder] Attaching org.lwjgl.lwjgl:lwjgl:2.9.0(runtime) to its parents.
23:27:06.257 [DEBUG] [org.gradle.api.internal.artifacts.ivyservice.resolveengine.DependencyGraphBuilder] Attaching org.apache.logging.log4j:log4j-core:2.0-beta9(compile) to its parents.
23:27:06.272 [DEBUG] [org.gradle.api.internal.artifacts.ivyservice.resolveengine.DependencyGraphBuilder] Attaching org.apache.logging.log4j:log4j-core:2.0-beta9(master) to its parents.
23:27:06.272 [DEBUG] [org.gradle.api.internal.artifacts.ivyservice.resolveengine.DependencyGraphBuilder] Attaching org.apache.logging.log4j:log4j-core:2.0-beta9(runtime) to its parents.
23:27:06.288 [DEBUG] [org.gradle.api.internal.artifacts.ivyservice.resolveengine.DependencyGraphBuilder] Attaching org.apache.logging.log4j:log4j-api:2.0-beta9(compile) to its parents.
23:27:06.288 [DEBUG] [org.gradle.api.internal.artifacts.ivyservice.resolveengine.DependencyGraphBuilder] Attaching org.apache.logging.log4j:log4j-api:2.0-beta9(master) to its parents.
23:27:06.304 [DEBUG] [org.gradle.api.internal.artifacts.ivyservice.resolveengine.DependencyGraphBuilder] Attaching org.apache.logging.log4j:log4j-api:2.0-beta9(runtime) to its parents.
23:27:06.304 [DEBUG] [org.gradle.api.internal.artifacts.ivyservice.resolveengine.DependencyGraphBuilder] Attaching net.sf.jopt-simple:jopt-simple:4.5(compile) to its parents.
23:27:06.319 [DEBUG] [org.gradle.api.internal.artifacts.ivyservice.resolveengine.DependencyGraphBuilder] Attaching net.sf.jopt-simple:jopt-simple:4.5(master) to its parents.
23:27:06.319 [DEBUG] [org.gradle.api.internal.artifacts.ivyservice.resolveengine.DependencyGraphBuilder] Attaching net.sf.jopt-simple:jopt-simple:4.5(runtime) to its parents.
23:27:06.335 [DEBUG] [org.gradle.api.internal.artifacts.ivyservice.resolveengine.DependencyGraphBuilder] Attaching org.ow2.asm:asm-debug-all:4.1(compile) to its parents.
23:27:06.335 [DEBUG] [org.gradle.api.internal.artifacts.ivyservice.resolveengine.DependencyGraphBuilder] Attaching org.ow2.asm:asm-debug-all:4.1(master) to its parents.
23:27:06.350 [DEBUG] [org.gradle.api.internal.artifacts.ivyservice.resolveengine.DependencyGraphBuilder] Attaching org.ow2.asm:asm-debug-all:4.1(runtime) to its parents.
23:27:06.350 [DEBUG] [org.gradle.api.internal.artifacts.ivyservice.resolveengine.DependencyGraphBuilder] Attaching org.scala-lang:scala-library:2.10.2(compile) to its parents.
23:27:06.366 [DEBUG] [org.gradle.api.internal.artifacts.ivyservice.resolveengine.DependencyGraphBuilder] Attaching org.scala-lang:scala-library:2.10.2(master) to its parents.
23:27:06.366 [DEBUG] [org.gradle.api.internal.artifacts.ivyservice.resolveengine.DependencyGraphBuilder] Attaching org.scala-lang:scala-library:2.10.2(runtime) to its parents.
23:27:06.382 [DEBUG] [org.gradle.api.internal.artifacts.ivyservice.resolveengine.DependencyGraphBuilder] Attaching org.scala-lang:scala-reflect:2.10.2(compile) to its parents.
23:27:06.382 [DEBUG] [org.gradle.api.internal.artifacts.ivyservice.resolveengine.DependencyGraphBuilder] Attaching org.scala-lang:scala-reflect:2.10.2(master) to its parents.
23:27:06.397 [DEBUG] [org.gradle.api.internal.artifacts.ivyservice.resolveengine.DependencyGraphBuilder] Attaching org.scala-lang:scala-reflect:2.10.2(runtime) to its parents.
23:27:06.397 [DEBUG] [org.gradle.api.internal.artifacts.ivyservice.resolveengine.DependencyGraphBuilder] Attaching com.paulscode:soundsystem:20120107(compile) to its parents.
23:27:06.413 [DEBUG] [org.gradle.api.internal.artifacts.ivyservice.resolveengine.DependencyGraphBuilder] Attaching com.paulscode:soundsystem:20120107(master) to its parents.
23:27:06.413 [DEBUG] [org.gradle.api.internal.artifacts.ivyservice.resolveengine.DependencyGraphBuilder] Attaching com.paulscode:soundsystem:20120107(runtime) to its parents.
23:27:06.428 [DEBUG] [org.gradle.api.internal.artifacts.ivyservice.resolveengine.DependencyGraphBuilder] Attaching net.java.jutils:jutils:1.0.0(compile) to its parents.
23:27:06.428 [DEBUG] [org.gradle.api.internal.artifacts.ivyservice.resolveengine.DependencyGraphBuilder] Attaching net.java.jutils:jutils:1.0.0(master) to its parents.
23:27:06.444 [DEBUG] [org.gradle.api.internal.artifacts.ivyservice.resolveengine.DependencyGraphBuilder] Attaching net.java.jutils:jutils:1.0.0(runtime) to its parents.
23:27:06.444 [DEBUG] [org.gradle.api.internal.artifacts.ivyservice.resolveengine.DependencyGraphBuilder] Attaching net.java.jinput:jinput-platform:2.0.5(compile) to its parents.
23:27:06.460 [DEBUG] [org.gradle.api.internal.artifacts.ivyservice.resolveengine.DependencyGraphBuilder] Attaching net.java.jinput:jinput-platform:2.0.5(runtime) to its parents.
23:27:06.460 [DEBUG] [org.gradle.api.internal.artifacts.ivyservice.resolveengine.DependencyGraphBuilder] Attaching net.java.jinput:jinput-platform:2.0.5(master) to its parents.
23:27:06.475 [DEBUG] [org.gradle.api.internal.artifacts.ivyservice.resolveengine.DependencyGraphBuilder] Attaching com.google.guava:guava:15.0(compile) to its parents.
23:27:06.475 [DEBUG] [org.gradle.api.internal.artifacts.ivyservice.resolveengine.DependencyGraphBuilder] Attaching com.google.guava:guava:15.0(master) to its parents.
23:27:06.491 [DEBUG] [org.gradle.api.internal.artifacts.ivyservice.resolveengine.DependencyGraphBuilder] Attaching com.google.guava:guava:15.0(runtime) to its parents.
23:27:06.491 [DEBUG] [org.gradle.api.internal.artifacts.ivyservice.resolveengine.DependencyGraphBuilder] Attaching commons-io:commons-io:2.4(compile) to its parents.
23:27:06.506 [DEBUG] [org.gradle.api.internal.artifacts.ivyservice.resolveengine.DependencyGraphBuilder] Attaching commons-io:commons-io:2.4(master) to its parents.
23:27:06.506 [DEBUG] [org.gradle.api.internal.artifacts.ivyservice.resolveengine.DependencyGraphBuilder] Attaching commons-io:commons-io:2.4(runtime) to its parents.
23:27:06.522 [DEBUG] [org.gradle.api.internal.artifacts.ivyservice.resolveengine.DependencyGraphBuilder] Attaching org.apache.commons:commons-lang3:3.1(compile) to its parents.
23:27:06.522 [DEBUG] [org.gradle.api.internal.artifacts.ivyservice.resolveengine.DependencyGraphBuilder] Attaching org.apache.commons:commons-lang3:3.1(master) to its parents.
23:27:06.538 [DEBUG] [org.gradle.api.internal.artifacts.ivyservice.resolveengine.DependencyGraphBuilder] Attaching org.apache.commons:commons-lang3:3.1(runtime) to its parents.
23:27:06.538 [DEBUG] [org.gradle.api.internal.artifacts.ivyservice.resolveengine.DependencyGraphBuilder] Attaching org.lwjgl.lwjgl:lwjgl-platform:2.9.0(compile) to its parents.
23:27:06.553 [DEBUG] [org.gradle.api.internal.artifacts.ivyservice.resolveengine.DependencyGraphBuilder] Attaching org.lwjgl.lwjgl:lwjgl-platform:2.9.0(master) to its parents.
23:27:06.553 [DEBUG] [org.gradle.api.internal.artifacts.ivyservice.resolveengine.DependencyGraphBuilder] Attaching org.lwjgl.lwjgl:lwjgl-platform:2.9.0(runtime) to its parents.
23:27:06.569 [DEBUG] [org.gradle.api.internal.artifacts.ivyservice.resolveengine.DependencyGraphBuilder] Attaching net.java.jinput:jinput:2.0.5(compile) to its parents.
23:27:06.569 [DEBUG] [org.gradle.api.internal.artifacts.ivyservice.resolveengine.DependencyGraphBuilder] Attaching net.java.jinput:jinput:2.0.5(master) to its parents.
23:27:06.584 [DEBUG] [org.gradle.api.internal.artifacts.ivyservice.resolveengine.DependencyGraphBuilder] Attaching net.java.jinput:jinput:2.0.5(runtime) to its parents.
23:27:06.584 [DEBUG] [org.gradle.api.internal.artifacts.ivyservice.resolveengine.DependencyGraphBuilder] Attaching com.google.code.gson:gson:2.2.4(compile) to its parents.
23:27:06.600 [DEBUG] [org.gradle.api.internal.artifacts.ivyservice.resolveengine.DependencyGraphBuilder] Attaching com.google.code.gson:gson:2.2.4(master) to its parents.
23:27:06.600 [DEBUG] [org.gradle.api.internal.artifacts.ivyservice.resolveengine.DependencyGraphBuilder] Attaching com.google.code.gson:gson:2.2.4(runtime) to its parents.
23:27:06.616 [DEBUG] [org.gradle.api.internal.artifacts.ivyservice.resolveengine.oldresult.TransientConfigurationResultsBuilder] Flushing resolved configuration data in Binary store in C:\Users\Davey\AppData\Local\Temp\gradle3189074344331550376.bin. Wrote root com.uourname.modid:Minecraft modding 2:1.0:compile.
23:27:06.631 [iNFO] [org.gradle.api.internal.file.collections.DirectoryFileTree] file or directory 'C:\Users\Davey\Desktop\Minecraft modding 2\libs', not found
23:27:06.631 [DEBUG] [org.gradle.api.internal.artifacts.repositories.resolver.ExternalResourceResolver] Loading C:\Users\Davey\.gradle\caches\minecraft\net\minecraftforge\forge\1.7.2-10.12.1.1060/forgeSrc-1.7.2-10.12.1.1060.jar
23:27:06.647 [DEBUG] [org.gradle.api.internal.artifacts.ivyservice.ivyresolve.CachingModuleVersionRepository] Found artifact 'net.minecraft:launchwrapper:1.9:launchwrapper.jar' in resolver cache: C:\Users\Davey\.gradle\caches\modules-2\files-2.1\net.minecraft\launchwrapper\1.9\116f2aad5b0c68353ebed66cd463517db6522f7e\launchwrapper-1.9.jar
23:27:06.647 [DEBUG] [org.gradle.api.internal.artifacts.ivyservice.ivyresolve.CachingModuleVersionRepository] Found artifact 'org.scala-lang:scala-library:2.10.2:scala-library.jar' in resolver cache: C:\Users\Davey\.gradle\caches\modules-2\files-2.1\org.scala-lang\scala-library\2.10.2\6ba65d12cd09d441083262d6f73d2257fec7c663\scala-library-2.10.2.jar
23:27:06.662 [DEBUG] [org.gradle.api.internal.artifacts.ivyservice.ivyresolve.CachingModuleVersionRepository] Found artifact 'org.scala-lang:scala-compiler:2.10.2:scala-compiler.jar' in resolver cache: C:\Users\Davey\.gradle\caches\modules-2\files-2.1\org.scala-lang\scala-compiler\2.10.2\64c8b1380cc53d6850823d6e4e7ae984aa44ef9c\scala-compiler-2.10.2.jar
23:27:06.678 [DEBUG] [org.gradle.api.internal.artifacts.ivyservice.ivyresolve.CachingModuleVersionRepository] Found artifact 'net.sf.jopt-simple:jopt-simple:4.5:jopt-simple.jar' in resolver cache: C:\Users\Davey\.gradle\caches\modules-2\files-2.1\net.sf.jopt-simple\jopt-simple\4.5\6065cc95c661255349c1d0756657be17c29a4fd3\jopt-simple-4.5.jar
23:27:06.678 [DEBUG] [org.gradle.api.internal.artifacts.ivyservice.ivyresolve.CachingModuleVersionRepository] Found artifact 'java3d:vecmath:1.3.1:vecmath.jar' in resolver cache: C:\Users\Davey\.gradle\caches\modules-2\files-2.1\java3d\vecmath\1.3.1\a0ae4f51da409fa0c20fa0ca59e6bbc9413ae71d\vecmath-1.3.1.jar
23:27:06.694 [DEBUG] [org.gradle.api.internal.artifacts.ivyservice.ivyresolve.CachingModuleVersionRepository] Found artifact 'net.sf.trove4j:trove4j:3.0.3:trove4j.jar' in resolver cache: C:\Users\Davey\.gradle\caches\modules-2\files-2.1\net.sf.trove4j\trove4j\3.0.3\42ccaf4761f0dfdfa805c9e340d99a755907e2dd\trove4j-3.0.3.jar
23:27:06.694 [DEBUG] [org.gradle.api.internal.artifacts.ivyservice.ivyresolve.CachingModuleVersionRepository] Found artifact 'com.ibm.icu:icu4j-core-mojang:51.2:icu4j-core-mojang.jar' in resolver cache: C:\Users\Davey\.gradle\caches\modules-2\files-2.1\com.ibm.icu\icu4j-core-mojang\51.2\63d216a9311cca6be337c1e458e587f99d382b84\icu4j-core-mojang-51.2.jar
23:27:06.709 [DEBUG] [org.gradle.api.internal.artifacts.ivyservice.ivyresolve.CachingModuleVersionRepository] Found artifact 'lzma:lzma:0.0.1:lzma.jar' in resolver cache: C:\Users\Davey\.gradle\caches\modules-2\files-2.1\lzma\lzma\0.0.1\521616dc7487b42bef0e803bd2fa3faf668101d7\lzma-0.0.1.jar
23:27:06.725 [DEBUG] [org.gradle.api.internal.artifacts.ivyservice.ivyresolve.CachingModuleVersionRepository] Found artifact 'com.paulscode:codecjorbis:20101023:codecjorbis.jar' in resolver cache: C:\Users\Davey\.gradle\caches\modules-2\files-2.1\com.paulscode\codecjorbis\20101023\c73b5636faf089d9f00e8732a829577de25237ee\codecjorbis-20101023.jar
23:27:06.725 [DEBUG] [org.gradle.api.internal.artifacts.ivyservice.ivyresolve.CachingModuleVersionRepository] Found artifact 'com.paulscode:codecwav:20101023:codecwav.jar' in resolver cache: C:\Users\Davey\.gradle\caches\modules-2\files-2.1\com.paulscode\codecwav\20101023\12f031cfe88fef5c1dd36c563c0a3a69bd7261da\codecwav-20101023.jar
23:27:06.740 [DEBUG] [org.gradle.api.internal.artifacts.ivyservice.ivyresolve.CachingModuleVersionRepository] Found artifact 'com.paulscode:libraryjavasound:20101123:libraryjavasound.jar' in resolver cache: C:\Users\Davey\.gradle\caches\modules-2\files-2.1\com.paulscode\libraryjavasound\20101123\5c5e304366f75f9eaa2e8cca546a1fb6109348b3\libraryjavasound-20101123.jar
23:27:06.740 [DEBUG] [org.gradle.api.internal.artifacts.ivyservice.ivyresolve.CachingModuleVersionRepository] Found artifact 'com.paulscode:librarylwjglopenal:20100824:librarylwjglopenal.jar' in resolver cache: C:\Users\Davey\.gradle\caches\modules-2\files-2.1\com.paulscode\librarylwjglopenal\20100824\73e80d0794c39665aec3f62eee88ca91676674ef\librarylwjglopenal-20100824.jar
23:27:06.756 [DEBUG] [org.gradle.api.internal.artifacts.ivyservice.ivyresolve.CachingModuleVersionRepository] Found artifact 'com.paulscode:soundsystem:20120107:soundsystem.jar' in resolver cache: C:\Users\Davey\.gradle\caches\modules-2\files-2.1\com.paulscode\soundsystem\20120107\419c05fe9be71f792b2d76cfc9b67f1ed0fec7f6\soundsystem-20120107.jar
23:27:06.772 [DEBUG] [org.gradle.api.internal.artifacts.ivyservice.ivyresolve.CachingModuleVersionRepository] Found artifact 'io.netty:netty-all:4.0.10.Final:netty-all.jar' in resolver cache: C:\Users\Davey\.gradle\caches\modules-2\files-2.1\io.netty\netty-all\4.0.10.Final\9e50bd52ffe257a0e2cd8d971688d6ce7d174325\netty-all-4.0.10.Final.jar
23:27:06.772 [DEBUG] [org.gradle.api.internal.artifacts.ivyservice.ivyresolve.CachingModuleVersionRepository] Found artifact 'org.apache.commons:commons-lang3:3.1:commons-lang3.jar' in resolver cache: C:\Users\Davey\.gradle\caches\modules-2\files-2.1\org.apache.commons\commons-lang3\3.1\905075e6c80f206bbe6cf1e809d2caa69f420c76\commons-lang3-3.1.jar
23:27:06.787 [DEBUG] [org.gradle.api.internal.artifacts.ivyservice.ivyresolve.CachingModuleVersionRepository] Found artifact 'commons-io:commons-io:2.4:commons-io.jar' in resolver cache: C:\Users\Davey\.gradle\caches\modules-2\files-2.1\commons-io\commons-io\2.4\b1b6ea3b7e4aa4f492509a4952029cd8e48019ad\commons-io-2.4.jar
23:27:06.787 [DEBUG] [org.gradle.api.internal.artifacts.ivyservice.ivyresolve.CachingModuleVersionRepository] Found artifact 'net.java.jinput:jinput:2.0.5:jinput.jar' in resolver cache: C:\Users\Davey\.gradle\caches\modules-2\files-2.1\net.java.jinput\jinput\2.0.5\39c7796b469a600f72380316f6b1f11db6c2c7c4\jinput-2.0.5.jar
23:27:06.803 [DEBUG] [org.gradle.api.internal.artifacts.ivyservice.ivyresolve.CachingModuleVersionRepository] Found artifact 'net.java.jutils:jutils:1.0.0:jutils.jar' in resolver cache: C:\Users\Davey\.gradle\caches\modules-2\files-2.1\net.java.jutils\jutils\1.0.0\e12fe1fda814bd348c1579329c86943d2cd3c6a6\jutils-1.0.0.jar
23:27:06.818 [DEBUG] [org.gradle.api.internal.artifacts.ivyservice.ivyresolve.CachingModuleVersionRepository] Found artifact 'com.mojang:authlib:1.3:authlib.jar' in resolver cache: C:\Users\Davey\.gradle\caches\modules-2\files-2.1\com.mojang\authlib\1.3\4fb033c2d6eccced08752d8f33e8c3a0a45deb2d\authlib-1.3.jar
23:27:06.818 [DEBUG] [org.gradle.api.internal.artifacts.ivyservice.ivyresolve.CachingModuleVersionRepository] Found artifact 'org.apache.logging.log4j:log4j-api:2.0-beta9:log4j-api.jar' in resolver cache: C:\Users\Davey\.gradle\caches\modules-2\files-2.1\org.apache.logging.log4j\log4j-api\2.0-beta9\1dd66e68cccd907880229f9e2de1314bd13ff785\log4j-api-2.0-beta9.jar
23:27:06.834 [DEBUG] [org.gradle.api.internal.artifacts.ivyservice.ivyresolve.CachingModuleVersionRepository] Found artifact 'org.apache.logging.log4j:log4j-core:2.0-beta9:log4j-core.jar' in resolver cache: C:\Users\Davey\.gradle\caches\modules-2\files-2.1\org.apache.logging.log4j\log4j-core\2.0-beta9\678861ba1b2e1fccb594bb0ca03114bb05da9695\log4j-core-2.0-beta9.jar
23:27:06.850 [DEBUG] [org.gradle.api.internal.artifacts.ivyservice.ivyresolve.CachingModuleVersionRepository] Found artifact 'org.lwjgl.lwjgl:lwjgl:2.9.0:lwjgl.jar' in resolver cache: C:\Users\Davey\.gradle\caches\modules-2\files-2.1\org.lwjgl.lwjgl\lwjgl\2.9.0\5654d06e61a1bba7ae1e7f5233e1106be64c91cd\lwjgl-2.9.0.jar
23:27:06.850 [DEBUG] [org.gradle.api.internal.artifacts.ivyservice.ivyresolve.CachingModuleVersionRepository] Found artifact 'org.lwjgl.lwjgl:lwjgl_util:2.9.0:lwjgl_util.jar' in resolver cache: C:\Users\Davey\.gradle\caches\modules-2\files-2.1\org.lwjgl.lwjgl\lwjgl_util\2.9.0\a778846b64008fc7f48ead2377f034e547991699\lwjgl_util-2.9.0.jar
23:27:06.865 [DEBUG] [org.gradle.api.internal.artifacts.ivyservice.ivyresolve.CachingModuleVersionRepository] Found artifact 'org.scala-lang:scala-reflect:2.10.2:scala-reflect.jar' in resolver cache: C:\Users\Davey\.gradle\caches\modules-2\files-2.1\org.scala-lang\scala-reflect\2.10.2\444ff8e89a81697997ed8a98a4642ba283130249\scala-reflect-2.10.2.jar
23:27:06.865 [DEBUG] [org.gradle.api.internal.artifacts.ivyservice.ivyresolve.CachingModuleVersionRepository] Found artifact 'net.java.jinput:jinput-platform:2.0.5:jinput-platform-natives-linux.jar' in resolver cache: C:\Users\Davey\.gradle\caches\modules-2\files-2.1\net.java.jinput\jinput-platform\2.0.5\7ff832a6eb9ab6a767f1ade2b548092d0fa64795\jinput-platform-2.0.5-natives-linux.jar
23:27:06.881 [DEBUG] [org.gradle.api.internal.artifacts.ivyservice.ivyresolve.CachingModuleVersionRepository] Found artifact 'net.java.jinput:jinput-platform:2.0.5:jinput-platform-natives-osx.jar' in resolver cache: C:\Users\Davey\.gradle\caches\modules-2\files-2.1\net.java.jinput\jinput-platform\2.0.5\53f9c919f34d2ca9de8c51fc4e1e8282029a9232\jinput-platform-2.0.5-natives-osx.jar
23:27:06.896 [DEBUG] [org.gradle.api.internal.artifacts.ivyservice.ivyresolve.CachingModuleVersionRepository] Found artifact 'org.lwjgl.lwjgl:lwjgl-platform:2.9.0:lwjgl-platform-natives-linux.jar' in resolver cache: C:\Users\Davey\.gradle\caches\modules-2\files-2.1\org.lwjgl.lwjgl\lwjgl-platform\2.9.0\2ba5dcb11048147f1a74eff2deb192c001321f77\lwjgl-platform-2.9.0-natives-linux.jar
23:27:06.896 [DEBUG] [org.gradle.api.internal.artifacts.ivyservice.ivyresolve.CachingModuleVersionRepository] Found artifact 'org.lwjgl.lwjgl:lwjgl-platform:2.9.0:lwjgl-platform-natives-osx.jar' in resolver cache: C:\Users\Davey\.gradle\caches\modules-2\files-2.1\org.lwjgl.lwjgl\lwjgl-platform\2.9.0\6621b382cb14cc409b041d8d72829156a87c31aa\lwjgl-platform-2.9.0-natives-osx.jar
23:27:06.928 [iNFO] [org.gradle.api.internal.tasks.execution.SkipUpToDateTaskExecuter] Skipping task ':compileJava' as it is up-to-date (took 5.211 secs).
23:27:06.928 [DEBUG] [org.gradle.api.internal.tasks.execution.ExecuteAtMostOnceTaskExecuter] Finished executing task ':compileJava'
23:27:06.943 [LIFECYCLE] [class org.gradle.TaskExecutionLogger] :compileJava UP-TO-DATE
23:27:06.943 [iNFO] [org.gradle.execution.taskgraph.AbstractTaskPlanExecutor] :compileJava (Thread[main,5,main]) completed. Took 5.257 secs.
23:27:06.959 [iNFO] [org.gradle.execution.taskgraph.AbstractTaskPlanExecutor] :processResources (Thread[main,5,main]) started.
23:27:06.959 [LIFECYCLE] [class org.gradle.TaskExecutionLogger] :processResources
23:27:06.959 [DEBUG] [org.gradle.api.internal.tasks.execution.ExecuteAtMostOnceTaskExecuter] Starting to execute task ':processResources'
23:27:06.974 [DEBUG] [org.gradle.api.internal.tasks.execution.SkipUpToDateTaskExecuter] Determining if task ':processResources' is up-to-date
23:27:07.006 [iNFO] [org.gradle.api.internal.tasks.execution.SkipUpToDateTaskExecuter] Executing task ':processResources' (up-to-date check took 0.016 secs) due to:
  Output file C:\Users\Davey\Desktop\Minecraft modding 2\build\resources\main\mcmod.info has changed.
23:27:07.006 [DEBUG] [org.gradle.api.internal.tasks.execution.ExecuteActionsTaskExecuter] Executing actions for task ':processResources'.
23:27:07.318 [DEBUG] [org.gradle.api.internal.tasks.execution.ExecuteAtMostOnceTaskExecuter] Finished executing task ':processResources'
23:27:07.318 [LIFECYCLE] [class org.gradle.TaskExecutionLogger] :processResources FAILED
23:27:07.333 [iNFO] [org.gradle.execution.taskgraph.AbstractTaskPlanExecutor] :processResources (Thread[main,5,main]) completed. Took 0.374 secs.
23:27:07.333 [DEBUG] [org.gradle.execution.taskgraph.AbstractTaskPlanExecutor] Task worker [Thread[main,5,main]] finished, busy: 5.974 secs, idle: 0.079 secs
23:27:07.349 [ERROR] [org.gradle.BuildExceptionReporter] 
23:27:07.364 [ERROR] [org.gradle.BuildExceptionReporter] FAILURE: Build failed with an exception.
23:27:07.364 [ERROR] [org.gradle.BuildExceptionReporter] 
23:27:07.380 [ERROR] [org.gradle.BuildExceptionReporter] * What went wrong:
23:27:07.380 [ERROR] [org.gradle.BuildExceptionReporter] Execution failed for task ':processResources'.
23:27:07.396 [ERROR] [org.gradle.BuildExceptionReporter] > Could not copy file 'C:\Users\Davey\Desktop\Minecraft modding 2\src\main\resources\mcmod.info' to 'C:\Users\Davey\Desktop\Minecraft modding 2\build\resources\main\mcmod.info'.
23:27:07.442 [ERROR] [org.gradle.BuildExceptionReporter] 
23:27:07.442 [ERROR] [org.gradle.BuildExceptionReporter] * Exception is:
23:27:07.442 [ERROR] [org.gradle.BuildExceptionReporter] org.gradle.api.tasks.TaskExecutionException: Execution failed for task ':processResources'.
23:27:07.458 [ERROR] [org.gradle.BuildExceptionReporter] 	at org.gradle.api.internal.tasks.execution.ExecuteActionsTaskExecuter.executeActions(ExecuteActionsTaskExecuter.java:69)
23:27:07.458 [ERROR] [org.gradle.BuildExceptionReporter] 	at org.gradle.api.internal.tasks.execution.ExecuteActionsTaskExecuter.execute(ExecuteActionsTaskExecuter.java:46)
23:27:07.474 [ERROR] [org.gradle.BuildExceptionReporter] 	at org.gradle.api.internal.tasks.execution.PostExecutionAnalysisTaskExecuter.execute(PostExecutionAnalysisTaskExecuter.java:35)
23:27:07.474 [ERROR] [org.gradle.BuildExceptionReporter] 	at org.gradle.api.internal.tasks.execution.SkipUpToDateTaskExecuter.execute(SkipUpToDateTaskExecuter.java:64)
23:27:07.489 [ERROR] [org.gradle.BuildExceptionReporter] 	at org.gradle.api.internal.tasks.execution.ValidatingTaskExecuter.execute(ValidatingTaskExecuter.java:58)
23:27:07.489 [ERROR] [org.gradle.BuildExceptionReporter] 	at org.gradle.api.internal.tasks.execution.SkipEmptySourceFilesTaskExecuter.execute(SkipEmptySourceFilesTaskExecuter.java:42)
23:27:07.505 [ERROR] [org.gradle.BuildExceptionReporter] 	at org.gradle.api.internal.tasks.execution.SkipTaskWithNoActionsExecuter.execute(SkipTaskWithNoActionsExecuter.java:52)
23:27:07.520 [ERROR] [org.gradle.BuildExceptionReporter] 	at org.gradle.api.internal.tasks.execution.SkipOnlyIfTaskExecuter.execute(SkipOnlyIfTaskExecuter.java:53)
23:27:07.520 [ERROR] [org.gradle.BuildExceptionReporter] 	at org.gradle.api.internal.tasks.execution.ExecuteAtMostOnceTaskExecuter.execute(ExecuteAtMostOnceTaskExecuter.java:43)
23:27:07.536 [ERROR] [org.gradle.BuildExceptionReporter] 	at org.gradle.api.internal.AbstractTask.executeWithoutThrowingTaskFailure(AbstractTask.java:289)
23:27:07.536 [ERROR] [org.gradle.BuildExceptionReporter] 	at org.gradle.execution.taskgraph.AbstractTaskPlanExecutor$TaskExecutorWorker.executeTask(AbstractTaskPlanExecutor.java:79)
23:27:07.536 [ERROR] [org.gradle.BuildExceptionReporter] 	at org.gradle.execution.taskgraph.AbstractTaskPlanExecutor$TaskExecutorWorker.processTask(AbstractTaskPlanExecutor.java:63)
23:27:07.552 [ERROR] [org.gradle.BuildExceptionReporter] 	at org.gradle.execution.taskgraph.AbstractTaskPlanExecutor$TaskExecutorWorker.run(AbstractTaskPlanExecutor.java:51)
23:27:07.552 [ERROR] [org.gradle.BuildExceptionReporter] 	at org.gradle.execution.taskgraph.DefaultTaskPlanExecutor.process(DefaultTaskPlanExecutor.java:23)
23:27:07.567 [ERROR] [org.gradle.BuildExceptionReporter] 	at org.gradle.execution.taskgraph.DefaultTaskGraphExecuter.execute(DefaultTaskGraphExecuter.java:86)
23:27:07.567 [ERROR] [org.gradle.BuildExceptionReporter] 	at org.gradle.execution.SelectedTaskExecutionAction.execute(SelectedTaskExecutionAction.java:29)
23:27:07.583 [ERROR] [org.gradle.BuildExceptionReporter] 	at org.gradle.execution.DefaultBuildExecuter.execute(DefaultBuildExecuter.java:61)
23:27:07.583 [ERROR] [org.gradle.BuildExceptionReporter] 	at org.gradle.execution.DefaultBuildExecuter.access$200(DefaultBuildExecuter.java:23)
23:27:07.583 [ERROR] [org.gradle.BuildExceptionReporter] 	at org.gradle.execution.DefaultBuildExecuter$2.proceed(DefaultBuildExecuter.java:67)
23:27:07.598 [ERROR] [org.gradle.BuildExceptionReporter] 	at org.gradle.execution.DryRunBuildExecutionAction.execute(DryRunBuildExecutionAction.java:32)
23:27:07.598 [ERROR] [org.gradle.BuildExceptionReporter] 	at org.gradle.execution.DefaultBuildExecuter.execute(DefaultBuildExecuter.java:61)
23:27:07.614 [ERROR] [org.gradle.BuildExceptionReporter] 	at org.gradle.execution.DefaultBuildExecuter.execute(DefaultBuildExecuter.java:54)
23:27:07.614 [ERROR] [org.gradle.BuildExceptionReporter] 	at org.gradle.initialization.DefaultGradleLauncher.doBuildStages(DefaultGradleLauncher.java:166)
23:27:07.614 [ERROR] [org.gradle.BuildExceptionReporter] 	at org.gradle.initialization.DefaultGradleLauncher.doBuild(DefaultGradleLauncher.java:113)
23:27:07.630 [ERROR] [org.gradle.BuildExceptionReporter] 	at org.gradle.initialization.DefaultGradleLauncher.run(DefaultGradleLauncher.java:81)
23:27:07.630 [ERROR] [org.gradle.BuildExceptionReporter] 	at org.gradle.launcher.exec.InProcessBuildActionExecuter$DefaultBuildController.run(InProcessBuildActionExecuter.java:64)
23:27:07.630 [ERROR] [org.gradle.BuildExceptionReporter] 	at org.gradle.launcher.cli.ExecuteBuildAction.run(ExecuteBuildAction.java:33)
23:27:07.645 [ERROR] [org.gradle.BuildExceptionReporter] 	at org.gradle.launcher.cli.ExecuteBuildAction.run(ExecuteBuildAction.java:24)
23:27:07.645 [ERROR] [org.gradle.BuildExceptionReporter] 	at org.gradle.launcher.exec.InProcessBuildActionExecuter.execute(InProcessBuildActionExecuter.java:35)
23:27:07.661 [ERROR] [org.gradle.BuildExceptionReporter] 	at org.gradle.launcher.exec.InProcessBuildActionExecuter.execute(InProcessBuildActionExecuter.java:26)
23:27:07.661 [ERROR] [org.gradle.BuildExceptionReporter] 	at org.gradle.launcher.cli.RunBuildAction.run(RunBuildAction.java:50)
23:27:07.661 [ERROR] [org.gradle.BuildExceptionReporter] 	at org.gradle.internal.Actions$RunnableActionAdapter.execute(Actions.java:171)
23:27:07.676 [ERROR] [org.gradle.BuildExceptionReporter] 	at org.gradle.launcher.cli.CommandLineActionFactory$ParseAndBuildAction.execute(CommandLineActionFactory.java:201)
23:27:07.676 [ERROR] [org.gradle.BuildExceptionReporter] 	at org.gradle.launcher.cli.CommandLineActionFactory$ParseAndBuildAction.execute(CommandLineActionFactory.java:174)
23:27:07.676 [ERROR] [org.gradle.BuildExceptionReporter] 	at org.gradle.launcher.cli.CommandLineActionFactory$WithLogging.execute(CommandLineActionFactory.java:170)
23:27:07.692 [ERROR] [org.gradle.BuildExceptionReporter] 	at org.gradle.launcher.cli.CommandLineActionFactory$WithLogging.execute(CommandLineActionFactory.java:139)
23:27:07.692 [ERROR] [org.gradle.BuildExceptionReporter] 	at org.gradle.launcher.cli.ExceptionReportingAction.execute(ExceptionReportingAction.java:33)
23:27:07.708 [ERROR] [org.gradle.BuildExceptionReporter] 	at org.gradle.launcher.cli.ExceptionReportingAction.execute(ExceptionReportingAction.java:22)
23:27:07.708 [ERROR] [org.gradle.BuildExceptionReporter] 	at org.gradle.launcher.Main.doAction(Main.java:46)
23:27:07.708 [ERROR] [org.gradle.BuildExceptionReporter] 	at org.gradle.launcher.bootstrap.EntryPoint.run(EntryPoint.java:45)
23:27:07.723 [ERROR] [org.gradle.BuildExceptionReporter] 	at org.gradle.launcher.Main.main(Main.java:37)
23:27:07.723 [ERROR] [org.gradle.BuildExceptionReporter] 	at org.gradle.launcher.bootstrap.ProcessBootstrap.runNoExit(ProcessBootstrap.java:50)
23:27:07.723 [ERROR] [org.gradle.BuildExceptionReporter] 	at org.gradle.launcher.bootstrap.ProcessBootstrap.run(ProcessBootstrap.java:32)
23:27:07.739 [ERROR] [org.gradle.BuildExceptionReporter] 	at org.gradle.launcher.GradleMain.main(GradleMain.java:23)
23:27:07.739 [ERROR] [org.gradle.BuildExceptionReporter] 	at org.gradle.wrapper.BootstrapMainStarter.start(BootstrapMainStarter.java:30)
23:27:07.739 [ERROR] [org.gradle.BuildExceptionReporter] 	at org.gradle.wrapper.WrapperExecutor.execute(WrapperExecutor.java:127)
23:27:07.754 [ERROR] [org.gradle.BuildExceptionReporter] 	at org.gradle.wrapper.GradleWrapperMain.main(GradleWrapperMain.java:55)
23:27:07.754 [ERROR] [org.gradle.BuildExceptionReporter] Caused by: org.gradle.api.GradleException: Could not copy file 'C:\Users\Davey\Desktop\Minecraft modding 2\src\main\resources\mcmod.info' to 'C:\Users\Davey\Desktop\Minecraft modding 2\build\resources\main\mcmod.info'.
23:27:07.770 [ERROR] [org.gradle.BuildExceptionReporter] 	at org.gradle.api.internal.file.AbstractFileTreeElement.copyTo(AbstractFileTreeElement.java:70)
23:27:07.770 [ERROR] [org.gradle.BuildExceptionReporter] 	at org.gradle.api.internal.file.copy.DefaultFileCopyDetails.copyTo(DefaultFileCopyDetails.java:104)
23:27:07.770 [ERROR] [org.gradle.BuildExceptionReporter] 	at org.gradle.api.internal.file.copy.FileCopyAction$FileCopyDetailsInternalAction.processFile(FileCopyAction.java:44)
23:27:07.786 [ERROR] [org.gradle.BuildExceptionReporter] 	at org.gradle.api.internal.file.copy.NormalizingCopyActionDecorator$1$1.processFile(NormalizingCopyActionDecorator.java:62)
23:27:07.786 [ERROR] [org.gradle.BuildExceptionReporter] 	at org.gradle.api.internal.file.copy.DuplicateHandlingCopyActionDecorator$1$1.processFile(DuplicateHandlingCopyActionDecorator.java:60)
23:27:07.786 [ERROR] [org.gradle.BuildExceptionReporter] 	at org.gradle.api.internal.file.copy.CopyFileVisitorImpl.processFile(CopyFileVisitorImpl.java:60)
23:27:07.801 [ERROR] [org.gradle.BuildExceptionReporter] 	at org.gradle.api.internal.file.copy.CopyFileVisitorImpl.visitFile(CopyFileVisitorImpl.java:44)
23:27:07.801 [ERROR] [org.gradle.BuildExceptionReporter] 	at org.gradle.api.internal.file.collections.DirectoryFileTree.walkDir(DirectoryFileTree.java:154)
23:27:07.817 [ERROR] [org.gradle.BuildExceptionReporter] 	at org.gradle.api.internal.file.collections.DirectoryFileTree.visitFrom(DirectoryFileTree.java:122)
23:27:07.817 [ERROR] [org.gradle.BuildExceptionReporter] 	at org.gradle.api.internal.file.collections.DirectoryFileTree.visit(DirectoryFileTree.java:112)
23:27:07.817 [ERROR] [org.gradle.BuildExceptionReporter] 	at org.gradle.api.internal.file.collections.FileTreeAdapter.visit(FileTreeAdapter.java:96)
23:27:07.832 [ERROR] [org.gradle.BuildExceptionReporter] 	at org.gradle.api.internal.file.CompositeFileTree.visit(CompositeFileTree.java:54)
23:27:07.832 [ERROR] [org.gradle.BuildExceptionReporter] 	at org.gradle.api.internal.file.copy.CopySpecActionImpl.execute(CopySpecActionImpl.java:37)
23:27:07.832 [ERROR] [org.gradle.BuildExceptionReporter] 	at org.gradle.api.internal.file.copy.CopySpecActionImpl.execute(CopySpecActionImpl.java:24)
23:27:07.848 [ERROR] [org.gradle.BuildExceptionReporter] 	at org.gradle.api.internal.file.copy.DefaultCopySpec.walk(DefaultCopySpec.java:453)
23:27:07.848 [ERROR] [org.gradle.BuildExceptionReporter] 	at org.gradle.api.internal.file.copy.DefaultCopySpec.walk(DefaultCopySpec.java:455)
23:27:07.848 [ERROR] [org.gradle.BuildExceptionReporter] 	at org.gradle.api.internal.file.copy.DelegatingCopySpecInternal.walk(DelegatingCopySpecInternal.java:225)
23:27:07.864 [ERROR] [org.gradle.BuildExceptionReporter] 	at org.gradle.api.internal.file.copy.CopySpecBackedCopyActionProcessingStream.process(CopySpecBackedCopyActionProcessingStream.java:36)
23:27:07.864 [ERROR] [org.gradle.BuildExceptionReporter] 	at org.gradle.api.internal.file.copy.DuplicateHandlingCopyActionDecorator$1.process(DuplicateHandlingCopyActionDecorator.java:44)
23:27:07.879 [ERROR] [org.gradle.BuildExceptionReporter] 	at org.gradle.api.internal.file.copy.NormalizingCopyActionDecorator$1.process(NormalizingCopyActionDecorator.java:53)
23:27:07.879 [ERROR] [org.gradle.BuildExceptionReporter] 	at org.gradle.api.internal.file.copy.FileCopyAction.execute(FileCopyAction.java:35)
23:27:07.879 [ERROR] [org.gradle.BuildExceptionReporter] 	at org.gradle.api.internal.file.copy.NormalizingCopyActionDecorator.execute(NormalizingCopyActionDecorator.java:49)
23:27:07.895 [ERROR] [org.gradle.BuildExceptionReporter] 	at org.gradle.api.internal.file.copy.DuplicateHandlingCopyActionDecorator.execute(DuplicateHandlingCopyActionDecorator.java:42)
23:27:07.895 [ERROR] [org.gradle.BuildExceptionReporter] 	at org.gradle.api.internal.file.copy.CopyActionExecuter.execute(CopyActionExecuter.java:38)
23:27:07.895 [ERROR] [org.gradle.BuildExceptionReporter] 	at org.gradle.api.tasks.AbstractCopyTask.copy(AbstractCopyTask.java:65)
23:27:07.910 [ERROR] [org.gradle.BuildExceptionReporter] 	at org.gradle.language.jvm.tasks.ProcessResources.copy(ProcessResources.java:33)
23:27:07.910 [ERROR] [org.gradle.BuildExceptionReporter] 	at org.gradle.internal.reflect.JavaMethod.invoke(JavaMethod.java:63)
23:27:07.910 [ERROR] [org.gradle.BuildExceptionReporter] 	at org.gradle.api.internal.project.taskfactory.AnnotationProcessingTaskFactory$StandardTaskAction.doExecute(AnnotationProcessingTaskFactory.java:219)
23:27:07.926 [ERROR] [org.gradle.BuildExceptionReporter] 	at org.gradle.api.internal.project.taskfactory.AnnotationProcessingTaskFactory$StandardTaskAction.execute(AnnotationProcessingTaskFactory.java:212)
23:27:07.926 [ERROR] [org.gradle.BuildExceptionReporter] 	at org.gradle.api.internal.project.taskfactory.AnnotationProcessingTaskFactory$StandardTaskAction.execute(AnnotationProcessingTaskFactory.java:201)
23:27:07.942 [ERROR] [org.gradle.BuildExceptionReporter] 	at org.gradle.api.internal.AbstractTask$TaskActionWrapper.execute(AbstractTask.java:533)
23:27:07.942 [ERROR] [org.gradle.BuildExceptionReporter] 	at org.gradle.api.internal.AbstractTask$TaskActionWrapper.execute(AbstractTask.java:516)
23:27:07.942 [ERROR] [org.gradle.BuildExceptionReporter] 	at org.gradle.api.internal.tasks.execution.ExecuteActionsTaskExecuter.executeAction(ExecuteActionsTaskExecuter.java:80)
23:27:07.957 [ERROR] [org.gradle.BuildExceptionReporter] 	at org.gradle.api.internal.tasks.execution.ExecuteActionsTaskExecuter.executeActions(ExecuteActionsTaskExecuter.java:61)
23:27:07.957 [ERROR] [org.gradle.BuildExceptionReporter] 	... 46 more
23:27:07.957 [ERROR] [org.gradle.BuildExceptionReporter] Caused by: groovy.lang.GroovyRuntimeException: Failed to parse template script (your template may contain an error or be trying to use expressions not currently supported): startup failed:
23:27:07.973 [ERROR] [org.gradle.BuildExceptionReporter] SimpleTemplateScript1.groovy: 6: unexpected token: 2 @ line 6, column 30.
23:27:07.973 [ERROR] [org.gradle.BuildExceptionReporter]      \"version\": \"${Alpha 0.0.2}\",
23:27:07.988 [ERROR] [org.gradle.BuildExceptionReporter]                                 ^
23:27:07.988 [ERROR] [org.gradle.BuildExceptionReporter] 
23:27:07.988 [ERROR] [org.gradle.BuildExceptionReporter] 1 error
23:27:08.004 [ERROR] [org.gradle.BuildExceptionReporter] 
23:27:08.004 [ERROR] [org.gradle.BuildExceptionReporter] 	at org.gradle.api.internal.file.copy.FilterChain$3.transform(FilterChain.java:90)
23:27:08.004 [ERROR] [org.gradle.BuildExceptionReporter] 	at org.gradle.api.internal.file.copy.FilterChain$3.transform(FilterChain.java:84)
23:27:08.020 [ERROR] [org.gradle.BuildExceptionReporter] 	at org.gradle.api.internal.ChainingTransformer.transform(ChainingTransformer.java:37)
23:27:08.020 [ERROR] [org.gradle.BuildExceptionReporter] 	at org.gradle.api.internal.file.copy.FilterChain.transform(FilterChain.java:39)
23:27:08.020 [ERROR] [org.gradle.BuildExceptionReporter] 	at org.gradle.api.internal.file.copy.FilterChain.transform(FilterChain.java:46)
23:27:08.082 [ERROR] [org.gradle.BuildExceptionReporter] 	at org.gradle.api.internal.file.copy.DefaultFileCopyDetails.open(DefaultFileCopyDetails.java:88)
23:27:08.082 [ERROR] [org.gradle.BuildExceptionReporter] 	at org.gradle.api.internal.file.AbstractFileTreeElement.copyTo(AbstractFileTreeElement.java:47)
23:27:08.082 [ERROR] [org.gradle.BuildExceptionReporter] 	at org.gradle.api.internal.file.copy.DefaultFileCopyDetails.copyTo(DefaultFileCopyDetails.java:96)
23:27:08.098 [ERROR] [org.gradle.BuildExceptionReporter] 	at org.gradle.api.internal.file.AbstractFileTreeElement.copyFile(AbstractFileTreeElement.java:88)
23:27:08.098 [ERROR] [org.gradle.BuildExceptionReporter] 	at org.gradle.api.internal.file.AbstractFileTreeElement.copyTo(AbstractFileTreeElement.java:65)
23:27:08.113 [ERROR] [org.gradle.BuildExceptionReporter] 	... 79 more
23:27:08.113 [ERROR] [org.gradle.BuildExceptionReporter] 
23:27:08.113 [LIFECYCLE] [org.gradle.BuildResultLogger] 
23:27:08.129 [LIFECYCLE] [org.gradle.BuildResultLogger] BUILD FAILED
23:27:08.129 [LIFECYCLE] [org.gradle.BuildResultLogger] 
23:27:08.129 [LIFECYCLE] [org.gradle.BuildResultLogger] Total time: 29.856 secs
23:27:08.144 [DEBUG] [org.gradle.api.internal.tasks.compile.daemon.CompilerDaemonManager] Stopping 0 compiler daemon(s).
23:27:08.144 [iNFO] [org.gradle.api.internal.tasks.compile.daemon.CompilerDaemonManager] Stopped 0 compiler daemon(s).
23:27:08.160 [DEBUG] [org.gradle.cache.internal.DefaultFileLockManager] Releasing lock on buildscript class cache for build file 'C:\Users\Davey\Desktop\Minecraft modding 2\build.gradle' (C:\Users\Davey\.gradle\caches\1.11\scripts\build_k02ifruf2g3ohpm1j39aknlat\ProjectScript\buildscript).
23:27:08.160 [DEBUG] [org.gradle.cache.internal.DefaultFileLockManager] Releasing lock on no_buildscript class cache for build file 'C:\Users\Davey\Desktop\Minecraft modding 2\build.gradle' (C:\Users\Davey\.gradle\caches\1.11\scripts\build_k02ifruf2g3ohpm1j39aknlat\ProjectScript\no_buildscript).
23:27:08.176 [DEBUG] [org.gradle.cache.internal.btree.BTreePersistentIndexedCache] Closing cache module-metadata.bin (C:\Users\Davey\.gradle\caches\modules-2\metadata-2.2\module-metadata.bin)
23:27:08.191 [DEBUG] [org.gradle.cache.internal.btree.BTreePersistentIndexedCache] Closing cache artifact-at-repository.bin (C:\Users\Davey\.gradle\caches\modules-2\metadata-2.2\artifact-at-repository.bin)
23:27:08.191 [DEBUG] [org.gradle.cache.internal.btree.BTreePersistentIndexedCache] Closing cache artifact-at-url.bin (C:\Users\Davey\.gradle\caches\modules-2\metadata-2.2\artifact-at-url.bin)
23:27:08.207 [DEBUG] [org.gradle.cache.internal.btree.BTreePersistentIndexedCache] Closing cache dynamic-revisions.bin (C:\Users\Davey\.gradle\caches\modules-2\metadata-2.2\dynamic-revisions.bin)
23:27:08.222 [DEBUG] [org.gradle.cache.internal.DefaultFileLockManager] Releasing lock on artifact cache (C:\Users\Davey\.gradle\caches\modules-2).
23:27:08.222 [DEBUG] [org.gradle.cache.internal.btree.BTreePersistentIndexedCache] Closing cache fileSnapshots.bin (C:\Users\Davey\Desktop\Minecraft modding 2\.gradle\1.11\taskArtifacts\fileSnapshots.bin)
23:27:08.238 [DEBUG] [org.gradle.cache.internal.btree.BTreePersistentIndexedCache] Closing cache fileHashes.bin (C:\Users\Davey\Desktop\Minecraft modding 2\.gradle\1.11\taskArtifacts\fileHashes.bin)
23:27:08.254 [DEBUG] [org.gradle.cache.internal.btree.BTreePersistentIndexedCache] Closing cache outputFileStates.bin (C:\Users\Davey\Desktop\Minecraft modding 2\.gradle\1.11\taskArtifacts\outputFileStates.bin)
23:27:08.254 [DEBUG] [org.gradle.cache.internal.btree.BTreePersistentIndexedCache] Closing cache taskArtifacts.bin (C:\Users\Davey\Desktop\Minecraft modding 2\.gradle\1.11\taskArtifacts\taskArtifacts.bin)
23:27:08.269 [DEBUG] [org.gradle.cache.internal.DefaultFileLockManager] Releasing lock on task history cache (C:\Users\Davey\Desktop\Minecraft modding 2\.gradle\1.11\taskArtifacts).
23:27:08.285 [DEBUG] [org.gradle.api.internal.artifacts.ivyservice.resolveengine.store.CachedStoreFactory] Resolution result cache closed. Cache reads: 0, disk reads: 0 (avg: 0.0 secs, total: 0.0 secs)
23:27:08.285 [DEBUG] [org.gradle.api.internal.artifacts.ivyservice.resolveengine.store.CachedStoreFactory] Resolved configuration cache closed. Cache reads: 0, disk reads: 0 (avg: 0.0 secs, total: 0.0 secs)
23:27:08.300 [DEBUG] [org.gradle.api.internal.artifacts.ivyservice.resolveengine.store.ResolutionResultsStoreFactory] Deleted 2 resolution results binary files in 0.015 secs
23:27:08.300 [DEBUG] [org.gradle.api.internal.artifacts.ivyservice.ivyresolve.memcache.InMemoryDependencyMetadataCache] In-memory dependency metadata cache closed. Repos cached: 13, cache instances: 5, modules served from cache: 8, artifacts: 5

 

Gradlew.bat --info:

****************************
Powered By MCP:            
http://mcp.ocean-labs.de/  
Searge, ProfMobius, Fesh0r,
R4wk, ZeuX, IngisKahn      
Resolving:  MCP Data version : {MCP_VERSION}
Resolved:   MCP Data version : unknown
MCP Data version : unknown
****************************
Resolving: net.minecraftforge:{API_NAME}:{API_VERSION}
Resolved:  net.minecraftforge:forge:1.7.2-10.12.1.1060
Resolving: {USER_DEV}/dev.json
Resolved:  C:/Users/Davey/.gradle/caches/minecraft/net/minecraftforge/forge/1.7.2-10.12.1.1060/unpacked/dev.json
Resolving: {USER_DEV}/dev.json
Resolved:  C:/Users/Davey/.gradle/caches/minecraft/net/minecraftforge/forge/1.7.2-10.12.1.1060/unpacked/dev.json
ADDING NATIVE: C:\Users\Davey\.gradle\caches\modules-2\files-2.1\org.lwjgl.lwjgl\lwjgl-platform\2.9.0\3f11873dc8e84c854ec7c5a8fd2e869f8aaef764\lwjgl-platform-2.9.0-natives-windows.jar
ADDING NATIVE: C:\Users\Davey\.gradle\caches\modules-2\files-2.1\net.java.jinput\jinput-platform\2.0.5\385ee093e01f587f30ee1c8a2ee7d408fd732e16\jinput-platform-2.0.5-natives-windows.jar
Failed to get resource: GET. [HTTP HTTP/1.1 403 Forbidden: https://libraries.minecraft.net/net/minecraftforge/forge/1.7.2-10.12.1.1060/forge-1.7.2-10.12.1.1060.pom]
Resolving: {BUILD_DIR}/tmp/recompCls
Resolved:  C:/Users/Davey/Desktop/Minecraft modding 2/build/tmp/recompCls
Resolving: {API_CACHE_DIR}/forgeSrc-{API_VERSION}.jar
Resolved:  C:/Users/Davey/.gradle/caches/minecraft/net/minecraftforge/forge/1.7.2-10.12.1.1060/forgeSrc-1.7.2-10.12.1.1060.jar
Resolving: {BUILD_DIR}/natives
Resolved:  C:/Users/Davey/Desktop/Minecraft modding 2/build/natives
Resolving: {BUILD_DIR}/natives
Resolved:  C:/Users/Davey/Desktop/Minecraft modding 2/build/natives
Resolving: {API_CACHE_DIR}/this-{API_VERSION}-doesnt.matter
Resolved:  C:/Users/Davey/.gradle/caches/minecraft/net/minecraftforge/forge/1.7.2-10.12.1.1060/this-1.7.2-10.12.1.1060-doesnt.matter
Adding repo to : >> C:\Users\Davey\.gradle\caches\minecraft\net\minecraftforge\forge\1.7.2-10.12.1.1060
Resolving: {API_CACHE_DIR}/forgeSrc-{API_VERSION}-sources.jar
Resolved:  C:/Users/Davey/.gradle/caches/minecraft/net/minecraftforge/forge/1.7.2-10.12.1.1060/forgeSrc-1.7.2-10.12.1.1060-sources.jar
Resolving: {CACHE_DIR}/minecraft/assets/indexes/legacy.json
Resolved:  C:/Users/Davey/.gradle/caches/minecraft/assets/indexes/legacy.json
Resolving: {CACHE_DIR}/minecraft/assets/indexes/{ASSET_INDEX}.json
Resolved:  C:/Users/Davey/.gradle/caches/minecraft/assets/indexes/legacy.json
All projects evaluated.
Resolving: {SRG_DIR}/srg.exc
Resolved:  C:/Users/Davey/.gradle/caches/minecraft/net/minecraftforge/forge/1.7.2-10.12.1.1060/srgs/srg.exc
Resolving: {SRG_DIR}/mcp-srg.srg
Resolved:  C:/Users/Davey/.gradle/caches/minecraft/net/minecraftforge/forge/1.7.2-10.12.1.1060/srgs/mcp-srg.srg
Resolving: {USER_DEV}/conf/methods.csv
Resolved:  C:/Users/Davey/.gradle/caches/minecraft/net/minecraftforge/forge/1.7.2-10.12.1.1060/unpacked/conf/methods.csv
Resolving: {API_CACHE_DIR}/{API_NAME}-{API_VERSION}-srg.jar
Resolved:  C:/Users/Davey/.gradle/caches/minecraft/net/minecraftforge/forge/1.7.2-10.12.1.1060/forge-1.7.2-10.12.1.1060-srg.jar
Resolving: {API_CACHE_DIR}/forgeSrc-{API_VERSION}.jar
Resolved:  C:/Users/Davey/.gradle/caches/minecraft/net/minecraftforge/forge/1.7.2-10.12.1.1060/forgeSrc-1.7.2-10.12.1.1060.jar
Resolving: {USER_DEV}/conf/packaged.srg
Resolved:  C:/Users/Davey/.gradle/caches/minecraft/net/minecraftforge/forge/1.7.2-10.12.1.1060/unpacked/conf/packaged.srg
Resolving: {USER_DEV}/conf/packaged.exc
Resolved:  C:/Users/Davey/.gradle/caches/minecraft/net/minecraftforge/forge/1.7.2-10.12.1.1060/unpacked/conf/packaged.exc
Resolving: {USER_DEV}/conf/methods.csv
Resolved:  C:/Users/Davey/.gradle/caches/minecraft/net/minecraftforge/forge/1.7.2-10.12.1.1060/unpacked/conf/methods.csv
Resolving: {USER_DEV}/conf/fields.csv
Resolved:  C:/Users/Davey/.gradle/caches/minecraft/net/minecraftforge/forge/1.7.2-10.12.1.1060/unpacked/conf/fields.csv
Resolving: C:\Users\Davey\.gradle\caches\modules-2\files-2.1\net.minecraftforge\forge\1.7.2-10.12.1.1060\c02a642fd017fedcb0cbffc6cdc94cff146c5677\forge-1.7.2-10.12.1.1060-userdev.jar
Resolved:  C:\Users\Davey\.gradle\caches\modules-2\files-2.1\net.minecraftforge\forge\1.7.2-10.12.1.1060\c02a642fd017fedcb0cbffc6cdc94cff146c5677\forge-1.7.2-10.12.1.1060-userdev.jar
Resolving: {BUILD_DIR}/sources/java
Resolved:  C:/Users/Davey/Desktop/Minecraft modding 2/build/sources/java
Selected primary task 'build'
Tasks to be executed: [task ':compileApiJava', task ':processApiResources', task ':apiClasses', task ':sourceMainJava', task ':compileJava', task ':processResources', task ':classes', task ':jar', task ':compileTestJava', task ':processTestResources', task ':testClasses', task ':test', task ':extractUserDev', task ':genSrgs', task ':reobf', task ':assemble', task ':check', task ':build']
:compileApiJava (Thread[main,5,main]) started.
:compileApiJava
Skipping task ':compileApiJava' as it has no source files.
:compileApiJava UP-TO-DATE
:compileApiJava (Thread[main,5,main]) completed. Took 0.018 secs.
:processApiResources (Thread[main,5,main]) started.
:processApiResources
Skipping task ':processApiResources' as it has no source files.
:processApiResources UP-TO-DATE
:processApiResources (Thread[main,5,main]) completed. Took 0.021 secs.
:apiClasses (Thread[main,5,main]) started.
:apiClasses
Skipping task ':apiClasses' as it has no actions.
:apiClasses UP-TO-DATE
:apiClasses (Thread[main,5,main]) completed. Took 0.014 secs.
:sourceMainJava (Thread[main,5,main]) started.
:sourceMainJava
Skipping task ':sourceMainJava' as it is up-to-date (took 0.051 secs).
:sourceMainJava UP-TO-DATE
:sourceMainJava (Thread[main,5,main]) completed. Took 0.065 secs.
:compileJava (Thread[main,5,main]) started.
:compileJava
Failed to get resource: GET. [HTTP HTTP/1.1 403 Forbidden: https://libraries.minecraft.net//forgeSrc/1.7.2-10.12.1.1060/forgeSrc-1.7.2-10.12.1.1060.pom]
file or directory 'C:\Users\Davey\Desktop\Minecraft modding 2\libs', not found
Skipping task ':compileJava' as it is up-to-date (took 0.504 secs).
:compileJava UP-TO-DATE
:compileJava (Thread[main,5,main]) completed. Took 0.523 secs.
:processResources (Thread[main,5,main]) started.
:processResources
Executing task ':processResources' (up-to-date check took 0.018 secs) due to:
  Output file C:\Users\Davey\Desktop\Minecraft modding 2\build\resources\main\mcmod.info has changed.
:processResources FAILED
:processResources (Thread[main,5,main]) completed. Took 0.303 secs.

FAILURE: Build failed with an exception.

* What went wrong:
Execution failed for task ':processResources'.
> Could not copy file 'C:\Users\Davey\Desktop\Minecraft modding 2\src\main\resources\mcmod.info' to 'C:\Users\Davey\Desktop\Minecraft modding 2\build\resources\main\mcmod.info'.

* Try:
Run with --stacktrace option to get the stack trace. Run with --debug option to get more log output.

BUILD FAILED

Total time: 11.021 secs
Stopped 0 compiler daemon(s).

 

Gradlew.bat --stacktrace:

****************************
Powered By MCP:            
http://mcp.ocean-labs.de/  
Searge, ProfMobius, Fesh0r,
R4wk, ZeuX, IngisKahn      
MCP Data version : unknown
****************************
:compileApiJava UP-TO-DATE
:processApiResources UP-TO-DATE
:apiClasses UP-TO-DATE
:sourceMainJava UP-TO-DATE
:compileJava UP-TO-DATE
:processResources FAILED

FAILURE: Build failed with an exception.

* What went wrong:
Execution failed for task ':processResources'.
> Could not copy file 'C:\Users\Davey\Desktop\Minecraft modding 2\src\main\resources\mcmod.info' to 'C:\Users\Davey\Desktop\Minecraft modding 2\build\resources\main\mcmod.info'.

* Try:
Run with --info or --debug option to get more log output.

* Exception is:
org.gradle.api.tasks.TaskExecutionException: Execution failed for task ':processResources'.
at org.gradle.api.internal.tasks.execution.ExecuteActionsTaskExecuter.executeActions(ExecuteActionsTaskExecuter.java:69)
at org.gradle.api.internal.tasks.execution.ExecuteActionsTaskExecuter.execute(ExecuteActionsTaskExecuter.java:46)
at org.gradle.api.internal.tasks.execution.PostExecutionAnalysisTaskExecuter.execute(PostExecutionAnalysisTaskExecuter.java:35)
at org.gradle.api.internal.tasks.execution.SkipUpToDateTaskExecuter.execute(SkipUpToDateTaskExecuter.java:64)
at org.gradle.api.internal.tasks.execution.ValidatingTaskExecuter.execute(ValidatingTaskExecuter.java:58)
at org.gradle.api.internal.tasks.execution.SkipEmptySourceFilesTaskExecuter.execute(SkipEmptySourceFilesTaskExecuter.java:42)
at org.gradle.api.internal.tasks.execution.SkipTaskWithNoActionsExecuter.execute(SkipTaskWithNoActionsExecuter.java:52)
at org.gradle.api.internal.tasks.execution.SkipOnlyIfTaskExecuter.execute(SkipOnlyIfTaskExecuter.java:53)
at org.gradle.api.internal.tasks.execution.ExecuteAtMostOnceTaskExecuter.execute(ExecuteAtMostOnceTaskExecuter.java:43)
at org.gradle.api.internal.AbstractTask.executeWithoutThrowingTaskFailure(AbstractTask.java:289)
at org.gradle.execution.taskgraph.AbstractTaskPlanExecutor$TaskExecutorWorker.executeTask(AbstractTaskPlanExecutor.java:79)
at org.gradle.execution.taskgraph.AbstractTaskPlanExecutor$TaskExecutorWorker.processTask(AbstractTaskPlanExecutor.java:63)
at org.gradle.execution.taskgraph.AbstractTaskPlanExecutor$TaskExecutorWorker.run(AbstractTaskPlanExecutor.java:51)
at org.gradle.execution.taskgraph.DefaultTaskPlanExecutor.process(DefaultTaskPlanExecutor.java:23)
at org.gradle.execution.taskgraph.DefaultTaskGraphExecuter.execute(DefaultTaskGraphExecuter.java:86)
at org.gradle.execution.SelectedTaskExecutionAction.execute(SelectedTaskExecutionAction.java:29)
at org.gradle.execution.DefaultBuildExecuter.execute(DefaultBuildExecuter.java:61)
at org.gradle.execution.DefaultBuildExecuter.access$200(DefaultBuildExecuter.java:23)
at org.gradle.execution.DefaultBuildExecuter$2.proceed(DefaultBuildExecuter.java:67)
at org.gradle.execution.DryRunBuildExecutionAction.execute(DryRunBuildExecutionAction.java:32)
at org.gradle.execution.DefaultBuildExecuter.execute(DefaultBuildExecuter.java:61)
at org.gradle.execution.DefaultBuildExecuter.execute(DefaultBuildExecuter.java:54)
at org.gradle.initialization.DefaultGradleLauncher.doBuildStages(DefaultGradleLauncher.java:166)
at org.gradle.initialization.DefaultGradleLauncher.doBuild(DefaultGradleLauncher.java:113)
at org.gradle.initialization.DefaultGradleLauncher.run(DefaultGradleLauncher.java:81)
at org.gradle.launcher.exec.InProcessBuildActionExecuter$DefaultBuildController.run(InProcessBuildActionExecuter.java:64)
at org.gradle.launcher.cli.ExecuteBuildAction.run(ExecuteBuildAction.java:33)
at org.gradle.launcher.cli.ExecuteBuildAction.run(ExecuteBuildAction.java:24)
at org.gradle.launcher.exec.InProcessBuildActionExecuter.execute(InProcessBuildActionExecuter.java:35)
at org.gradle.launcher.exec.InProcessBuildActionExecuter.execute(InProcessBuildActionExecuter.java:26)
at org.gradle.launcher.cli.RunBuildAction.run(RunBuildAction.java:50)
at org.gradle.internal.Actions$RunnableActionAdapter.execute(Actions.java:171)
at org.gradle.launcher.cli.CommandLineActionFactory$ParseAndBuildAction.execute(CommandLineActionFactory.java:201)
at org.gradle.launcher.cli.CommandLineActionFactory$ParseAndBuildAction.execute(CommandLineActionFactory.java:174)
at org.gradle.launcher.cli.CommandLineActionFactory$WithLogging.execute(CommandLineActionFactory.java:170)
at org.gradle.launcher.cli.CommandLineActionFactory$WithLogging.execute(CommandLineActionFactory.java:139)
at org.gradle.launcher.cli.ExceptionReportingAction.execute(ExceptionReportingAction.java:33)
at org.gradle.launcher.cli.ExceptionReportingAction.execute(ExceptionReportingAction.java:22)
at org.gradle.launcher.Main.doAction(Main.java:46)
at org.gradle.launcher.bootstrap.EntryPoint.run(EntryPoint.java:45)
at org.gradle.launcher.Main.main(Main.java:37)
at org.gradle.launcher.bootstrap.ProcessBootstrap.runNoExit(ProcessBootstrap.java:50)
at org.gradle.launcher.bootstrap.ProcessBootstrap.run(ProcessBootstrap.java:32)
at org.gradle.launcher.GradleMain.main(GradleMain.java:23)
at org.gradle.wrapper.BootstrapMainStarter.start(BootstrapMainStarter.java:30)
at org.gradle.wrapper.WrapperExecutor.execute(WrapperExecutor.java:127)
at org.gradle.wrapper.GradleWrapperMain.main(GradleWrapperMain.java:55)
Caused by: org.gradle.api.GradleException: Could not copy file 'C:\Users\Davey\Desktop\Minecraft modding 2\src\main\resources\mcmod.info' to 'C:\Users\Davey\Desktop\Minecraft modding 2\build\resources\main\mcmod.info'.
at org.gradle.api.internal.file.AbstractFileTreeElement.copyTo(AbstractFileTreeElement.java:70)
at org.gradle.api.internal.file.copy.DefaultFileCopyDetails.copyTo(DefaultFileCopyDetails.java:104)
at org.gradle.api.internal.file.copy.FileCopyAction$FileCopyDetailsInternalAction.processFile(FileCopyAction.java:44)
at org.gradle.api.internal.file.copy.NormalizingCopyActionDecorator$1$1.processFile(NormalizingCopyActionDecorator.java:62)
at org.gradle.api.internal.file.copy.DuplicateHandlingCopyActionDecorator$1$1.processFile(DuplicateHandlingCopyActionDecorator.java:60)
at org.gradle.api.internal.file.copy.CopyFileVisitorImpl.processFile(CopyFileVisitorImpl.java:60)
at org.gradle.api.internal.file.copy.CopyFileVisitorImpl.visitFile(CopyFileVisitorImpl.java:44)
at org.gradle.api.internal.file.collections.DirectoryFileTree.walkDir(DirectoryFileTree.java:154)
at org.gradle.api.internal.file.collections.DirectoryFileTree.visitFrom(DirectoryFileTree.java:122)
at org.gradle.api.internal.file.collections.DirectoryFileTree.visit(DirectoryFileTree.java:112)
at org.gradle.api.internal.file.collections.FileTreeAdapter.visit(FileTreeAdapter.java:96)
at org.gradle.api.internal.file.CompositeFileTree.visit(CompositeFileTree.java:54)
at org.gradle.api.internal.file.copy.CopySpecActionImpl.execute(CopySpecActionImpl.java:37)
at org.gradle.api.internal.file.copy.CopySpecActionImpl.execute(CopySpecActionImpl.java:24)
at org.gradle.api.internal.file.copy.DefaultCopySpec.walk(DefaultCopySpec.java:453)
at org.gradle.api.internal.file.copy.DefaultCopySpec.walk(DefaultCopySpec.java:455)
at org.gradle.api.internal.file.copy.DelegatingCopySpecInternal.walk(DelegatingCopySpecInternal.java:225)
at org.gradle.api.internal.file.copy.CopySpecBackedCopyActionProcessingStream.process(CopySpecBackedCopyActionProcessingStream.java:36)
at org.gradle.api.internal.file.copy.DuplicateHandlingCopyActionDecorator$1.process(DuplicateHandlingCopyActionDecorator.java:44)
at org.gradle.api.internal.file.copy.NormalizingCopyActionDecorator$1.process(NormalizingCopyActionDecorator.java:53)
at org.gradle.api.internal.file.copy.FileCopyAction.execute(FileCopyAction.java:35)
at org.gradle.api.internal.file.copy.NormalizingCopyActionDecorator.execute(NormalizingCopyActionDecorator.java:49)
at org.gradle.api.internal.file.copy.DuplicateHandlingCopyActionDecorator.execute(DuplicateHandlingCopyActionDecorator.java:42)
at org.gradle.api.internal.file.copy.CopyActionExecuter.execute(CopyActionExecuter.java:38)
at org.gradle.api.tasks.AbstractCopyTask.copy(AbstractCopyTask.java:65)
at org.gradle.language.jvm.tasks.ProcessResources.copy(ProcessResources.java:33)
at org.gradle.internal.reflect.JavaMethod.invoke(JavaMethod.java:63)
at org.gradle.api.internal.project.taskfactory.AnnotationProcessingTaskFactory$StandardTaskAction.doExecute(AnnotationProcessingTaskFactory.java:219)
at org.gradle.api.internal.project.taskfactory.AnnotationProcessingTaskFactory$StandardTaskAction.execute(AnnotationProcessingTaskFactory.java:212)
at org.gradle.api.internal.project.taskfactory.AnnotationProcessingTaskFactory$StandardTaskAction.execute(AnnotationProcessingTaskFactory.java:201)
at org.gradle.api.internal.AbstractTask$TaskActionWrapper.execute(AbstractTask.java:533)
at org.gradle.api.internal.AbstractTask$TaskActionWrapper.execute(AbstractTask.java:516)
at org.gradle.api.internal.tasks.execution.ExecuteActionsTaskExecuter.executeAction(ExecuteActionsTaskExecuter.java:80)
at org.gradle.api.internal.tasks.execution.ExecuteActionsTaskExecuter.executeActions(ExecuteActionsTaskExecuter.java:61)
... 46 more
Caused by: groovy.lang.GroovyRuntimeException: Failed to parse template script (your template may contain an error or be trying to use expressions not currently supported): startup failed:
SimpleTemplateScript1.groovy: 6: unexpected token: 2 @ line 6, column 30.
     \"version\": \"${Alpha 0.0.2}\",
                                ^

1 error

at org.gradle.api.internal.file.copy.FilterChain$3.transform(FilterChain.java:90)
at org.gradle.api.internal.file.copy.FilterChain$3.transform(FilterChain.java:84)
at org.gradle.api.internal.ChainingTransformer.transform(ChainingTransformer.java:37)
at org.gradle.api.internal.file.copy.FilterChain.transform(FilterChain.java:39)
at org.gradle.api.internal.file.copy.FilterChain.transform(FilterChain.java:46)
at org.gradle.api.internal.file.copy.DefaultFileCopyDetails.open(DefaultFileCopyDetails.java:88)
at org.gradle.api.internal.file.AbstractFileTreeElement.copyTo(AbstractFileTreeElement.java:47)
at org.gradle.api.internal.file.copy.DefaultFileCopyDetails.copyTo(DefaultFileCopyDetails.java:96)
at org.gradle.api.internal.file.AbstractFileTreeElement.copyFile(AbstractFileTreeElement.java:88)
at org.gradle.api.internal.file.AbstractFileTreeElement.copyTo(AbstractFileTreeElement.java:65)
... 79 more


BUILD FAILED

Total time: 10.655 secs

Link to comment
Share on other sites

 

Caused by: groovy.lang.GroovyRuntimeException: Failed to parse template script (your template may contain an error or be trying to use expressions not currently supported): startup failed:

SimpleTemplateScript1.groovy: 6: unexpected token: 2 @ line 6, column 30.

    \"version\": \"${Alpha 0.0.2}\",

I do Forge for free, however the servers to run it arn't free, so anything is appreciated.
Patreon: http://www.patreon.com/lexmanos
Paypal: http://paypal.me/LexManos

BitCoin: 1Q8rWvUNMM2T1ZfDaFeeYQyVXtYoeT6tTn

Link to comment
Share on other sites

Guest
This topic is now closed to further replies.
 Share




  • Recently Browsing

    No registered users viewing this page.

  • Posts

    • Those three errors are what is making the IRCE return null and kicking them. Not sure what more the debug log will give but at least you know for sure the issue is happening when those three functions try to run. So process of deduction.
    • [Info: 2022-01-23 01:21:36.6133870: Xal.lib(0)] XAL: <<< Xal::Auth::InMemoryXboxTokenCache::GetTokenInternal (000085C2AB6FB370) [Info: 2022-01-23 01:21:36.6159390: Xal.lib(0)] XAL: [op 285139008] Refresh Xtoken running with user: true. [Info: 2022-01-23 01:21:36.6166694: Xal.lib(0)] XAL: [op 285139008] Operation RefreshXtoken is starting [Info: 2022-01-23 01:21:36.6176117: Xal.lib(0)] XAL: [op 285139008]     with CV '9/gCxFwybu+GIYtd.14.95' [Info: 2022-01-23 01:21:36.6179699: Xal.lib(0)] XAL: [op 285139008] RefreshXtoken token fetch started. [Info: 2022-01-23 01:21:36.6560585: NetQueue.cpp(601)] NetQueue: No connection available for https://sentry.io/api/2703928/store/ [Error: 2022-01-23 01:21:36.6562804: SentryAPI.cpp(124)] 0 No network connection available [Info: 2022-01-23 01:21:36.6565318: NetQueue.cpp(601)] NetQueue: No connection available for xsts.auth.xboxlive.com [Error: 2022-01-23 01:21:36.8822268: Xal.lib(0)] XAL: Http request 0C18B300 failed with 0x89235006, system error code 0, message:  [Warning: 2022-01-23 01:21:36.8868846: Xal.lib(0)] XAL: [op 285139008] Operation RefreshXtoken failed with result: 0x89235106 - Network error [Warning: 2022-01-23 01:21:36.8885727: Xal.lib(0)] XAL: [op 295548488] Operation GetXtoken failed with result: 0x89235106 - Network error [Warning: 2022-01-23 01:21:36.8968640: Xal.lib(0)] XAL: [op 258947712] Operation GetTokenAndSignature failed with result: 0x89235106 - Network error [Warning: 2022-01-23 01:21:36.8993100: Xal.lib(0)] XAL: GetTokenAndSignature for presence heartbeat failed with Network error (0x89235106)
    • Did you ever find a resolution?  I know that io.netty.util.IllegalReferenceCountException: refCnt: 0 is used as a way to check/validate functions.  I have yet to understand where there is "0" count. We don't have the issue ever on Val 3 only issue that arrises there is.. lets not go there. Anyway I was curious if you had any info in your research, thanks again!
    • I added it like this main private void doClientStuff(final FMLClientSetupEvent event) { event.enqueueWork(() -> { OverlayRegistry.registerOverlayBelow(ForgeIngameGui.FOOD_LEVEL_ELEMENT , "Mana", new ManaOverlay()); }); } But it's not working.   I feel that you don't understand about main... I'll try to find it.
    • Mc Version: 1.17.1 Forge: 37.1.1 Eclipse: 2021-06 new BlockItem(BlockInit.COMPRESSED_SOULS_BLOCK.get(), new Item(new Item.Properties().tab(CreativeModeTab.TAB_MISC))   When I hover over the line, eclipse says that the constructer BlockItem(Block, Item) is not defined
  • Topics

  • Who's Online (See full list)

×
×
  • Create New...

Important Information

By using this site, you agree to our Privacy Policy.